{
	"JSON": {
		"ID": "1ee5ec1a-e3f7-66be-b5a8-ad82b1e18627",
		"label": "",
		"comment": "UUID6 is used"
	},
    "comment": "this setup is used to measure the calorimeter constant by bringing in a known amount of energy, while measuring the temperature",
	"setup": {
		"1ee5ec0a-1830-63f5-ac3e-6f8ce4468546": {
            "type": "group_info",
			"name": "group_info",
            "comment": ""
        },
		"1ee5ec0d-e77c-68b7-90f7-2e33485ff91c": {
            "type": "instrument",
			"name": "raspberry_pi",
            "comment": ""
        },
        "1ee5ec0c-0b57-68cd-9d39-c9b7e9b18753": {
            "type": "calorimeter",
			"name": "calorimeter",
            "comment": ""
        },
		"1ee21744-0355-6023-94b4-d5c041dd32cd": {
            "type": "actor",
			"name": "immersion_heater",
            "comment": "this heater is used to warm up the water in the calorimeter for measuring the calorimeter constant"
        },
		"1ee5ec00-4a00-68a1-bb1e-873c2dd4dbde": {
            "type": "sensor",
			"name": "temperature_calorimeter_1",
            "comment": ""
        },
		"1ee5ec03-7e64-6071-8ca3-98dbab0a7719": {
            "type": "sensor",
			"name": "temperature_calorimeter_2",
            "comment": ""
        },
		"1ee5ec04-30cd-678f-a64b-0ce7544ef5e8": {
            "type": "sensor",
			"name": "temperature_calorimeter_3",
            "comment": ""
        },
		"1ee5ec04-c845-69e2-853a-25c11543466f": {
            "type": "sensor",
			"name": "temperature_environment",
            "comment": ""
        }
	}
}