{
	"JSON": {
		"ID": "1ee84915-a901-662c-9769-6e2038e634e6",
		"label": "",
		"comment": "UUID6 is used"
	},
	"instrument": {
		"name": "raspberry_pi",
		"type": "single_board_computer",
		"manufacturer": "Raspberry Pi Foundation",
		"model": "xxxxxxxxxxx",
		"serial": "xxxxxxxxxxx",
		"operating_system": "Raspberry Pi OS",
		"comment": "to get model and serial number put this code in the terminal: cat /proc/cpuinfo"
	}
}