{
	"JSON": {
		"ID": "1ee84904-fbc6-633e-83ac-b00cba4bb5c4",
		"label": "",
		"comment": "UUID6 is used"
	},
	"probe": {
		"metadata": "define your own metadata here",
		"info": "think about all necessary things you should write down, that someone else can understand what you were doing"
	}
}