{
	"JSON": {
		"ID": "1ee848fb-f4f8-694c-a9bc-4cac1611defe",
		"label": "",
		"comment": "UUID6 is used"
	},
	"probe": {
		"metadata": "define your own metadata here",
		"info": "think about all necessary things you should write down, that someone else can understand what you were doing"
	}
}