\relax 
\@writefile{toc}{\contentsline {section}{\numberline {1}Versorgungssicherheit}{1}}
\@writefile{toc}{\contentsline {subsection}{\numberline {1.1}Systemindikatoren}{1}}
\@writefile{toc}{\contentsline {section}{\numberline {2}Bewertung}{1}}
\@writefile{toc}{\contentsline {subsection}{\numberline {2.1}Speicherung vs. Abregelung}{1}}
\@writefile{toc}{\contentsline {subsection}{\numberline {2.2}LCA}{1}}
\@writefile{toc}{\contentsline {section}{\numberline {3}Stromversorgung}{2}}
\@writefile{toc}{\contentsline {subsection}{\numberline {3.1}Speicher}{2}}
\@writefile{toc}{\contentsline {subsection}{\numberline {3.2}St\IeC {\"o}rungen}{2}}
\@writefile{toc}{\contentsline {section}{\numberline {4}W\IeC {\"a}rmenetze und Speicher}{3}}
\@writefile{toc}{\contentsline {subsection}{\numberline {4.1}W\IeC {\"a}rmenetze}{3}}
\@writefile{toc}{\contentsline {subsection}{\numberline {4.2}Direkte W\IeC {\"a}rmespeicher}{3}}
\@writefile{toc}{\contentsline {subsection}{\numberline {4.3}Indirekte W\IeC {\"a}rmespeicher}{3}}
\@writefile{toc}{\contentsline {section}{\numberline {5}Gasnetze und Speicher}{4}}
\@writefile{toc}{\contentsline {subsection}{\numberline {5.1}Gasnetze}{4}}
\@writefile{toc}{\contentsline {subsection}{\numberline {5.2}Gasspeicher}{4}}
\@writefile{toc}{\contentsline {section}{\numberline {6}Power-2-X}{5}}
\@writefile{toc}{\contentsline {subsection}{\numberline {6.1}Power-2-Hydrogen}{5}}
\@writefile{toc}{\contentsline {subsection}{\numberline {6.2}Effizienzma\IeC {\ss }}{6}}
