\relax 
\providecommand\hyper@newdestlabel[2]{}
\providecommand*\new@tpo@label[2]{}
\providecommand\HyperFirstAtBeginDocument{\AtBeginDocument}
\HyperFirstAtBeginDocument{\ifx\hyper@anchor\@undefined
\global\let\oldcontentsline\contentsline
\gdef\contentsline#1#2#3#4{\oldcontentsline{#1}{#2}{#3}}
\global\let\oldnewlabel\newlabel
\gdef\newlabel#1#2{\newlabelxx{#1}#2}
\gdef\newlabelxx#1#2#3#4#5#6{\oldnewlabel{#1}{{#2}{#3}}}
\AtEndDocument{\ifx\hyper@anchor\@undefined
\let\contentsline\oldcontentsline
\let\newlabel\oldnewlabel
\fi}
\fi}
\global\let\hyper@last\relax 
\gdef\HyperFirstAtBeginDocument#1{#1}
\providecommand\HyField@AuxAddToFields[1]{}
\providecommand\HyField@AuxAddToCoFields[2]{}
\@writefile{toc}{\contentsline {paragraph}{\nonumberline Getting started}{1}{section*.2}}
\@writefile{toc}{\contentsline {paragraph}{\nonumberline Packages}{1}{section*.3}}
\@writefile{toc}{\contentsline {paragraph}{\nonumberline Data structures}{1}{section*.4}}
\@writefile{toc}{\contentsline {paragraph}{\nonumberline Matrix-Construction}{1}{section*.5}}
\@writefile{toc}{\contentsline {paragraph}{\nonumberline Strings}{1}{section*.6}}
\@writefile{toc}{\contentsline {paragraph}{\nonumberline Loops}{1}{section*.7}}
\@writefile{toc}{\contentsline {paragraph}{\nonumberline Conditionals}{1}{section*.8}}
\@writefile{toc}{\contentsline {paragraph}{\nonumberline Functions}{1}{section*.9}}
\@writefile{toc}{\contentsline {paragraph}{\nonumberline Multiple dispatch}{1}{section*.10}}
\@writefile{toc}{\contentsline {paragraph}{\nonumberline Basic linear algebra}{2}{section*.11}}
\@writefile{toc}{\contentsline {paragraph}{\nonumberline Constants}{2}{section*.12}}
\@writefile{toc}{\contentsline {paragraph}{\nonumberline Plotting}{2}{section*.13}}
\@writefile{toc}{\contentsline {paragraph}{\nonumberline Data Science}{2}{section*.14}}
\@writefile{toc}{\contentsline {paragraph}{\nonumberline Optimization}{2}{section*.15}}
