{
  "context": {
    "date": "2020-06-06 17:38:27",
    "host_name": "lng08.hpc.itc.rwth-aachen.de",
    "executable": "../bin/benchmark",
    "num_cpus": 24,
    "mhz_per_cpu": 2900,
    "cpu_scaling_enabled": false,
    "caches": [
      {
        "type": "Data",
        "level": 1,
        "size": 32768,
        "num_sharing": 1
      },
      {
        "type": "Instruction",
        "level": 1,
        "size": 32768,
        "num_sharing": 1
      },
      {
        "type": "Unified",
        "level": 2,
        "size": 262144,
        "num_sharing": 1
      },
      {
        "type": "Unified",
        "level": 3,
        "size": 31457280,
        "num_sharing": 12
      }
    ],
    "load_avg": [1.72,1.98,2.04],
    "library_build_type": "release"
  },
  "benchmarks": [
    {
      "name": "BM_MATMUL<float, float, &ml_cuda::matmul_reference, D1, 20, 8>/iterations:50/manual_time",
      "run_name": "BM_MATMUL<float, float, &ml_cuda::matmul_reference, D1, 20, 8>/iterations:50/manual_time",
      "run_type": "iteration",
      "repetitions": 0,
      "repetition_index": 0,
      "threads": 1,
      "iterations": 50,
      "real_time": 8.1680319666862488e+08,
      "cpu_time": 8.3704616000000120e+05,
      "time_unit": "ns",
      "cp2d": 4.1472896158695222e-01,
      "cp2h": 6.1701759845018384e-02,
      "init": 9.3243965148925781e+01,
      "kernel": 3.2533055961132051e-01,
      "run": 8.1680319666862489e-01,
      "total": 4.1871552999999999e-02
    },
    {
      "name": "BM_MATMUL<float, float, &kernels::matmul_20_8_c, D2, 20, 8>/iterations:50/manual_time",
      "run_name": "BM_MATMUL<float, float, &kernels::matmul_20_8_c, D2, 20, 8>/iterations:50/manual_time",
      "run_type": "iteration",
      "repetitions": 0,
      "repetition_index": 0,
      "threads": 1,
      "iterations": 50,
      "real_time": 7.4865728139877319e+08,
      "cpu_time": 7.6902947999999870e+05,
      "time_unit": "ns",
      "cp2d": 4.1267071843147279e-01,
      "cp2h": 6.1203200221061710e-02,
      "init": 9.2533149719238281e+01,
      "kernel": 2.5986368060111997e-01,
      "run": 7.4865728139877319e-01,
      "total": 3.8457352000000000e-02
    },
    {
      "name": "BM_MATMUL<double, double, &ml_cuda::matmul_reference, D1, 64, 5>/iterations:50/manual_time",
      "run_name": "BM_MATMUL<double, double, &ml_cuda::matmul_reference, D1, 64, 5>/iterations:50/manual_time",
      "run_type": "iteration",
      "repetitions": 0,
      "repetition_index": 0,
      "threads": 1,
      "iterations": 50,
      "real_time": 1.3439513611793518e+09,
      "cpu_time": 1.3637013200000015e+06,
      "time_unit": "ns",
      "cp2d": 7.1659136056900019e-01,
      "cp2h": 1.0790208011865615e-01,
      "init": 1.6359385681152344e+02,
      "kernel": 5.0430463910102841e-01,
      "run": 1.3439513611793519e+00,
      "total": 6.8207292000000003e-02
    },
    {
      "name": "BM_MATMUL<double, double, &kernels::matmul_64_5_c, D2, 64, 5>/iterations:50/manual_time",
      "run_name": "BM_MATMUL<double, double, &kernels::matmul_64_5_c, D2, 64, 5>/iterations:50/manual_time",
      "run_type": "iteration",
      "repetitions": 0,
      "repetition_index": 0,
      "threads": 1,
      "iterations": 50,
      "real_time": 1.2464652824401855e+09,
      "cpu_time": 1.2659693600000034e+06,
      "time_unit": "ns",
      "cp2d": 7.1582208156585692e-01,
      "cp2h": 1.0755584076046944e-01,
      "init": 1.6233804321289062e+02,
      "kernel": 4.0815872073173520e-01,
      "run": 1.2464652824401856e+00,
      "total": 6.3325089000000001e-02
    },
    {
      "name": "BM_MATMUL<float, ml_cuda::interval_t<float>, &ml_cuda::matmul_reference, D1, 20, 8>/iterations:50/manual_time",
      "run_name": "BM_MATMUL<float, ml_cuda::interval_t<float>, &ml_cuda::matmul_reference, D1, 20, 8>/iterations:50/manual_time",
      "run_type": "iteration",
      "repetitions": 0,
      "repetition_index": 0,
      "threads": 1,
      "iterations": 50,
      "real_time": 1.3783680009841919e+09,
      "cpu_time": 1.3612618400000008e+06,
      "time_unit": "ns",
      "cp2d": 6.7985664129257206e-01,
      "cp2h": 1.1011392012238502e-01,
      "init": 1.7318252563476562e+02,
      "kernel": 5.7352768182754521e-01,
      "run": 1.3783680009841919e+00,
      "total": 6.9947504999999993e-02
    },
    {
      "name": "BM_MATMUL<float, ml_cuda::interval_t<float>, &kernels::matmul_20_8_c, D2, 20, 8>/iterations:50/manual_time",
      "run_name": "BM_MATMUL<float, ml_cuda::interval_t<float>, &kernels::matmul_20_8_c, D2, 20, 8>/iterations:50/manual_time",
      "run_type": "iteration",
      "repetitions": 0,
      "repetition_index": 0,
      "threads": 1,
      "iterations": 50,
      "real_time": 1.1711244750022888e+09,
      "cpu_time": 1.1730242599999972e+06,
      "time_unit": "ns",
      "cp2d": 6.5918976068496704e-01,
      "cp2h": 1.1025343954563141e-01,
      "init": 1.7309353637695312e+02,
      "kernel": 3.8646207988262177e-01,
      "run": 1.1711244750022889e+00,
      "total": 5.9563790999999998e-02
    },
    {
      "name": "BM_MATMUL<double, ml_cuda::interval_t<double>, &ml_cuda::matmul_reference, D1, 64, 5>/iterations:50/manual_time",
      "run_name": "BM_MATMUL<double, ml_cuda::interval_t<double>, &ml_cuda::matmul_reference, D1, 64, 5>/iterations:50/manual_time",
      "run_type": "iteration",
      "repetitions": 0,
      "repetition_index": 0,
      "threads": 1,
      "iterations": 50,
      "real_time": 2.6093612766265869e+09,
      "cpu_time": 2.6293994599999948e+06,
      "time_unit": "ns",
      "cp2d": 1.1811014461517333e+00,
      "cp2h": 2.0553728044033051e-01,
      "init": 3.0220675659179688e+02,
      "kernel": 1.2070464015007019e+00,
      "run": 2.6093612766265868e+00,
      "total": 1.3148482400000000e-01
    },
    {
      "name": "BM_MATMUL<double, ml_cuda::interval_t<double>, &kernels::matmul_64_5_c, D2, 64, 5>/iterations:50/manual_time",
      "run_name": "BM_MATMUL<double, ml_cuda::interval_t<double>, &kernels::matmul_64_5_c, D2, 64, 5>/iterations:50/manual_time",
      "run_type": "iteration",
      "repetitions": 0,
      "repetition_index": 0,
      "threads": 1,
      "iterations": 50,
      "real_time": 1.9531801748275757e+09,
      "cpu_time": 1.9731939000000053e+06,
      "time_unit": "ns",
      "cp2d": 1.1691609621047974e+00,
      "cp2h": 2.1256767988204955e-01,
      "init": 3.0145169067382812e+02,
      "kernel": 5.5644096016883848e-01,
      "run": 1.9531801748275757e+00,
      "total": 9.8672965000000001e-02
    },
    {
      "name": "BM_MATMUL<ml_cuda::tangent_t<float>, ml_cuda::tangent_t<float>, &ml_cuda::matmul_reference, D1, 5, 4>/iterations:50/manual_time",
      "run_name": "BM_MATMUL<ml_cuda::tangent_t<float>, ml_cuda::tangent_t<float>, &ml_cuda::matmul_reference, D1, 5, 4>/iterations:50/manual_time",
      "run_type": "iteration",
      "repetitions": 0,
      "repetition_index": 0,
      "threads": 1,
      "iterations": 50,
      "real_time": 1.6652006340026855e+09,
      "cpu_time": 1.6850115999999994e+06,
      "time_unit": "ns",
      "cp2d": 7.1746687889099126e-01,
      "cp2h": 1.0755648046731948e-01,
      "init": 1.9353768920898438e+02,
      "kernel": 8.2542720317840579e-01,
      "run": 1.6652006340026855e+00,
      "total": 8.4269195000000005e-02
    },
    {
      "name": "BM_MATMUL<ml_cuda::tangent_t<float>, ml_cuda::tangent_t<float>, &kernels::matmul_5_4_c, D2, 5, 4>/iterations:50/manual_time",
      "run_name": "BM_MATMUL<ml_cuda::tangent_t<float>, ml_cuda::tangent_t<float>, &kernels::matmul_5_4_c, D2, 5, 4>/iterations:50/manual_time",
      "run_type": "iteration",
      "repetitions": 0,
      "repetition_index": 0,
      "threads": 1,
      "iterations": 50,
      "real_time": 1.4080646395683289e+09,
      "cpu_time": 1.4280584000000029e+06,
      "time_unit": "ns",
      "cp2d": 7.1611328244209294e-01,
      "cp2h": 1.0743936002254487e-01,
      "init": 1.9418885803222656e+02,
      "kernel": 5.7002112030982977e-01,
      "run": 1.4080646395683289e+00,
      "total": 7.1407234000000000e-02
    },
    {
      "name": "BM_MATMUL_SEPARATE<float, 1, float, 1, &kernels::matmul_5_4_c_ptr, D2, 5, 4>/iterations:50/manual_time",
      "run_name": "BM_MATMUL_SEPARATE<float, 1, float, 1, &kernels::matmul_5_4_c_ptr, D2, 5, 4>/iterations:50/manual_time",
      "run_type": "iteration",
      "repetitions": 0,
      "repetition_index": 0,
      "threads": 1,
      "iterations": 50,
      "real_time": 2.3496076726913452e+09,
      "cpu_time": 2.3631599999999953e+06,
      "time_unit": "ns",
      "cp2d": 9.9660928368568424e-01,
      "cp2h": 1.9899328112602233e-01,
      "init": 1.8411062622070312e+02,
      "kernel": 1.1378956890106202e+00,
      "run": 2.3496076726913451e+00,
      "total": 1.1817179799999999e-01
    },
    {
      "name": "BM_MATMUL<ml_cuda::tangent_t<float,4>, ml_cuda::tangent_t<float,4>, &ml_cuda::matmul_reference, D1, 48, 10>/iterations:50/manual_time",
      "run_name": "BM_MATMUL<ml_cuda::tangent_t<float,4>, ml_cuda::tangent_t<float,4>, &ml_cuda::matmul_reference, D1, 48, 10>/iterations:50/manual_time",
      "run_type": "iteration",
      "repetitions": 0,
      "repetition_index": 0,
      "threads": 1,
      "iterations": 50,
      "real_time": 3.5370879745483398e+09,
      "cpu_time": 3.5569279999999995e+06,
      "time_unit": "ns",
      "cp2d": 1.4999686431884767e+00,
      "cp2h": 2.3612543880939485e-01,
      "init": 4.7115307617187500e+02,
      "kernel": 1.7857132744789124e+00,
      "run": 3.5370879745483399e+00,
      "total": 1.7788150999999999e-01
    },
    {
      "name": "BM_MATMUL<ml_cuda::tangent_t<float,4>, ml_cuda::tangent_t<float,4>, &kernels::matmul_48_10_c, D2, 48, 10>/iterations:50/manual_time",
      "run_name": "BM_MATMUL<ml_cuda::tangent_t<float,4>, ml_cuda::tangent_t<float,4>, &kernels::matmul_48_10_c, D2, 48, 10>/iterations:50/manual_time",
      "run_type": "iteration",
      "repetitions": 0,
      "repetition_index": 0,
      "threads": 1,
      "iterations": 50,
      "real_time": 2.8015762996673584e+09,
      "cpu_time": 2.8214205400000126e+06,
      "time_unit": "ns",
      "cp2d": 1.5042700862884522e+00,
      "cp2h": 2.4602048128843307e-01,
      "init": 4.7065719604492188e+02,
      "kernel": 1.0360883188247680e+00,
      "run": 2.8015762996673583e+00,
      "total": 1.4109385899999999e-01
    },
    {
      "name": "BM_MATMUL_SEPARATE<float, 4, float, 4, &kernels::matmul_48_10_c_ptr, D2, 48, 10>/iterations:50/manual_time",
      "run_name": "BM_MATMUL_SEPARATE<float, 4, float, 4, &kernels::matmul_48_10_c_ptr, D2, 48, 10>/iterations:50/manual_time",
      "run_type": "iteration",
      "repetitions": 0,
      "repetition_index": 0,
      "threads": 1,
      "iterations": 50,
      "real_time": 4.5167174339294434e+09,
      "cpu_time": 4.5298376000000043e+06,
      "time_unit": "ns",
      "cp2d": 2.2117100715637208e+00,
      "cp2h": 3.7783807754516602e-01,
      "init": 4.6028350830078125e+02,
      "kernel": 1.9109900808334350e+00,
      "run": 4.5167174339294434e+00,
      "total": 2.2652955100000000e-01
    },
    {
      "name": "BM_MATMUL<ml_cuda::tangent_t<float,16>, ml_cuda::tangent_t<float,16>, &ml_cuda::matmul_reference, D1, 8, 12>/iterations:50/manual_time",
      "run_name": "BM_MATMUL<ml_cuda::tangent_t<float,16>, ml_cuda::tangent_t<float,16>, &ml_cuda::matmul_reference, D1, 8, 12>/iterations:50/manual_time",
      "run_type": "iteration",
      "repetitions": 0,
      "repetition_index": 0,
      "threads": 1,
      "iterations": 50,
      "real_time": 1.6364415264129639e+10,
      "cpu_time": 1.6379230059999995e+07,
      "time_unit": "ns",
      "cp2d": 5.4916307353973393e+00,
      "cp2h": 5.8332096219062801e-01,
      "init": 1.5565466308593750e+03,
      "kernel": 1.0273726043701172e+01,
      "run": 1.6364415264129640e+01,
      "total": 8.1927548600000000e-01
    },
    {
      "name": "BM_MATMUL<ml_cuda::tangent_t<float,16>, ml_cuda::tangent_t<float,16>, &kernels::matmul_8_12_c, D2, 8, 12>/iterations:50/manual_time",
      "run_name": "BM_MATMUL<ml_cuda::tangent_t<float,16>, ml_cuda::tangent_t<float,16>, &kernels::matmul_8_12_c, D2, 8, 12>/iterations:50/manual_time",
      "run_type": "iteration",
      "repetitions": 0,
      "repetition_index": 0,
      "threads": 1,
      "iterations": 50,
      "real_time": 9.0033010482788086e+09,
      "cpu_time": 8.7884486800000165e+06,
      "time_unit": "ns",
      "cp2d": 5.7283180522918702e+00,
      "cp2h": 5.8291455984115603e-01,
      "init": 1.5565777587890625e+03,
      "kernel": 2.6764051151275634e+00,
      "run": 9.0033010482788089e+00,
      "total": 4.5122014999999999e-01
    },
    {
      "name": "BM_MATMUL_SEPARATE<float, 16, float, 16, &kernels::matmul_8_12_c_ptr, D2, 8, 12>/iterations:50/manual_time",
      "run_name": "BM_MATMUL_SEPARATE<float, 16, float, 16, &kernels::matmul_8_12_c_ptr, D2, 8, 12>/iterations:50/manual_time",
      "run_type": "iteration",
      "repetitions": 0,
      "repetition_index": 0,
      "threads": 1,
      "iterations": 50,
      "real_time": 1.5831692771911621e+10,
      "cpu_time": 1.5801930780000007e+07,
      "time_unit": "ns",
      "cp2d": 8.2434457588195809e+00,
      "cp2h": 1.1515167999267577e+00,
      "init": 1.5794704589843750e+03,
      "kernel": 6.4190995025634763e+00,
      "run": 1.5831692771911621e+01,
      "total": 7.9234513200000001e-01
    },
    {
      "name": "BM_MATMUL<ml_cuda::tangent_t<float,64>, ml_cuda::tangent_t<float,64>, &ml_cuda::matmul_reference, D1, 8, 8>/iterations:50/manual_time",
      "run_name": "BM_MATMUL<ml_cuda::tangent_t<float,64>, ml_cuda::tangent_t<float,64>, &ml_cuda::matmul_reference, D1, 8, 8>/iterations:50/manual_time",
      "run_type": "iteration",
      "repetitions": 0,
      "repetition_index": 0,
      "threads": 1,
      "iterations": 50,
      "real_time": 1.9850415832519531e+11,
      "cpu_time": 1.9845196059999999e+08,
      "time_unit": "ns",
      "cp2d": 2.1031084785461427e+01,
      "cp2h": 2.0710515213012695e+00,
      "init": 5.9274960937500000e+03,
      "kernel": 1.7538315887451171e+02,
      "run": 1.9850415832519531e+02,
      "total": 9.9260428090000001e+00
    },
    {
      "name": "BM_MATMUL<ml_cuda::tangent_t<float,64>, ml_cuda::tangent_t<float,64>, &kernels::matmul_8_8_n, D2, 8, 8>/iterations:50/manual_time",
      "run_name": "BM_MATMUL<ml_cuda::tangent_t<float,64>, ml_cuda::tangent_t<float,64>, &kernels::matmul_8_8_n, D2, 8, 8>/iterations:50/manual_time",
      "run_type": "iteration",
      "repetitions": 0,
      "repetition_index": 0,
      "threads": 1,
      "iterations": 50,
      "real_time": 7.3249158325195312e+10,
      "cpu_time": 7.3234380659999937e+07,
      "time_unit": "ns",
      "cp2d": 2.1780720672607423e+01,
      "cp2h": 2.1066272044181824e+00,
      "init": 5.9676694335937500e+03,
      "kernel": 4.9344270629882814e+01,
      "run": 7.3249158325195310e+01,
      "total": 3.6632872139999999e+00
    },
    {
      "name": "BM_MATMUL_SEPARATE<float, 64, float, 64, &kernels::matmul_8_8_n_ptr, D2, 8, 8>/iterations:50/manual_time",
      "run_name": "BM_MATMUL_SEPARATE<float, 64, float, 64, &kernels::matmul_8_8_n_ptr, D2, 8, 8>/iterations:50/manual_time",
      "run_type": "iteration",
      "repetitions": 0,
      "repetition_index": 0,
      "threads": 1,
      "iterations": 50,
      "real_time": 1.4512732818603516e+11,
      "cpu_time": 1.4505107715999997e+08,
      "time_unit": "ns",
      "cp2d": 3.3550859756469727e+01,
      "cp2h": 4.2439545917510983e+00,
      "init": 6.4222285156250000e+03,
      "kernel": 1.0731191085815429e+02,
      "run": 1.4512732818603516e+02,
      "total": 7.2572303480000002e+00
    },
    {
      "name": "BM_MATMUL<ml_cuda::tangent_t<double>, ml_cuda::tangent_t<double>, &ml_cuda::matmul_reference, D1, 64, 5>/iterations:50/manual_time",
      "run_name": "BM_MATMUL<ml_cuda::tangent_t<double>, ml_cuda::tangent_t<double>, &ml_cuda::matmul_reference, D1, 64, 5>/iterations:50/manual_time",
      "run_type": "iteration",
      "repetitions": 0,
      "repetition_index": 0,
      "threads": 1,
      "iterations": 50,
      "real_time": 2.7980672121047974e+09,
      "cpu_time": 2.8188720800000052e+06,
      "time_unit": "ns",
      "cp2d": 1.2795103979110718e+00,
      "cp2h": 2.1968959927558898e-01,
      "init": 3.5083514404296875e+02,
      "kernel": 1.2836627197265624e+00,
      "run": 2.7980672121047974e+00,
      "total": 1.4095770699999999e-01
    },
    {
      "name": "BM_MATMUL<ml_cuda::tangent_t<double>, ml_cuda::tangent_t<double>, &kernels::matmul_64_5_c, D2, 64, 5>/iterations:50/manual_time",
      "run_name": "BM_MATMUL<ml_cuda::tangent_t<double>, ml_cuda::tangent_t<double>, &kernels::matmul_64_5_c, D2, 64, 5>/iterations:50/manual_time",
      "run_type": "iteration",
      "repetitions": 0,
      "repetition_index": 0,
      "threads": 1,
      "iterations": 50,
      "real_time": 2.2259731197357178e+09,
      "cpu_time": 2.2464723000000222e+06,
      "time_unit": "ns",
      "cp2d": 1.2763129591941833e+00,
      "cp2h": 2.0762816041707993e-01,
      "init": 3.5108978271484375e+02,
      "kernel": 7.2684287667274472e-01,
      "run": 2.2259731197357180e+00,
      "total": 1.1235650400000000e-01
    },
    {
      "name": "BM_MATMUL_SEPARATE<double, 1, double, 1, &kernels::matmul_64_5_c_ptr, D2, 64, 5>/iterations:50/manual_time",
      "run_name": "BM_MATMUL_SEPARATE<double, 1, double, 1, &kernels::matmul_64_5_c_ptr, D2, 64, 5>/iterations:50/manual_time",
      "run_type": "iteration",
      "repetitions": 0,
      "repetition_index": 0,
      "threads": 1,
      "iterations": 50,
      "real_time": 3.0657446241378784e+09,
      "cpu_time": 3.0499911200000439e+06,
      "time_unit": "ns",
      "cp2d": 1.6299596834182739e+00,
      "cp2h": 3.0705728173255920e-01,
      "init": 3.3840408325195312e+02,
      "kernel": 1.1123059248924256e+00,
      "run": 3.0657446241378783e+00,
      "total": 1.5405733999999999e-01
    },
    {
      "name": "BM_MATMUL<ml_cuda::tangent_t<double,4>, ml_cuda::tangent_t<double,4>, &ml_cuda::matmul_reference, D1, 32, 7>/iterations:50/manual_time",
      "run_name": "BM_MATMUL<ml_cuda::tangent_t<double,4>, ml_cuda::tangent_t<double,4>, &ml_cuda::matmul_reference, D1, 32, 7>/iterations:50/manual_time",
      "run_type": "iteration",
      "repetitions": 0,
      "repetition_index": 0,
      "threads": 1,
      "iterations": 50,
      "real_time": 6.5740825557708740e+09,
      "cpu_time": 6.5409018399999747e+06,
      "time_unit": "ns",
      "cp2d": 2.9180064010620117e+00,
      "cp2h": 3.9379903912544251e-01,
      "init": 8.5982110595703125e+02,
      "kernel": 3.2466944074630737e+00,
      "run": 6.5740825557708744e+00,
      "total": 3.2978413699999998e-01
    },
    {
      "name": "BM_MATMUL<ml_cuda::tangent_t<double,4>, ml_cuda::tangent_t<double,4>, &kernels::matmul_32_7_c, D2, 32, 7>/iterations:50/manual_time",
      "run_name": "BM_MATMUL<ml_cuda::tangent_t<double,4>, ml_cuda::tangent_t<double,4>, &kernels::matmul_32_7_c, D2, 32, 7>/iterations:50/manual_time",
      "run_type": "iteration",
      "repetitions": 0,
      "repetition_index": 0,
      "threads": 1,
      "iterations": 50,
      "real_time": 4.6706432247161865e+09,
      "cpu_time": 4.6914613200000590e+06,
      "time_unit": "ns",
      "cp2d": 2.8720621013641359e+00,
      "cp2h": 4.1868351936340331e-01,
      "init": 8.5691876220703125e+02,
      "kernel": 1.3644371104240418e+00,
      "run": 4.6706432247161862e+00,
      "total": 2.3468830399999999e-01
    },
    {
      "name": "BM_MATMUL_SEPARATE<double, 4, double, 4, &kernels::matmul_32_7_c_ptr, D2, 32, 7>/iterations:50/manual_time",
      "run_name": "BM_MATMUL_SEPARATE<double, 4, double, 4, &kernels::matmul_32_7_c_ptr, D2, 32, 7>/iterations:50/manual_time",
      "run_type": "iteration",
      "repetitions": 0,
      "repetition_index": 0,
      "threads": 1,
      "iterations": 50,
      "real_time": 6.8231935977935791e+09,
      "cpu_time": 6.8060374999998882e+06,
      "time_unit": "ns",
      "cp2d": 3.8716460752487181e+00,
      "cp2h": 6.2337024092674254e-01,
      "init": 8.4562561035156250e+02,
      "kernel": 2.3118687963485716e+00,
      "run": 6.8231935977935789e+00,
      "total": 3.4188628700000001e-01
    },
    {
      "name": "BM_MATMUL<ml_cuda::tangent_t<double,16>, ml_cuda::tangent_t<double,16>, &ml_cuda::matmul_reference, D1, 8, 12>/iterations:50/manual_time",
      "run_name": "BM_MATMUL<ml_cuda::tangent_t<double,16>, ml_cuda::tangent_t<double,16>, &ml_cuda::matmul_reference, D1, 8, 12>/iterations:50/manual_time",
      "run_type": "iteration",
      "repetitions": 0,
      "repetition_index": 0,
      "threads": 1,
      "iterations": 50,
      "real_time": 4.2838786544799805e+10,
      "cpu_time": 4.2827747620000027e+07,
      "time_unit": "ns",
      "cp2d": 1.1120814723968506e+01,
      "cp2h": 1.0790259170532226e+00,
      "init": 2.7624177246093750e+03,
      "kernel": 3.0622423591613771e+01,
      "run": 4.2838786544799802e+01,
      "total": 2.1429708580000000e+00
    },
    {
      "name": "BM_MATMUL<ml_cuda::tangent_t<double,16>, ml_cuda::tangent_t<double,16>, &kernels::matmul_8_12_c, D2, 8, 12>/iterations:50/manual_time",
      "run_name": "BM_MATMUL<ml_cuda::tangent_t<double,16>, ml_cuda::tangent_t<double,16>, &kernels::matmul_8_12_c, D2, 8, 12>/iterations:50/manual_time",
      "run_type": "iteration",
      "repetitions": 0,
      "repetition_index": 0,
      "threads": 1,
      "iterations": 50,
      "real_time": 1.7853257598876953e+10,
      "cpu_time": 1.7818390620000172e+07,
      "time_unit": "ns",
      "cp2d": 1.1171987247467040e+01,
      "cp2h": 1.0792979240417480e+00,
      "init": 2.7614057617187500e+03,
      "kernel": 5.5859033489227299e+00,
      "run": 1.7853257598876954e+01,
      "total": 8.9372013900000002e-01
    },
    {
      "name": "BM_MATMUL_SEPARATE<double, 16, double, 16, &kernels::matmul_8_12_c_ptr, D2, 8, 12>/iterations:50/manual_time",
      "run_name": "BM_MATMUL_SEPARATE<double, 16, double, 16, &kernels::matmul_8_12_c_ptr, D2, 8, 12>/iterations:50/manual_time",
      "run_type": "iteration",
      "repetitions": 0,
      "repetition_index": 0,
      "threads": 1,
      "iterations": 50,
      "real_time": 2.8991227073669434e+10,
      "cpu_time": 2.8965213140000116e+07,
      "time_unit": "ns",
      "cp2d": 1.5002129974365234e+01,
      "cp2h": 2.0061600065231322e+00,
      "init": 2.7634211425781250e+03,
      "kernel": 1.1964492225646973e+01,
      "run": 2.8991227073669435e+01,
      "total": 1.4503541630000001e+00
    },
    {
      "name": "BM_MATMUL<ml_cuda::tangent_t<double,64>, ml_cuda::tangent_t<double,64>, &ml_cuda::matmul_reference, D1, 5, 6>/iterations:50/manual_time",
      "run_name": "BM_MATMUL<ml_cuda::tangent_t<double,64>, ml_cuda::tangent_t<double,64>, &ml_cuda::matmul_reference, D1, 5, 6>/iterations:50/manual_time",
      "run_type": "iteration",
      "repetitions": 0,
      "repetition_index": 0,
      "threads": 1,
      "iterations": 50,
      "real_time": 4.2249804443359375e+11,
      "cpu_time": 4.2239134448000014e+08,
      "time_unit": "ns",
      "cp2d": 4.2485016174316407e+01,
      "cp2h": 3.7956889438629151e+00,
      "init": 1.0502595703125000e+04,
      "kernel": 3.7619696228027345e+02,
      "run": 4.2249804443359375e+02,
      "total": 2.1125833747000001e+01
    },
    {
      "name": "BM_MATMUL<ml_cuda::tangent_t<double,64>, ml_cuda::tangent_t<double,64>, &kernels::matmul_5_6_c, D2, 5, 6>/iterations:50/manual_time",
      "run_name": "BM_MATMUL<ml_cuda::tangent_t<double,64>, ml_cuda::tangent_t<double,64>, &kernels::matmul_5_6_c, D2, 5, 6>/iterations:50/manual_time",
      "run_type": "iteration",
      "repetitions": 0,
      "repetition_index": 0,
      "threads": 1,
      "iterations": 50,
      "real_time": 1.3689006866455078e+11,
      "cpu_time": 1.3684020520000020e+08,
      "time_unit": "ns",
      "cp2d": 4.2713035583496094e+01,
      "cp2h": 3.8986201620101930e+00,
      "init": 1.1071031250000000e+04,
      "kernel": 9.0260216369628907e+01,
      "run": 1.3689006866455077e+02,
      "total": 6.8453613910000000e+00
    },
    {
      "name": "BM_MATMUL_SEPARATE<double, 64, double, 64, &kernels::matmul_5_6_c_ptr, D2, 5, 6>/iterations:50/manual_time",
      "run_name": "BM_MATMUL_SEPARATE<double, 64, double, 64, &kernels::matmul_5_6_c_ptr, D2, 5, 6>/iterations:50/manual_time",
      "run_type": "iteration",
      "repetitions": 0,
      "repetition_index": 0,
      "threads": 1,
      "iterations": 50,
      "real_time": 5.0885118408203125e+11,
      "cpu_time": 5.0864939123999995e+08,
      "time_unit": "ns",
      "cp2d": 5.6883035507202152e+01,
      "cp2h": 7.1130259323120120e+00,
      "init": 1.0702000000000000e+04,
      "kernel": 4.4483308410644531e+02,
      "run": 5.0885118408203124e+02,
      "total": 2.5443473344000001e+01
    },
    {
      "name": "BM_MATMUL<ml_cuda::tangent_t<float>, ml_cuda::interval_t<ml_cuda::tangent_t<float>>, &ml_cuda::matmul_reference, D1, 5, 4>/iterations:50/manual_time",
      "run_name": "BM_MATMUL<ml_cuda::tangent_t<float>, ml_cuda::interval_t<ml_cuda::tangent_t<float>>, &ml_cuda::matmul_reference, D1, 5, 4>/iterations:50/manual_time",
      "run_type": "iteration",
      "repetitions": 0,
      "repetition_index": 0,
      "threads": 1,
      "iterations": 50,
      "real_time": 3.2670297479629517e+09,
      "cpu_time": 3.2879656399995838e+06,
      "time_unit": "ns",
      "cp2d": 1.1951180815696716e+00,
      "cp2h": 2.1092544019222259e-01,
      "init": 3.9173596191406250e+02,
      "kernel": 1.8454540801048278e+00,
      "run": 3.2670297479629515e+00,
      "total": 1.6442702300000001e-01
    },
    {
      "name": "BM_MATMUL<ml_cuda::tangent_t<float>, ml_cuda::interval_t<ml_cuda::tangent_t<float>>, &kernels::matmul_5_4_c, D2, 5, 4>/iterations:50/manual_time",
      "run_name": "BM_MATMUL<ml_cuda::tangent_t<float>, ml_cuda::interval_t<ml_cuda::tangent_t<float>>, &kernels::matmul_5_4_c, D2, 5, 4>/iterations:50/manual_time",
      "run_type": "iteration",
      "repetitions": 0,
      "repetition_index": 0,
      "threads": 1,
      "iterations": 50,
      "real_time": 2.6071404933929443e+09,
      "cpu_time": 2.6269394400003422e+06,
      "time_unit": "ns",
      "cp2d": 1.1715033555030823e+00,
      "cp2h": 2.0228479921817780e-01,
      "init": 3.8965036010742188e+02,
      "kernel": 1.2175526380538941e+00,
      "run": 2.6071404933929445e+00,
      "total": 1.3137089800000001e-01
    },
    {
      "name": "BM_MATMUL<ml_cuda::tangent_t<float,4>, ml_cuda::interval_t<ml_cuda::tangent_t<float,4>>, &ml_cuda::matmul_reference, D1, 16, 6>/iterations:50/manual_time",
      "run_name": "BM_MATMUL<ml_cuda::tangent_t<float,4>, ml_cuda::interval_t<ml_cuda::tangent_t<float,4>>, &ml_cuda::matmul_reference, D1, 16, 6>/iterations:50/manual_time",
      "run_type": "iteration",
      "repetitions": 0,
      "repetition_index": 0,
      "threads": 1,
      "iterations": 50,
      "real_time": 5.5077593421936035e+09,
      "cpu_time": 5.5281356199998297e+06,
      "time_unit": "ns",
      "cp2d": 2.6542489433288576e+00,
      "cp2h": 3.9249088048934938e-01,
      "init": 8.7799761962890625e+02,
      "kernel": 2.4451411056518553e+00,
      "run": 5.5077593421936033e+00,
      "total": 2.7647223799999998e-01
    },
    {
      "name": "BM_MATMUL<ml_cuda::tangent_t<float,4>, ml_cuda::interval_t<ml_cuda::tangent_t<float,4>>, &kernels::matmul_16_6_c, D2, 16, 6>/iterations:50/manual_time",
      "run_name": "BM_MATMUL<ml_cuda::tangent_t<float,4>, ml_cuda::interval_t<ml_cuda::tangent_t<float,4>>, &kernels::matmul_16_6_c, D2, 16, 6>/iterations:50/manual_time",
      "run_type": "iteration",
      "repetitions": 0,
      "repetition_index": 0,
      "threads": 1,
      "iterations": 50,
      "real_time": 5.5746035480499268e+09,
      "cpu_time": 5.5921088999997433e+06,
      "time_unit": "ns",
      "cp2d": 2.6713350486755369e+00,
      "cp2h": 3.9192960023880002e-01,
      "init": 9.2696563720703125e+02,
      "kernel": 2.4957305622100829e+00,
      "run": 5.5746035480499270e+00,
      "total": 2.7980751100000001e-01
    },
    {
      "name": "BM_MATMUL<ml_cuda::tangent_t<float,16>, ml_cuda::interval_t<ml_cuda::tangent_t<float,16>>, &ml_cuda::matmul_reference, D1, 8, 8>/iterations:50/manual_time",
      "run_name": "BM_MATMUL<ml_cuda::tangent_t<float,16>, ml_cuda::interval_t<ml_cuda::tangent_t<float,16>>, &ml_cuda::matmul_reference, D1, 8, 8>/iterations:50/manual_time",
      "run_type": "iteration",
      "repetitions": 0,
      "repetition_index": 0,
      "threads": 1,
      "iterations": 50,
      "real_time": 7.1557921447753906e+10,
      "cpu_time": 7.1500612359999985e+07,
      "time_unit": "ns",
      "cp2d": 1.0647546272277832e+01,
      "cp2h": 1.1498809599876403e+00,
      "init": 3.0681896972656250e+03,
      "kernel": 5.9743314361572267e+01,
      "run": 7.1557921447753913e+01,
      "total": 3.5788590469999999e+00
    },
    {
      "name": "BM_MATMUL<ml_cuda::tangent_t<float,16>, ml_cuda::interval_t<ml_cuda::tangent_t<float,16>>, &kernels::matmul_8_8_n, D2, 8, 8>/iterations:50/manual_time",
      "run_name": "BM_MATMUL<ml_cuda::tangent_t<float,16>, ml_cuda::interval_t<ml_cuda::tangent_t<float,16>>, &kernels::matmul_8_8_n, D2, 8, 8>/iterations:50/manual_time",
      "run_type": "iteration",
      "repetitions": 0,
      "repetition_index": 0,
      "threads": 1,
      "iterations": 50,
      "real_time": 1.6908470954895020e+10,
      "cpu_time": 1.6920670380000047e+07,
      "time_unit": "ns",
      "cp2d": 1.0372870368957519e+01,
      "cp2h": 1.1127711987495423e+00,
      "init": 3.0014909667968750e+03,
      "kernel": 5.4067180442810061e+00,
      "run": 1.6908470954895019e+01,
      "total": 8.4653079200000003e-01
    },
    {
      "name": "BM_MATMUL<ml_cuda::tangent_t<float,64>, ml_cuda::interval_t<ml_cuda::tangent_t<float,64>>, &ml_cuda::matmul_reference, D1, 4, 8>/iterations:50/manual_time",
      "run_name": "BM_MATMUL<ml_cuda::tangent_t<float,64>, ml_cuda::interval_t<ml_cuda::tangent_t<float,64>>, &ml_cuda::matmul_reference, D1, 4, 8>/iterations:50/manual_time",
      "run_type": "iteration",
      "repetitions": 0,
      "repetition_index": 0,
      "threads": 1,
      "iterations": 50,
      "real_time": 3.3188071899414062e+11,
      "cpu_time": 3.3181611218000001e+08,
      "time_unit": "ns",
      "cp2d": 3.7914836044311521e+01,
      "cp2h": 3.7530374431610110e+00,
      "init": 1.0788393554687500e+04,
      "kernel": 2.9019354980468751e+02,
      "run": 3.3188071899414064e+02,
      "total": 1.6594906910999999e+01
    },
    {
      "name": "BM_MATMUL<ml_cuda::tangent_t<float,64>, ml_cuda::interval_t<ml_cuda::tangent_t<float,64>>, &kernels::matmul_4_8_c, D2, 4, 8>/iterations:50/manual_time",
      "run_name": "BM_MATMUL<ml_cuda::tangent_t<float,64>, ml_cuda::interval_t<ml_cuda::tangent_t<float,64>>, &kernels::matmul_4_8_c, D2, 4, 8>/iterations:50/manual_time",
      "run_type": "iteration",
      "repetitions": 0,
      "repetition_index": 0,
      "threads": 1,
      "iterations": 50,
      "real_time": 1.9370558868408203e+11,
      "cpu_time": 1.9350004180000043e+08,
      "time_unit": "ns",
      "cp2d": 3.8645478744506839e+01,
      "cp2h": 3.7734092950820921e+00,
      "init": 1.0676959960937500e+04,
      "kernel": 1.5126761199951173e+02,
      "run": 1.9370558868408204e+02,
      "total": 9.6861117629999995e+00
    },
    {
      "name": "BM_MATMUL<ml_cuda::tangent_t<double>, ml_cuda::interval_t<ml_cuda::tangent_t<double>>, &ml_cuda::matmul_reference, D1, 5, 4>/iterations:50/manual_time",
      "run_name": "BM_MATMUL<ml_cuda::tangent_t<double>, ml_cuda::interval_t<ml_cuda::tangent_t<double>>, &ml_cuda::matmul_reference, D1, 5, 4>/iterations:50/manual_time",
      "run_type": "iteration",
      "repetitions": 0,
      "repetition_index": 0,
      "threads": 1,
      "iterations": 50,
      "real_time": 4.6783840084075928e+09,
      "cpu_time": 4.6948610199996205e+06,
      "time_unit": "ns",
      "cp2d": 2.0999289608001708e+00,
      "cp2h": 3.1201855897903441e-01,
      "init": 6.3764312744140625e+02,
      "kernel": 2.2510086441040040e+00,
      "run": 4.6783840084075932e+00,
      "total": 2.3494002899999999e-01
    },
    {
      "name": "BM_MATMUL<ml_cuda::tangent_t<double>, ml_cuda::interval_t<ml_cuda::tangent_t<double>>, &kernels::matmul_5_4_c, D2, 5, 4>/iterations:50/manual_time",
      "run_name": "BM_MATMUL<ml_cuda::tangent_t<double>, ml_cuda::interval_t<ml_cuda::tangent_t<double>>, &kernels::matmul_5_4_c, D2, 5, 4>/iterations:50/manual_time",
      "run_type": "iteration",
      "repetitions": 0,
      "repetition_index": 0,
      "threads": 1,
      "iterations": 50,
      "real_time": 4.3608857440948486e+09,
      "cpu_time": 4.3668254400000703e+06,
      "time_unit": "ns",
      "cp2d": 2.1517504024505616e+00,
      "cp2h": 3.3072639942169191e-01,
      "init": 6.4133172607421875e+02,
      "kernel": 1.8626540756225587e+00,
      "run": 4.3608857440948485e+00,
      "total": 2.1913723800000001e-01
    },
    {
      "name": "BM_MATMUL<ml_cuda::tangent_t<double,4>, ml_cuda::interval_t<ml_cuda::tangent_t<double,4>>, &ml_cuda::matmul_reference, D1, 32, 7>/iterations:50/manual_time",
      "run_name": "BM_MATMUL<ml_cuda::tangent_t<double,4>, ml_cuda::interval_t<ml_cuda::tangent_t<double,4>>, &ml_cuda::matmul_reference, D1, 32, 7>/iterations:50/manual_time",
      "run_type": "iteration",
      "repetitions": 0,
      "repetition_index": 0,
      "threads": 1,
      "iterations": 50,
      "real_time": 2.0870368003845215e+10,
      "cpu_time": 2.0884240760000240e+07,
      "time_unit": "ns",
      "cp2d": 6.2036262416839598e+00,
      "cp2h": 7.1826879978179936e-01,
      "init": 1.5911243896484375e+03,
      "kernel": 1.3932223377227784e+01,
      "run": 2.0870368003845215e+01,
      "total": 1.0446399669999999e+00
    },
    {
      "name": "BM_MATMUL<ml_cuda::tangent_t<double,4>, ml_cuda::interval_t<ml_cuda::tangent_t<double,4>>, &kernels::matmul_32_7_c, D2, 32, 7>/iterations:50/manual_time",
      "run_name": "BM_MATMUL<ml_cuda::tangent_t<double,4>, ml_cuda::interval_t<ml_cuda::tangent_t<double,4>>, &kernels::matmul_32_7_c, D2, 32, 7>/iterations:50/manual_time",
      "run_type": "iteration",
      "repetitions": 0,
      "repetition_index": 0,
      "threads": 1,
      "iterations": 50,
      "real_time": 1.0056483211517334e+10,
      "cpu_time": 1.0075646440000128e+07,
      "time_unit": "ns",
      "cp2d": 6.0208032035827639e+00,
      "cp2h": 6.8697856187820439e-01,
      "init": 1.5482220458984375e+03,
      "kernel": 3.3329247903823851e+00,
      "run": 1.0056483211517333e+01,
      "total": 5.0389278100000001e-01
    },
    {
      "name": "BM_MATMUL<ml_cuda::tangent_t<double,16>, ml_cuda::interval_t<ml_cuda::tangent_t<double,16>>, &ml_cuda::matmul_reference, D1, 8, 8>/iterations:50/manual_time",
      "run_name": "BM_MATMUL<ml_cuda::tangent_t<double,16>, ml_cuda::interval_t<ml_cuda::tangent_t<double,16>>, &ml_cuda::matmul_reference, D1, 8, 8>/iterations:50/manual_time",
      "run_type": "iteration",
      "repetitions": 0,
      "repetition_index": 0,
      "threads": 1,
      "iterations": 50,
      "real_time": 1.0388217803955078e+11,
      "cpu_time": 1.0385791190000021e+08,
      "time_unit": "ns",
      "cp2d": 2.0638027496337891e+01,
      "cp2h": 2.1088812828063963e+00,
      "init": 5.1457128906250000e+03,
      "kernel": 8.1117566757202155e+01,
      "run": 1.0388217803955078e+02,
      "total": 5.1949523769999999e+00
    },
    {
      "name": "BM_MATMUL<ml_cuda::tangent_t<double,16>, ml_cuda::interval_t<ml_cuda::tangent_t<double,16>>, &kernels::matmul_8_8_n, D2, 8, 8>/iterations:50/manual_time",
      "run_name": "BM_MATMUL<ml_cuda::tangent_t<double,16>, ml_cuda::interval_t<ml_cuda::tangent_t<double,16>>, &kernels::matmul_8_8_n, D2, 8, 8>/iterations:50/manual_time",
      "run_type": "iteration",
      "repetitions": 0,
      "repetition_index": 0,
      "threads": 1,
      "iterations": 50,
      "real_time": 3.6136016616821289e+10,
      "cpu_time": 3.6109686739999913e+07,
      "time_unit": "ns",
      "cp2d": 2.0516542892456055e+01,
      "cp2h": 2.1073388767242434e+00,
      "init": 5.1455590820312500e+03,
      "kernel": 1.3495920658111572e+01,
      "run": 3.6136016616821287e+01,
      "total": 1.8076013950000001e+00
    },
    {
      "name": "BM_MATMUL<ml_cuda::tangent_t<double,64>, ml_cuda::interval_t<ml_cuda::tangent_t<double,64>>, &ml_cuda::matmul_reference, D1, 5, 6>/iterations:50/manual_time",
      "run_name": "BM_MATMUL<ml_cuda::tangent_t<double,64>, ml_cuda::interval_t<ml_cuda::tangent_t<double,64>>, &ml_cuda::matmul_reference, D1, 5, 6>/iterations:50/manual_time",
      "run_type": "iteration",
      "repetitions": 0,
      "repetition_index": 0,
      "threads": 1,
      "iterations": 50,
      "real_time": 1.3218609350585938e+12,
      "cpu_time": 1.3214994854600000e+09,
      "time_unit": "ns",
      "cp2d": 7.7151250762939455e+01,
      "cp2h": 6.7039571380615230e+00,
      "init": 1.9142996093750000e+04,
      "kernel": 1.2379834643554686e+03,
      "run": 1.3218609350585937e+03,
      "total": 6.6094189568999994e+01
    },
    {
      "name": "BM_MATMUL<ml_cuda::tangent_t<double,64>, ml_cuda::interval_t<ml_cuda::tangent_t<double,64>>, &kernels::matmul_5_6_c, D2, 5, 6>/iterations:50/manual_time",
      "run_name": "BM_MATMUL<ml_cuda::tangent_t<double,64>, ml_cuda::interval_t<ml_cuda::tangent_t<double,64>>, &kernels::matmul_5_6_c, D2, 5, 6>/iterations:50/manual_time",
      "run_type": "iteration",
      "repetitions": 0,
      "repetition_index": 0,
      "threads": 1,
      "iterations": 50,
      "real_time": 6.5880365600585938e+11,
      "cpu_time": 6.5862821872000039e+08,
      "time_unit": "ns",
      "cp2d": 7.5890333099365236e+01,
      "cp2h": 6.6512928104400633e+00,
      "init": 1.9631054687500000e+04,
      "kernel": 5.7624144287109380e+02,
      "run": 6.5880365600585935e+02,
      "total": 3.2941102782999998e+01
    }
  ]
}
