\relax 
\providecommand\hyper@newdestlabel[2]{}
\newlabel{refsection:1}{{1}{1}{}{DTLrowi.67.11}{}}
\newlabel{refsection:1@cref}{{[DTLrowi][1][]1}{[1][1][]1}}
\@writefile{toc}{\contentsline {chapter}{\numberline {1}General information}{1}{chapter.1}\protected@file@percent }
\@writefile{lof}{\addvspace {10\p@ }}
\@writefile{lot}{\addvspace {10\p@ }}
\@writefile{toc}{\contentsline {section}{\numberline {1.1}Key data}{1}{section.1.1}\protected@file@percent }
\@writefile{toc}{\contentsline {subsection}{\numberline {1.1.1}Governing bodies of the Collaborative Research Centre\xspace  }{1}{subsection.1.1.1}\protected@file@percent }
\@writefile{toc}{\contentsline {subsubsection}{\nonumberline Spokesperson of the CRC\,\get [crc]{crc}{number}\xspace  }{1}{DTLrowi.68.2}\protected@file@percent }
\@writefile{toc}{\contentsline {subsubsection}{\nonumberline Steering Committee of the CRC\,\get [crc]{crc}{number}\xspace  }{1}{DTLrowi.70.2}\protected@file@percent }
\@writefile{toc}{\contentsline {subsection}{\numberline {1.1.2}Project leaders}{1}{subsection.1.1.2}\protected@file@percent }
\@writefile{toc}{\contentsline {subsection}{\numberline {1.1.3}Participating institutions}{2}{subsection.1.1.3}\protected@file@percent }
\@writefile{toc}{\contentsline {subsubsection}{\nonumberline RWTH Aachen University (Aachen)}{2}{subsubsection*.7}\protected@file@percent }
\@writefile{toc}{\contentsline {subsubsection}{\nonumberline Humboldt-Universität zu Berlin (Berlin)}{2}{subsubsection*.9}\protected@file@percent }
\@writefile{toc}{\contentsline {subsection}{\numberline {1.1.4}Project groups and projects}{2}{subsection.1.1.4}\protected@file@percent }
\@writefile{toc}{\contentsline {section}{\numberline {1.2}Research profiles of the Collaborative Research Centre\xspace  }{4}{section.1.2}\protected@file@percent }
\@writefile{toc}{\contentsline {section}{\numberline {1.3}Research profile of the applicant university}{5}{section.1.3}\protected@file@percent }
\@writefile{toc}{\contentsline {section}{\numberline {1.4}Support structures}{5}{section.1.4}\protected@file@percent }
\@writefile{toc}{\contentsline {section}{\numberline {1.5}Other sources of third-party funding for project leaders}{7}{section.1.5}\protected@file@percent }
\@setckpt{content/01-frame}{
\setcounter{page}{8}
\setcounter{equation}{0}
\setcounter{enumi}{0}
\setcounter{enumii}{0}
\setcounter{enumiii}{0}
\setcounter{enumiv}{0}
\setcounter{footnote}{1}
\setcounter{mpfootnote}{0}
\setcounter{part}{0}
\setcounter{chapter}{1}
\setcounter{section}{5}
\setcounter{subsection}{0}
\setcounter{subsubsection}{0}
\setcounter{paragraph}{0}
\setcounter{subparagraph}{0}
\setcounter{figure}{0}
\setcounter{table}{2}
\setcounter{su@anzahl}{0}
\setcounter{parentequation}{0}
\setcounter{DTLrowi}{1}
\setcounter{DTLrowii}{9}
\setcounter{DTLrowiii}{0}
\setcounter{DTLrow}{610}
\setcounter{caption@flags}{0}
\setcounter{continuedfloat}{0}
\setcounter{subfigure}{0}
\setcounter{subtable}{0}
\setcounter{mn@abspage}{14}
\setcounter{hv@tempCNTfigA}{0}
\setcounter{hv@tempCNTfigB}{0}
\setcounter{hv@tempCNTtabA}{0}
\setcounter{hv@tempCNTtabB}{0}
\setcounter{hv@pfigure}{0}
\setcounter{hv@ptable}{0}
\setcounter{subhv@pfigure}{0}
\setcounter{subhv@ptable}{0}
\setcounter{LT@tables}{2}
\setcounter{LT@chunks}{1}
\setcounter{tcbbreakpart}{0}
\setcounter{tcblayer}{0}
\setcounter{tcolorbox@number}{0}
\setcounter{tcbrastercolumn}{1}
\setcounter{tcbrasterrow}{1}
\setcounter{tcbrasternum}{1}
\setcounter{tcbraster}{0}
\setcounter{blindtext}{1}
\setcounter{Blindtext}{5}
\setcounter{blind@countparstart}{0}
\setcounter{blindlist}{0}
\setcounter{blindlistlevel}{0}
\setcounter{blindlist@level}{0}
\setcounter{blind@listcount}{0}
\setcounter{blind@levelcount}{0}
\setcounter{blind@randomcount}{0}
\setcounter{blind@randommax}{3}
\setcounter{blind@pangramcount}{0}
\setcounter{blind@pangrammax}{3}
\setcounter{tabx@nest}{0}
\setcounter{listtotal}{0}
\setcounter{listcount}{0}
\setcounter{liststart}{0}
\setcounter{liststop}{0}
\setcounter{citecount}{0}
\setcounter{citetotal}{0}
\setcounter{multicitecount}{0}
\setcounter{multicitetotal}{0}
\setcounter{instcount}{0}
\setcounter{maxnames}{1}
\setcounter{minnames}{1}
\setcounter{maxitems}{3}
\setcounter{minitems}{1}
\setcounter{citecounter}{0}
\setcounter{maxcitecounter}{0}
\setcounter{savedcitecounter}{0}
\setcounter{uniquelist}{0}
\setcounter{uniquename}{0}
\setcounter{refsection}{0}
\setcounter{refsegment}{0}
\setcounter{maxextratitle}{0}
\setcounter{maxextratitleyear}{0}
\setcounter{maxextraname}{0}
\setcounter{maxextradate}{0}
\setcounter{maxextraalpha}{0}
\setcounter{abbrvpenalty}{50}
\setcounter{highnamepenalty}{50}
\setcounter{lownamepenalty}{25}
\setcounter{maxparens}{3}
\setcounter{parenlevel}{0}
\setcounter{blx@maxsection}{1}
\setcounter{mincomprange}{10}
\setcounter{maxcomprange}{100000}
\setcounter{mincompwidth}{1}
\setcounter{afterword}{0}
\setcounter{savedafterword}{0}
\setcounter{annotator}{0}
\setcounter{savedannotator}{0}
\setcounter{author}{0}
\setcounter{savedauthor}{0}
\setcounter{bookauthor}{0}
\setcounter{savedbookauthor}{0}
\setcounter{commentator}{0}
\setcounter{savedcommentator}{0}
\setcounter{editor}{0}
\setcounter{savededitor}{0}
\setcounter{editora}{0}
\setcounter{savededitora}{0}
\setcounter{editorb}{0}
\setcounter{savededitorb}{0}
\setcounter{editorc}{0}
\setcounter{savededitorc}{0}
\setcounter{foreword}{0}
\setcounter{savedforeword}{0}
\setcounter{holder}{0}
\setcounter{savedholder}{0}
\setcounter{introduction}{0}
\setcounter{savedintroduction}{0}
\setcounter{namea}{0}
\setcounter{savednamea}{0}
\setcounter{nameb}{0}
\setcounter{savednameb}{0}
\setcounter{namec}{0}
\setcounter{savednamec}{0}
\setcounter{translator}{0}
\setcounter{savedtranslator}{0}
\setcounter{shortauthor}{0}
\setcounter{savedshortauthor}{0}
\setcounter{shorteditor}{0}
\setcounter{savedshorteditor}{0}
\setcounter{labelname}{0}
\setcounter{savedlabelname}{0}
\setcounter{institution}{0}
\setcounter{savedinstitution}{0}
\setcounter{lista}{0}
\setcounter{savedlista}{0}
\setcounter{listb}{0}
\setcounter{savedlistb}{0}
\setcounter{listc}{0}
\setcounter{savedlistc}{0}
\setcounter{listd}{0}
\setcounter{savedlistd}{0}
\setcounter{liste}{0}
\setcounter{savedliste}{0}
\setcounter{listf}{0}
\setcounter{savedlistf}{0}
\setcounter{location}{0}
\setcounter{savedlocation}{0}
\setcounter{organization}{0}
\setcounter{savedorganization}{0}
\setcounter{origlocation}{0}
\setcounter{savedoriglocation}{0}
\setcounter{origpublisher}{0}
\setcounter{savedorigpublisher}{0}
\setcounter{publisher}{0}
\setcounter{savedpublisher}{0}
\setcounter{language}{0}
\setcounter{savedlanguage}{0}
\setcounter{origlanguage}{0}
\setcounter{savedoriglanguage}{0}
\setcounter{pageref}{0}
\setcounter{savedpageref}{0}
\setcounter{textcitecount}{0}
\setcounter{textcitetotal}{0}
\setcounter{textcitemaxnames}{0}
\setcounter{biburlbigbreakpenalty}{100}
\setcounter{biburlbreakpenalty}{200}
\setcounter{biburlnumpenalty}{0}
\setcounter{biburlucpenalty}{0}
\setcounter{biburllcpenalty}{0}
\setcounter{smartand}{1}
\setcounter{bbx:relatedcount}{0}
\setcounter{bbx:relatedtotal}{0}
\setcounter{cbx@extradatecount}{0}
\setcounter{qr@i}{254}
\setcounter{qr@j}{0}
\setcounter{maski}{0}
\setcounter{maskj}{0}
\setcounter{totalones}{0}
\setcounter{penaltyi}{0}
\setcounter{penaltyii}{0}
\setcounter{penaltyiii}{0}
\setcounter{penaltyiv}{0}
\setcounter{qr@hexchars}{0}
\setcounter{qr@divisionsremaining}{0}
\setcounter{section@level}{1}
\setcounter{Item}{0}
\setcounter{Hfootnote}{1}
\setcounter{bookmark@seq@number}{0}
\setcounter{letternum}{0}
\setcounter{letterdiv}{12}
\setcounter{nhblx@name}{0}
\setcounter{crcListi}{0}
\setcounter{bylawsi}{0}
\setcounter{bylawsii}{0}
\setcounter{bylawsiii}{0}
\setcounter{staffdescriptioni}{0}
\setcounter{staffdescriptionii}{0}
\setcounter{staffdescriptioniii}{0}
\setcounter{aimsi}{0}
\setcounter{workpackagesi}{0}
\setcounter{workpackagesii}{0}
\setcounter{workpackagesiii}{0}
\setcounter{crcCounterFirstMentionExistingResearchStaff}{0}
\setcounter{crcCounterFirstMentionExistingNonResearchStaff}{0}
\setcounter{crcCounterFirstMentionRequestedNonResearchStaff}{0}
\setcounter{crcCounterFirstMentionRequestedResearchStaff}{0}
\setcounter{crcCounterRequestedFunding}{0}
}
