{
	"JSON": {
		"ID": "1ee85f90-bbce-6e50-a100-35043ae2c7ee",
		"label": "",
		"comment": "UUID6 is used"
	},
	"probe": {
            "metadata": {
		"mass_1": "0.1",
		"mass_2": "0.099"
		},
		"info": "Der Versuch findet an meinem Schreibtisch statt und die Masse des Wassers ist in kg angegeben. Die erste Masse ist die Masse kaltem Wasser, während die zweite Masse die Masse warmen Wassers ist. Der Versuch wurde nach dem Skript der Aufgabenstellung ausgeführt."
	}
}