{
	"JSON": {
		"ID": "1ee7d8bb-aacf-6654-84cf-8593bfc4d1ea",
		"label": "",
		"comment": "UUID6 is used"
	},
	"sensor": {
		"name": "Temperature_Sensor",
		"type": "DS18B20",
		"manufacturer": "keyestudio",
		"serial": "3ce1e3805090",
		"comment": "",
		"range": {
			"min": -55,
			"max": 125,
			"units": "degree celsius"
		},
		"accuracy": {
			"value": 0.5,
			"type": "absolute",
			"unit": "degree celsius"
		}
	}
}
