{
	"JSON": {
		"ID": "1ee4d7f7-565f-6f82-8db2-2cf8a3c4cb18",
		"label": "",
		"comment": "UUID6 is used"
	},
	"group": {
		"number": "31",
		"author": "Johannes Bangert, Luca Sommer, Dennis Dibbern",
		"members": "Gruppe 31",
		"experiment": "lavalrotor",
		"testrig_number": "02"
	}
}