{
    "JSON": {
        "ID": "1ee9906d-3e30-62b9-bc15-a1563a348bef",
        "label": "setup_handy",
        "comment": "auto generated with s_create_json_setup_from_template.py"
    },
    "setup": {
        "1ee846ef-4df0-632a-bfdb-ef2ea3181b39": {
            "type": "general",
            "name": "general_info",
            "comment": ""
        },
        "1ee846f1-b588-6d3c-9659-7c3266d530e8": {
            "type": "instrument",
            "name": "raspberry_pi",
            "comment": ""
        },
        "1ee847be-fddd-6ee4-892a-68c4555b0981": {
            "type": "sensor",
            "name": "accelerometer",
            "range": {
                "min": -2,
                "max": 2,
                "units": "standard_gravity"
            },
            "frequency": {
                "value": 800,
                "units": "Hertz"
            },
            "comment": ""
        },
        "1ee9905a-91f4-6297-ba94-5fb5269ab916": {
            "type": "probe",
            "name": "handy",
            "comment": ""
        }
    }
}