{
	"JSON": {
		"ID": "1ee7fb93-512d-6317-ac6a-bead61cbbce8",
		"label": "",
		"comment": "UUID6 is used"
	},
    "comment": "here you can write down something important about this setup file",
    "info": "List below ALL components, you used in your experiment. By using the UUID there is no possibility to mix something up.",
	"setup": {
		"1ee7fb82-cccd-6ace-a38a-b48310d3a471": {
            "type": "group_info",
			"name": "group_info",
            "comment": ""
        },
		"1ee7fb85-0ecc-6b03-acfb-8aee98fd7138": {
            "type": "instrument",
			"name": "raspberry_pi",
            "comment": ""
        },
		"1ee7fb5c-fff6-64bd-85c3-1f77c7b417cc": {
            "type": "sensor",
			"name": "sensor1",
            "comment": ""
            },
		"1ee7fb6d-13df-6b3f-ac90-2dcffab77480": {
            "type": "sensor",
			"name": "sensor2",
            "comment": ""
        },
		"1ee7fb8c-68d4-62e7-add9-099963c08e25": {
            "type": "probe",
			"name": "probe_description",
            "comment": ""
        },
		"add_more_here_if_you_need": {
			"type": "choose your own type, if you miss one",
			"name": "",
			"comment": ""
		}
	}
}