{
	"JSON": {
		"ID": "1ee7fb5c-fff6-64bd-85c3-1f77c7b417cc",
		"label": "",
		"comment": "UUID6 is used"
	},
	"sensor": {
		"name": "Temperature_Sensor",
		"type": "DS18B20",
		"manufacturer": "keyestudio",
		"serial": "3ce10457dd1c",
		"comment": "",
		"range": {
			"min": -55,
			"max": 125,
			"units": "degree_celsius"
		},
		"accuracy": {
			"value": 2,
			"type": "absolute",
			"unit": "degree_celsius"
		}
	}
}
