{
	"JSON": {
		"ID": "1ee82f6e-9429-6e4d-9312-e877f309089c",
		"label": "",
		"comment": "UUID6 is used"
	},
    "comment": "here you can write down something important about this setup file",
    "info": "List below ALL components, you used in your experiment. By using the UUID there is no possibility to mix something up.",
	"setup": {
		"1ee82f5d-cea6-6c4f-811d-6238714c21a6": {
            "type": "group_info",
			"name": "group_info",
            "comment": ""
        },
		"1ee82f60-f59e-6b31-9930-a413695cf476": {
            "type": "instrument",
			"name": "raspberry_pi",
            "comment": ""
        },
		"1ee826b0-73a8-688b-bfef-a7cd6e2c72f8": {
            "type": "sensor",
			"name": "Sensor_Umgebung",
            "comment": "Sensor liegt neben der Tasse für Umgebungstemperatur"
        },
		"1ee82f65-d8f0-65f8-b42f-0a1012b69a9c": {
            "type": "probe",
			"name": "Tasse mit 300 ml heißem Wasser",
            "comment": "nur eine Tasse"
        },
		"1ee826bd-2a13-6977-9009-90c579951249": {
			"type": "sensor",
			"name": "Sensor_Probe",
			"comment": "Sensor liegt in der Tasse"
		}
	}
}