{
	"JSON": {
		"ID": "1ee826b0-73a8-688b-bfef-a7cd6e2c72f8",
		"label": "",
		"comment": "UUID6 is used"
	},
	"sensor": {
		"name": "Temperature_Sensor",
		"type": "DS18B20",
		"manufacturer": "keyestudio",
		"serial": "3c12f648e039",
		"comment": "",
		"range": {
			"min": -55,
			"max": 125,
			"units": "degree"
		},
		"accuracy": {
			"value": 0.5,
			"type": "absolute",
			"unit": "degree_celsius"
		}
	}
}
