[2021/11/16T12:03:26] JOB CONFIGURATION ----------------------
JobId=32206005 JobName=SmileiPIC1D UserId=dkreuter(10446) GroupId=bhs(1201) MCS_label=N/A Priority=548 Nice=0 Account=bhs QOS=normal JobState=RUNNING Reason=None Dependency=(null) Requeue=1 Restarts=0 BatchFlag=1 Reboot=0 ExitCode=0:0 DerivedExitCode=0:0 RunTime=00:00:01 TimeLimit=05:00:00 TimeMin=N/A SubmitTime=2021-11-16T11:36:55 EligibleTime=2021-11-16T11:36:55 AccrueTime=2021-11-16T11:36:55 StartTime=2021-11-16T12:03:25 EndTime=2021-11-16T17:03:25 Deadline=N/A PreemptTime=None SuspendTime=None SecsPreSuspend=0 LastSchedEval=2021-11-16T12:03:25 Partition=main AllocNode:Sid=lxbk0599:76466 ReqNodeList=(null) ExcNodeList=(null) NodeList=lxbk1074 BatchHost=lxbk1074 NumNodes=1 NumCPUs=64 NumTasks=1 CPUs/Task=64 ReqB:S:C:T=0:0:*:* TRES=cpu=64,mem=128G,node=1,billing=96 Socks/Node=* NtasksPerN:B:S:C=0:0:*:1 CoreSpec=*   Nodes=lxbk1074 CPU_IDs=86-95,114-127,144-159,176-191,208-215 Mem=131072 GRES_IDX= MinCPUsNode=64 MinMemoryCPU=2G MinTmpDiskNode=0 Features=(null) DelayBoot=00:00:00 OverSubscribe=OK Contiguous=0 Licenses=(null) Network=(null) Command=/lustre/bhs/dkreuter/smilei-wrapper exec --bind /lustre/bhs/dkreuter/ /lustre/bhs/dkreuter/singularity-smilei-unofficial_pic.sif smilei /lustre/bhs/dkreuter/vega_init/1dLorentzBoostTNSA.py WorkDir=/lustre/bhs/dkreuter/vega_init/ StdErr=/lustre/bhs/dkreuter/vega_init//slurm-32206005.out StdIn=/dev/null StdOut=/lustre/bhs/dkreuter/vega_init//slurm-32206005.out Power=
[2021/11/16T12:03:26] JOB CONFIGURATION END ------------------
[2021/11/16T12:03:26] JOB ENVIRONMENT ------------------------
SLURM_CHECKPOINT_IMAGE_DIR=/var/spool/slurm/ckpt
SLURM_NODELIST=lxbk1074
SLURM_JOB_NAME=SmileiPIC1D
SLURM_TOPOLOGY_ADDR=lxbk1074
SLURM_PRIO_PROCESS=0
SLURM_NODE_ALIASES=(null)
SLURM_JOB_QOS=normal
SLURM_TOPOLOGY_ADDR_PATTERN=node
SLURM_MEM_PER_CPU=2048
SLURM_NNODES=1
SLURM_JOBID=32206005
SLURM_NTASKS=1
SLURM_TASKS_PER_NODE=1
SLURM_WORKING_CLUSTER=virgo:lxrm08:6817:8448
SLURM_JOB_ID=32206005
SLURM_CPUS_PER_TASK=64
SLURM_JOB_USER=dkreuter
SLURM_JOB_UID=10446
SLURM_NODEID=0
SLURM_SUBMIT_DIR=/lustre/bhs/dkreuter/vega_init
SLURM_TASK_PID=136955
SLURM_NPROCS=1
SLURM_CPUS_ON_NODE=64
SLURM_PROCID=0
SLURM_JOB_NODELIST=lxbk1074
SLURM_LOCALID=0
SLURM_JOB_GID=1201
SLURM_JOB_CPUS_PER_NODE=64
SLURM_CLUSTER_NAME=virgo
SLURM_GTIDS=0
SLURM_SUBMIT_HOST=lxbk0599
SLURM_JOB_PARTITION=main
SLURM_JOB_ACCOUNT=bhs
SLURM_JOB_NUM_NODES=1
[2021/11/16T12:03:26] JOB ENVIRONMENT END --------------------
[2021/11/16T12:03:26] NUMA CONFIGURATION ----------------------
Model name:            AMD EPYC 7662 64-Core Processor
NUMA node0 CPU(s):     0-63,128-191
NUMA node1 CPU(s):     64-127,192-255
[2021/11/16T12:03:26] NUMA CONFIGURATION END ------------------
[2021/11/16T12:03:26] EXEC srun -- exec --bind /lustre/bhs/dkreuter/ /lustre/bhs/dkreuter/singularity-smilei-unofficial_pic.sif smilei /lustre/bhs/dkreuter/vega_init/1dLorentzBoostTNSA.py
slurmstepd: error: execve(): exec: No such file or directory
srun: error: lxbk1074: task 0: Exited with exit code 2
[2021/11/16T12:03:27] PROCESSES -------------------------------
USER        PID CPUID COMMAND
dkreuter 136955    94 /bin/bash /var/spool/slurm/d/job32206005/slurm_script exec --bind /lustre/bhs/dkreuter/ /lustre/bhs/dkreuter/singularity-smilei-unofficial_pic.sif smilei /lustre/bhs/dkreuter/vega_init/1dLorentzBoostTNSA.py
dkreuter 136999   201   ps -u dkreuter -o user,pid,cpuid,args -H
[2021/11/16T12:03:27] PROCESSES END ---------------------------
[2021/11/16T12:03:27] WAIT PID 136969
[2021/11/16T12:03:27] EXIT 2
