{
	"JSON": {
		"ID": "1ee823cd-7650-61c2-9b01-d4744d892e2a",
		"label": "",
		"comment": "UUID6 is used"
	},
	"instrument": {
		"name": "raspberry_pi",
		"type": "single_board_computer",
		"manufacturer": "Raspberry Pi Foundation",
		"model": "Raspberry Pi 4 Model B Rev. 1.5",
		"serial": "1000000011196557",
		"operating_system": "Raspberry Pi OS",
		"comment": "to get model and serial number put this code in the terminal: cat /proc/cpuinfo"
	}
}
