{
	"JSON": {
		"ID": "1ee823b3-32d9-6d20-8261-106b0e021eed",
		"label": "",
		"comment": "UUID6 is used"
	},
	"instrument": {
		"name": "motor_controller",
		"type": "BLDC-8015A",
		"manufacturer": "ACT",
		"power": {
			"value": 24,
			"unit": "Volt"
		},
		"current output": {
			"value": "15",
			"unit": "Ampere"
		}
	}
}
