{
	"JSON": {
		"ID": "1ee82390-fe66-6616-afe1-1e0caa4af095",
		"label": "setup_testrig_2",
		"comment": "UUID6 is used"
	},

	"setup": {
		"1ee4d7f7-565f-6f82-8db2-2cf8a3c4cb18": {
            "type": "group",
			"name": "group_info",
            "comment": ""
        },
		"1ee823cc-06c7-631a-99e2-dc18593ae07a": {
            "type": "instrument",
			"name": "raspberry_pi",
            "comment": ""
        },
		"1ee823b3-32d9-6d20-8261-106b0e021eed": {
            "type": "instrument",
			"name": "motor_controller",
            "comment": ""
        },
		"1ee82398-0056-698f-8809-248cede81c54": {
            "type": "actor",
			"name": "brushless_DC_motor",
            "comment": ""
        },
		"1ee823d3-8511-6a0b-8cd5-972f083673c9": {
            "type": "sensor",
			"name": "accelerometer",
            "range": {
                    "min": -4,
                    "max": 4,
                    "units": "standard_gravity"
            },
            "frequency": {
				    "value": 800,
				    "units": "Hertz"
			},
            "comment": ""
        },
		"1ee82401-4cd8-6cfe-9361-94ad3de2c09f": {
            "type": "part",
			"name": "disk_1",
            "comment": ""
        },
        "1ee82402-4f35-66bf-8b8c-4139ef94845e": {
            "type": "part",
			"name": "disk_2",
            "comment": ""
        },
		"1ee823ea-d797-6597-b7a5-7622897ad72e": {
            "type": "part",
			"name": "shaft",
            "comment": ""
        },
		"1ee82412-f308-6b61-9485-c682467ffa8c": {
            "type": "part",
			"name": "touchdown_bearing_1",
            "comment": ""
        },
        "1ee82413-f38a-667d-a9fe-21a6ccce16a3": {
            "type": "part",
			"name": "touchdown_bearing_2",
            "comment": ""
        },
		"1ee823a0-e8a4-601b-9043-f583956451d4": {
            "type": "instrument",
			"name": "digital_analog_converter",
            "comment": ""
        }
	}
}