AWS1080p.mp4,ElectronMicroscope.jpg,fruits.jpeg,harvard.wav,pipeline.py,pipeline_runner.py,Run18032020124307.h5,un18032020124307BigModified.h5,18032020124307SmallModified.h5,TemperatureData.hdf5,TestText.txt,TestTextChangedCopy.txt,TestTextCompleteCopy.txt,TextCopyDifferentTimestamp.txt,TicketTest.JPG,TicketTest.txt,_version.py
1,0,0,0,0,0.05057897175,0,0,0,0,0,0,0,0,0,0,0
0,1,0.2957887701,0.02132936508,0,0,0,0,0,0,0.01283783784,0.01283783784,0,0,0.1046439146,0,0
0,0.2957887701,1,0.02331002331,0,0,0,0,0,0,0.01354489164,0.01354489164,0,0,0.09206169749,0,0
0,0.02132936508,0.02331002331,1,0,0,0,0,0,0,0.01884920635,0.01884920635,0,0,0.005557099194,0,0
0,0,0,0,1,0.02393734916,0,0,0,0,0.009180035651,0.009180035651,0.009180035651,0.009180035651,0.01168747999,0.02573116789,0.02075098814
0.05057897175,0,0,0,0.02393734916,1,0,0,0,0,0.03861818182,0.03861818182,0.03861818182,0.03861818182,0.0162019903,0.01935024433,0
0,0,0,0,0,0,1,0.6990020707,0.9979904628,0.0002516634163,0,0,0,0,0,0,0
0,0,0,0,0,0,0.6990020707,1,0.7001212178,0.0009573145462,0,0,0,0,0,0,0
0,0,0,0,0,0,0.9979904628,0.7001212178,1,0.0002533344881,0,0,0,0,0,0,0
0,0,0,0,0,0,0.0002516634163,0.0009573145462,0.0002533344881,1,0,0,0,0,0,0,0
0,0.01283783784,0.01354489164,0.01884920635,0.009180035651,0.03861818182,0,0,0,0,1,0.843045843,0.9045454545,0.9045454545,0.009417710822,0.005783271886,0
0,0.01283783784,0.01354489164,0.01884920635,0.009180035651,0.03861818182,0,0,0,0,0.843045843,1,0.8182983683,0.8182983683,0.009417710822,0.005783271886,0
0,0,0,0,0.009180035651,0.03861818182,0,0,0,0,0.9045454545,0.8182983683,1,0.9292929293,0.004680415387,0.005783271886,0
0,0,0,0,0.009180035651,0.03861818182,0,0,0,0,0.9045454545,0.8182983683,0.9292929293,1,0.004680415387,0.005783271886,0
0,0.1046439146,0.09206169749,0.005557099194,0.01168747999,0.0162019903,0,0,0,0,0.009417710822,0.009417710822,0.004680415387,0.004680415387,1,0.5886671468,0
0,0,0,0,0.02573116789,0.01935024433,0,0,0,0,0.005783271886,0.005783271886,0.005783271886,0.005783271886,0.5886671468,1,0.02766798419
0,0,0,0,0.02075098814,0,0,0,0,0,0,0,0,0,0,0.02766798419,1