AWS1080p,ElectronMicroscope,fruits,harvard,pipeline,pipeline_runner,Run18032020124307,Run18032020124307BigModified,Run18032020124307SmallModified,TemperatureData,TestText,TestTextChangedCopy,TestTextCompleteCopy,TestTextCopyDifferentTimestamp,TicketTest,TicketTest,_version
1,0.1813621205,0.04336305451,0.3840406448,0.01548568664,0.01106724812,0.7121064896,0.712314427,0.712106413,0.3152120743,0.001689265237,0.001702678281,0.001689265237,0.001689265237,0.0436215555,0.00396866034,0.0007701551168
0.1813621205,1,0.2875552049,0.6442453337,0.1153517883,0.09064447154,0.08644402302,0.08645981039,0.08644296394,0.6379456895,0.01531207088,0.01509989339,0.01531207088,0.01531207088,0.284403183,0.0357594631,0.003504008002
0.04336305451,0.2875552049,1,0.03968594923,0.4668686485,0.3583537923,0.003235792087,0.003213029444,0.003235897369,0.1449462644,0.06032451207,0.05991445485,0.06032451207,0.06032451207,0.8674062193,0.1409669841,0.02286136877
0.3840406448,0.6442453337,0.03968594923,1,0.01870847008,0.01497676429,0.2270675563,0.2271325587,0.2270673506,0.7262822878,0.003901727159,0.003935534249,0.003901727159,0.003901727159,0.03990632248,0.007154626987,0.002484809348
0.01548568664,0.1153517883,0.4668686485,0.01870847008,1,0.947006845,0.001587322511,0.001530253773,0.001587322616,0.03415594696,0.1949302036,0.1958388899,0.1949302036,0.1949302036,0.1914092877,0.4186360894,0.08295073229
0.01106724812,0.09064447154,0.3583537923,0.01497676429,0.947006845,1,0.001405295296,0.001409147084,0.001405295389,0.02597879764,0.2225639637,0.2230750367,0.2225639637,0.2225639637,0.0817200967,0.5119473633,0.1107105502
0.7121064896,0.08644402302,0.003235792087,0.2270675563,0.001587322511,0.001405295296,1,0.9997062913,0.9999998701,0.1785704269,0.0005233393059,0.0005233253387,0.0005233393059,0.0005233393059,0.002980705804,0.0004990542848,0.0003524639253
0.712314427,0.08645981039,0.003213029444,0.2271325587,0.001530253773,0.001409147084,0.9997062913,1,0.9997064211,0.1786183945,0.0005371474,0.0005372058855,0.0005371474,0.0005371474,0.002970542848,0.0005059831965,0.000352567485
0.712106413,0.08644296394,0.003235897369,0.2270673506,0.001587322616,0.001405295389,0.9999998701,0.9997064211,1,0.178570153,0.0005233393405,0.0005233253733,0.0005233393405,0.0005233393405,0.002976585487,0.0004990543179,0.0003524639486
0.3152120743,0.6379456895,0.1449462644,0.7262822878,0.03415594696,0.02597879764,0.1785704269,0.1786183945,0.178570153,1,0.003780578544,0.003781420773,0.003780578544,0.003780578544,0.1484836174,0.003739022285,0.002477003819
0.001689265237,0.01531207088,0.06032451207,0.003901727159,0.1949302036,0.2225639637,0.0005233393059,0.0005371474,0.0005233393405,0.003780578544,1,0.9918127712,1,1,0.02049160915,0.5410138941,0.5800188432
0.001702678281,0.01509989339,0.05991445485,0.003935534249,0.1958388899,0.2230750367,0.0005233253387,0.0005372058855,0.0005233253733,0.003781420773,0.9918127712,1,0.9918127712,0.9918127712,0.02060034792,0.5403833815,0.5830967146
0.001689265237,0.01531207088,0.06032451207,0.003901727159,0.1949302036,0.2225639637,0.0005233393059,0.0005371474,0.0005233393405,0.003780578544,1,0.9918127712,1,1,0.02049160915,0.5410138941,0.5800188432
0.001689265237,0.01531207088,0.06032451207,0.003901727159,0.1949302036,0.2225639637,0.0005233393059,0.0005371474,0.0005233393405,0.003780578544,1,0.9918127712,1,1,0.02049160915,0.5410138941,0.5800188432
0.0436215555,0.284403183,0.8674062193,0.03990632248,0.1914092877,0.0817200967,0.002980705804,0.002970542848,0.002976585487,0.1484836174,0.02049160915,0.02060034792,0.02049160915,0.02049160915,1,0.008344957196,0.01680253557
0.00396866034,0.0357594631,0.1409669841,0.007154626987,0.4186360894,0.5119473633,0.0004990542848,0.0005059831965,0.0004990543179,0.003739022285,0.5410138941,0.5403833815,0.5410138941,0.5410138941,0.008344957196,1,0.2353695833
0.0007701551168,0.003504008002,0.02286136877,0.002484809348,0.08295073229,0.1107105502,0.0003524639253,0.000352567485,0.0003524639486,0.002477003819,0.5800188432,0.5830967146,0.5800188432,0.5800188432,0.01680253557,0.2353695833,1