search intention: Experi./Simu. not Anal.

682
552
651
541
539
551
606
558
553
542
550
566
541
545
549
549
546
550
541
551
558
559
569
569
533
539
530
551
544
533
555
557
580
602
627
572
532
551
550
558
562
552
552
548
561
560
551
543
543
556
552
546
537
536
540
535
532
583
537
544
545
544
551
571
550
555
558
551
556
563
548
555
583
544
544
561
551
545
530
532
542
570
544
555
553
557
560
548
543
551
545
559
562
576
570
565
540
541
545
549
555
avg time: 553,87
max deviation: 97,13
standard deviation: 18