search intention: Newest Version Res. 2

486
312
362
396
318
313
320
353
316
315
339
336
334
308
306
304
329
307
315
308
305
336
324
328
313
314
320
307
344
313
317
323
334
306
302
327
306
324
304
308
315
308
337
310
334
321
315
326
307
319
323
302
303
331
314
313
315
304
308
384
311
314
307
313
338
302
336
314
338
317
302
303
308
313
305
300
301
310
318
331
314
307
308
352
308
319
326
310
305
299
310
382
332
315
320
312
305
334
316
321
305
avg time: 319,16
max deviation: 76,84
standard deviation: 17
