search intention: Pub. < 2015 Oo. Softw.

496
391
426
458
397
383
396
401
398
403
384
389
452
397
409
388
385
430
397
407
385
397
399
378
401
390
387
396
387
407
402
389
386
392
396
389
388
399
384
403
399
417
399
389
411
390
389
410
388
406
428
387
394
385
392
385
400
389
382
387
407
411
395
389
400
386
380
392
391
387
400
386
401
402
386
393
386
394
377
410
388
383
399
380
390
403
386
387
422
389
412
390
397
383
398
387
387
382
413
386
408
avg time: 396,16
max deviation: 61,84
standard deviation: 14
