search intention: Created in 2007

735
709
546
530
540
544
528
567
533
539
542
568
551
541
536
549
541
538
557
577
529
553
532
575
565
581
531
544
536
548
561
547
627
549
544
577
559
548
536
535
524
540
542
536
552
537
549
544
546
551
555
540
538
537
540
542
589
523
533
566
531
556
546
554
544
537
571
615
568
568
555
575
562
534
538
568
536
539
552
542
537
534
567
547
562
573
541
552
531
537
537
542
542
564
533
538
545
546
548
548
542
avg time: 550,54
max deviation: 158,46
standard deviation: 20
