search intention: Pub. < 2015 Oo. Softw.

586
572
677
566
545
551
546
584
535
529
542
526
557
533
555
548
524
548
544
541
534
542
524
546
530
551
552
529
554
545
550
537
536
536
555
611
548
551
553
535
557
538
529
542
524
545
543
544
539
537
564
533
537
530
555
528
545
524
569
540
529
543
560
541
532
527
534
559
539
555
534
551
561
635
578
555
537
542
539
537
570
546
522
532
576
543
535
552
537
540
552
535
543
544
528
538
544
542
562
544
560
avg time: 546,98
max deviation: 130,02
standard deviation: 21
