search intention: Pub. T. Pyn. Created 2016 Oo Softw.

680
592
677
574
548
570
536
548
540
532
564
554
560
541
543
584
543
550
539
544
545
548
562
563
540
542
538
547
552
543
544
550
554
555
540
535
548
550
536
579
549
541
559
593
545
571
542
537
546
533
554
571
577
532
558
538
544
533
553
541
548
535
567
532
570
536
538
534
527
589
616
558
545
547
551
545
554
553
581
543
589
544
695
616
559
551
528
553
524
558
527
560
557
543
531
548
541
535
544
544
534
avg time: 553,77
max deviation: 141,23
standard deviation: 26
