4604
3128
3144
3759
3933
3331
3102
3099
3250
3114
3115
3371
3087
3121
3096
3283
3095
3161
3245
3121
3081
3272
3174
3459
3071
3404
3195
3069
3114
3420
3104
3103
3085
3320
3226
3245
3111
3532
3196
3105
3055
3080
3393
3166
3123
3100
3138
3174
3122
3088
3127
3111
3269
3134
3097
3270
3215
3310
3724
3074
3101
3178
3047
3096
3127
3092
3063
3060
3100
3101
3146
3212
3094
3243
3600
3529
3124
3073
3302
3120
3057
3106
3348
3251
3080
3078
3164
3098
3328
3269
3129
3122
3170
3558
3743
3092
3148
3124
3080
3129
avg time: 3216,97
max deviation: 1387,03
standard deviation: 220
