search intention: Non Comput. Human Consci.

511
399
393
480
414
402
405
400
401
403
397
405
411
391
407
388
400
396
426
413
405
393
389
380
424
389
419
388
398
393
406
397
393
381
417
383
404
391
431
480
505
428
399
445
418
426
407
494
502
402
418
416
422
405
398
439
399
402
417
408
442
443
435
410
451
406
406
425
408
414
397
424
412
405
434
417
412
405
432
432
413
417
395
427
406
396
392
411
409
397
399
404
417
427
413
412
424
415
434
411
426
avg time: 413,97
max deviation: 91,03
standard deviation: 23
