search intention: Av. s. 03.07.20

440
329
327
505
318
340
360
322
331
338
321
316
318
317
330
322
321
320
330
342
320
339
321
332
327
331
317
334
316
333
320
338
338
333
322
328
327
322
323
321
316
312
348
317
318
336
333
311
323
325
321
318
329
315
315
322
339
333
334
327
324
340
323
323
338
321
321
361
332
318
342
320
326
333
335
335
332
326
322
359
337
338
325
331
319
339
317
322
323
319
314
327
319
319
316
329
316
340
316
333
312
avg time: 328,83
max deviation: 176,17
standard deviation: 20
