search intention: Av. s. 03.07.20

https://purl.org/coscine/md/03491440a52c419cbf706401d35d45af/
https://purl.org/coscine/md/0a9a9f59d0154e87aff2e1d10ad762d4/
https://purl.org/coscine/md/0add1c7a927949afb5066903dbdd6bfd/
https://purl.org/coscine/md/0aea15aa6cc94b348b9c4919e57121fd/
https://purl.org/coscine/md/0b2f66c876f848b2972008823a12bb1b/
https://purl.org/coscine/md/1718b37900404854ab062442aed0b516/
https://purl.org/coscine/md/2686e92121d44e1e9d7f6d493aabb5e1/
https://purl.org/coscine/md/27c5dfa31b5040be8422924d3b28e2a3/
https://purl.org/coscine/md/46640676a69640bba16d687a211f8151/
https://purl.org/coscine/md/8e80a2b4187a491e9bd926e64fc5c372/
https://purl.org/coscine/md/929f02e54cce4e738ebdbb95179af9a8/
https://purl.org/coscine/md/9d8858324d4a465fb7413ee8e9ad556f/
https://purl.org/coscine/md/c58d1a58ae8a4d41af84dd2f0bee3da6/
https://purl.org/coscine/md/ed8c2be9e06e41268eb68b8b3f8cf161/
https://purl.org/coscine/md/3d7e671d841c4d5fb3a338f0653df884/
https://purl.org/coscine/md/4bcd9746dcc74dea943cd20050de5fd1/
https://purl.org/coscine/md/53bc23ebf16f4220a3ac49dcb2f83c8c/
https://purl.org/coscine/md/c620d778f1344c7f907d7283744bfdbb/
