search intention: Published at IT Center

1023
373
208
206
416
225
213
219
208
244
215
202
206
248
204
214
208
206
207
212
220
206
204
265
257
206
225
205
207
222
212
208
236
223
215
202
215
211
209
208
218
227
260
244
259
284
227
203
207
208
215
220
220
209
227
207
203
219
211
205
225
224
206
227
218
210
206
206
228
206
219
211
206
237
207
207
235
212
207
222
208
206
226
208
206
210
212
206
212
220
204
209
248
207
204
220
230
205
218
217
208
avg time: 220,66
max deviation: 195,34
standard deviation: 29
