search intention: Non Comput. Human Consci.

[11,096368;    https://purl.org/coscine/md/c58d1a58ae8a4d41af84dd2f0bee3da6/]
[9,346228;    https://purl.org/coscine/md/929f02e54cce4e738ebdbb95179af9a8/]
