search intention: Version 10

467
394
515
398
421
395
406
399
401
391
412
389
401
396
429
402
403
401
403
406
427
396
446
421
396
463
415
453
442
407
413
405
401
403
396
411
399
484
400
415
410
417
407
408
392
406
401
431
394
399
412
414
398
408
408
396
399
403
395
398
397
391
395
400
404
389
408
412
392
398
399
390
404
404
401
405
406
400
406
401
412
425
419
399
398
396
410
386
411
394
422
396
430
390
406
414
408
394
401
405
438
avg time: 408,07
max deviation: 106,93
standard deviation: 19
