search intention: Computer Science

https://purl.org/coscine/md/cf9c050d718e48679ca2b46ed44da9c0/
https://purl.org/coscine/md/36937adfb4814bbf87f7541f1d640232/
https://purl.org/coscine/md/46640676a69640bba16d687a211f8151/
https://purl.org/coscine/md/4bcd9746dcc74dea943cd20050de5fd1/
