search intention: Published at IT Center

1451
922
528
403
430
386
383
403
395
382
386
394
380
391
389
391
430
445
466
412
397
391
384
391
377
387
395
381
397
412
383
398
378
392
389
382
393
387
404
435
390
423
396
383
393
385
396
395
403
395
393
402
392
398
396
385
395
379
387
388
385
398
387
380
392
404
390
395
377
399
379
387
400
388
390
394
384
396
408
410
415
390
388
377
400
383
378
389
376
415
384
379
426
381
393
383
382
399
382
394
409
avg time: 401,09
max deviation: 520,91
standard deviation: 56
