search intention: Version 10

416
341
326
355
549
419
439
611
400
352
384
488
395
329
325
429
374
365
336
326
490
346
327
337
519
338
377
324
337
329
348
325
320
333
327
329
320
331
324
323
320
375
361
338
353
325
332
327
330
349
335
349
341
340
319
331
335
324
324
323
322
334
322
322
328
322
326
331
333
372
355
335
327
332
322
327
360
330
321
340
446
341
325
344
331
325
423
371
334
355
515
412
330
318
321
338
323
324
330
330
318
avg time: 353,93
max deviation: 257,07
standard deviation: 53
