search intention: Experi./Simu. not Anal.

3311
3165
3206
3281
3200
3217
3191
3195
3235
3313
3179
3226
3224
3367
3213
3176
3176
3199
3170
3178
3191
3249
3203
3217
3198
3233
3215
3312
3162
3174
3175
3189
3177
3198
3206
3201
3161
3206
3189
3426
3202
3183
3155
3190
3285
3338
3180
3198
3164
3215
3209
3205
3176
3225
3168
3155
3238
3300
3158
3156
3155
3170
3206
3321
3205
3238
3209
3201
3198
3214
3207
3227
3209
3248
3189
3254
3174
3188
3207
3181
3238
3340
3215
3187
3191
3231
3180
3162
3171
3184
3197
3183
3188
3238
3219
3215
3187
3181
3223
3417
3214
avg time: 3212,55
max deviation: 213,45
standard deviation: 51