search intention: Experi./Simu. not Anal.

https://purl.org/coscine/md/0add1c7a927949afb5066903dbdd6bfd/
https://purl.org/coscine/md/0b2f66c876f848b2972008823a12bb1b/
https://purl.org/coscine/md/33d5870ffbdc4af9ac1f2704a7a2addf/
https://purl.org/coscine/md/3d7e671d841c4d5fb3a338f0653df884/
https://purl.org/coscine/md/5071a48a4ef5482ba7e929a30eb04316/
https://purl.org/coscine/md/52a9188096c5425a8b81376ac65d0369/
https://purl.org/coscine/md/5d2f09c405b24bf386f1c9799bc8e7ce/
https://purl.org/coscine/md/bf77d5676de84976bd0adc15bfaf7cfd/
https://purl.org/coscine/md/c58d1a58ae8a4d41af84dd2f0bee3da6/
https://purl.org/coscine/md/c620d778f1344c7f907d7283744bfdbb/
https://purl.org/coscine/md/03491440a52c419cbf706401d35d45af/
https://purl.org/coscine/md/050af2f3d171402bb81e0ab71f20d98d/
https://purl.org/coscine/md/0a9a9f59d0154e87aff2e1d10ad762d4/
https://purl.org/coscine/md/246e28b27af648d1bc8713074ac4e8e0/
https://purl.org/coscine/md/48022bc369b34fa19fc33bf7df688b97/
https://purl.org/coscine/md/4d7233a1731643008901de1e45bc06d7/
https://purl.org/coscine/md/53bc23ebf16f4220a3ac49dcb2f83c8c/
https://purl.org/coscine/md/8e80a2b4187a491e9bd926e64fc5c372/
https://purl.org/coscine/md/929f02e54cce4e738ebdbb95179af9a8/
https://purl.org/coscine/md/9d8858324d4a465fb7413ee8e9ad556f/
https://purl.org/coscine/md/cf9c050d718e48679ca2b46ed44da9c0/
https://purl.org/coscine/md/f6ba6223042445f6ad9445c95c166a01/
