search intention: Newest Version Res. 2

671
532
708
543
544
541
538
539
554
545
535
538
558
551
544
567
583
536
540
616
549
606
522
536
561
601
642
663
650
557
528
543
532
565
549
536
531
529
560
556
552
580
568
530
537
531
536
538
528
548
545
552
540
534
539
551
538
559
536
550
556
552
547
542
542
543
561
540
532
537
563
528
541
544
535
535
525
543
541
550
530
568
542
550
555
534
524
526
542
528
544
521
563
529
529
536
537
531
563
602
532
avg time: 550,63
max deviation: 157,37
standard deviation: 30
