search intention: Pub. T. Pyn. Created 2016 Oo Softw.

384
291
368
373
297
288
296
306
300
366
302
317
301
318
347
294
348
319
321
325
300
338
300
307
305
301
344
310
374
299
359
310
312
360
299
352
307
320
347
302
318
298
306
299
292
331
322
338
314
302
284
281
305
311
293
288
285
307
292
288
313
317
308
290
283
292
279
322
325
286
353
288
295
290
307
307
305
314
287
295
285
287
323
300
315
285
292
331
293
296
298
304
292
290
295
302
290
291
289
305
295
avg time: 308,91
max deviation: 65,09
standard deviation: 22
