search intention: Non Comput. Human Consci.

603
589
539
699
544
570
522
525
542
547
548
548
548
557
765
818
1202
702
719
523
535
520
527
537
542
554
549
541
537
549
535
540
533
548
584
544
525
540
547
534
540
525
532
546
539
558
540
531
535
523
547
557
552
596
596
550
533
542
531
532
528
551
543
547
550
562
602
533
542
547
542
550
554
556
557
566
545
564
601
579
578
568
547
544
567
552
547
551
542
554
553
545
548
536
548
541
545
547
550
544
559
avg time: 564,18
max deviation: 637,82
standard deviation: 79
