search intention: Published at IT Center

https://purl.org/coscine/md/929f02e54cce4e738ebdbb95179af9a8/
https://purl.org/coscine/md/1718b37900404854ab062442aed0b516/
https://purl.org/coscine/md/0a9a9f59d0154e87aff2e1d10ad762d4/
