{
    "name": "Coscine Web UI",
    "dockerComposeFile": [ "compose.yml" ],
    "service": "dev",
    "workspaceFolder": "/workspace/app",
    "updateRemoteUserUID": false,
    "remoteUser": "node",
    "containerUser": "node",
    "customizations": {
        "vscode": {
            "extensions": [
                "vue.volar",
                "vitest.explorer",
                "arcanis.vscode-zipfs",
                "esbenp.prettier-vscode",
                "dbaeumer.vscode-eslint",
                "mhutchie.git-graph",
                "mutantdino.resourcemonitor",
                "ms-ceintl.vscode-language-pack-de"
            ]
        }
    }
}