<?xml version="1.0" encoding="UTF-8" standalone="no"?>
<svg
   xmlns:dc="http://purl.org/dc/elements/1.1/"
   xmlns:cc="http://creativecommons.org/ns#"
   xmlns:rdf="http://www.w3.org/1999/02/22-rdf-syntax-ns#"
   xmlns:svg="http://www.w3.org/2000/svg"
   xmlns="http://www.w3.org/2000/svg"
   xmlns:sodipodi="http://sodipodi.sourceforge.net/DTD/sodipodi-0.dtd"
   xmlns:inkscape="http://www.inkscape.org/namespaces/inkscape"
   height="23.999792"
   viewBox="0 0 24 23.999792"
   width="24"
   id="svg2"
   version="1.1"
   inkscape:version="0.91 r13725"
   sodipodi:docname="phone_grey.svg"
   style="fill:#000000">
  <metadata
     id="metadata12">
    <rdf:RDF>
      <cc:Work
         rdf:about="">
        <dc:format>image/svg+xml</dc:format>
        <dc:type
           rdf:resource="http://purl.org/dc/dcmitype/StillImage" />
        <dc:title></dc:title>
      </cc:Work>
    </rdf:RDF>
  </metadata>
  <defs
     id="defs10" />
  <sodipodi:namedview
     pagecolor="#ffffff"
     bordercolor="#666666"
     borderopacity="1"
     objecttolerance="10"
     gridtolerance="10"
     guidetolerance="10"
     inkscape:pageopacity="0"
     inkscape:pageshadow="2"
     inkscape:window-width="1920"
     inkscape:window-height="1017"
     id="namedview8"
     showgrid="false"
     inkscape:zoom="4.7109302"
     inkscape:cx="-26.231347"
     inkscape:cy="25.601069"
     inkscape:window-x="-8"
     inkscape:window-y="-8"
     inkscape:window-maximized="1"
     inkscape:current-layer="svg2"
     fit-margin-top="0"
     fit-margin-left="0"
     fit-margin-right="0"
     fit-margin-bottom="0" />
  <ellipse
     style="opacity:1;fill:#646567;fill-opacity:1;fill-rule:nonzero;stroke:none;stroke-width:1;stroke-linecap:butt;stroke-linejoin:miter;stroke-miterlimit:4;stroke-dasharray:none;stroke-dashoffset:0;stroke-opacity:1"
     id="path4151"
     cx="12"
     cy="11.999896"
     rx="12"
     ry="11.999896"
     inkscape:export-xdpi="90"
     inkscape:export-ydpi="90" />
  <path
     d="m 0.02544624,0.02534174 23.94910776,0 0,23.94910726 -23.94910776,0 z"
     id="path6"
     inkscape:connector-curvature="0"
     style="fill:none"
     inkscape:export-xdpi="90"
     inkscape:export-ydpi="90" />
  <path
     inkscape:connector-curvature="0"
     d="m 7.9499054,11.089001 c 1.0840402,2.130441 2.8305486,3.869422 4.9609896,4.96099 l 1.656172,-1.656172 c 0.203258,-0.203258 0.504381,-0.271011 0.767862,-0.180674 0.843142,0.278538 1.754037,0.4291 2.687517,0.4291 0.414043,0 0.752805,0.338763 0.752805,0.752805 l 0,2.627292 c 0,0.414043 -0.338762,0.752805 -0.752805,0.752805 -7.068846,0 -12.7976975,-5.728851 -12.7976975,-12.7976973 0,-0.414043 0.3387629,-0.752806 0.7528057,-0.752806 l 2.63482,0 c 0.4140435,0 0.7528058,0.338763 0.7528058,0.752806 0,0.941007 0.1505611,1.844374 0.4290991,2.687517 0.082809,0.263482 0.022582,0.557076 -0.1882017,0.767862 l -1.656172,1.6561723 z"
     id="path6-8"
     style="fill:#ffffff;fill-opacity:1"
     inkscape:export-xdpi="90"
     inkscape:export-ydpi="90" />
</svg>
