<?xml version="1.0" encoding="UTF-8" standalone="no"?>
<svg
   xmlns:dc="http://purl.org/dc/elements/1.1/"
   xmlns:cc="http://creativecommons.org/ns#"
   xmlns:rdf="http://www.w3.org/1999/02/22-rdf-syntax-ns#"
   xmlns:svg="http://www.w3.org/2000/svg"
   xmlns="http://www.w3.org/2000/svg"
   xmlns:sodipodi="http://sodipodi.sourceforge.net/DTD/sodipodi-0.dtd"
   xmlns:inkscape="http://www.inkscape.org/namespaces/inkscape"
   fill="#000000"
   height="24"
   viewBox="0 0 24 24"
   width="24"
   id="svg2"
   version="1.1"
   inkscape:version="0.91 r13725"
   sodipodi:docname="mail_grey.svg">
  <metadata
     id="metadata12">
    <rdf:RDF>
      <cc:Work
         rdf:about="">
        <dc:format>image/svg+xml</dc:format>
        <dc:type
           rdf:resource="http://purl.org/dc/dcmitype/StillImage" />
        <dc:title></dc:title>
      </cc:Work>
    </rdf:RDF>
  </metadata>
  <defs
     id="defs10" />
  <sodipodi:namedview
     pagecolor="#ffffff"
     bordercolor="#666666"
     borderopacity="1"
     objecttolerance="10"
     gridtolerance="10"
     guidetolerance="10"
     inkscape:pageopacity="0"
     inkscape:pageshadow="2"
     inkscape:window-width="1920"
     inkscape:window-height="1017"
     id="namedview8"
     showgrid="false"
     inkscape:zoom="41.414175"
     inkscape:cx="11.629935"
     inkscape:cy="11.560161"
     inkscape:window-x="-8"
     inkscape:window-y="-8"
     inkscape:window-maximized="1"
     inkscape:current-layer="svg2" />
  <ellipse
     style="opacity:1;fill:#646567;fill-opacity:1;fill-rule:nonzero;stroke:none;stroke-width:1;stroke-linecap:butt;stroke-linejoin:miter;stroke-miterlimit:4;stroke-dasharray:none;stroke-dashoffset:0;stroke-opacity:1"
     id="path4151"
     cx="12.134771"
     cy="12.134771"
     rx="12.0255"
     ry="12.025395" />
  <path
     d="m 18.408859,5.8606802 -12.5481811,0 c -0.8626875,0 -1.5606801,0.7058352 -1.5606801,1.5685228 l -0.00784,9.411137 c 0,0.862687 0.7058352,1.568522 1.5685227,1.568522 l 12.5481815,0 c 0.862688,0 1.568523,-0.705835 1.568523,-1.568522 l 0,-9.411137 c 0,-0.8626876 -0.705835,-1.5685228 -1.568523,-1.5685228 z m 0,3.1370455 -6.27409,3.9213063 -6.2740911,-3.9213063 0,-1.5685227 6.2740911,3.921307 6.27409,-3.921307 0,1.5685227 z"
     id="path4"
     style="fill:#ffffff;fill-opacity:1"
     inkscape:connector-curvature="0" />
  <path
     d="m 0.13477096,0.13477135 24.00000004,0 0,23.99999965 -24.00000004,0 z"
     id="path6"
     inkscape:connector-curvature="0"
     style="fill:none" />
</svg>
