{
  "Title": "",
  "Description": "",
  "Contributors": "",
  "Principal investigator(s)": "",
  "SFB 985 sub-projects": "",
  "Related published article DOI": "",
  "Related research data publication DOI(s)": "",
  "Related archived (non-public) research data PID(s)": "",
  "Date archived": "",
  "Keywords": ""
}
