﻿{
  "linked": {
    "name": {
      "de": "Linked",
      "en": "Linked"
    },
    "path": "ResourceTypeLinked\\Coscine.ResourceTypeLinked.dll",
    "className": "ResourceTypeLinked",
    "status": "active",
    "config": {},
    "requiredFields": []
  },
  "rds": {
    "name": {
      "de": "FDS",
      "en": "RDS"
    },
    "path": "ResourceTypeWaterbutlerRDS\\Coscine.ResourceTypeWaterbutlerRDS.dll",
    "className": "ResourceTypeWaterbutlerRDS",
    "status": "active",
    "config": {
      "rdsKey": "coscine/global/rds/ecs-rwth/rds"
    },
    "requiredFields": [
      "Size"
    ]
  },
  "rdsude": {
    "name": {
      "de": "FDS UDE",
      "en": "RDS UDE"
    },
    "path": "ResourceTypeWaterbutlerRDS\\Coscine.ResourceTypeWaterbutlerRDS.dll",
    "className": "ResourceTypeWaterbutlerRDS",
    "status": "active",
    "config": {
      "rdsKey": "coscine/global/rds/ecs-ude/rds"
    },
    "requiredFields": [
      "Size"
    ]
  },
  "rdsnrw": {
    "name": {
      "de": "FDS NRW",
      "en": "RDS NRW"
    },
    "path": "ResourceTypeWaterbutlerRDS\\Coscine.ResourceTypeWaterbutlerRDS.dll",
    "className": "ResourceTypeWaterbutlerRDS",
    "status": "hidden",
    "config": {
      "rdsKey": "coscine/global/rds/ecs-nrw/rds"
    },
    "requiredFields": [
      "Size"
    ]
  },
  "rdstudo": {
    "name": {
      "de": "FDS TUDo",
      "en": "RDS TUDo"
    },
    "path": "ResourceTypeWaterbutlerRDS\\Coscine.ResourceTypeWaterbutlerRDS.dll",
    "className": "ResourceTypeWaterbutlerRDS",
    "status": "hidden",
    "config": {
      "rdsKey": "coscine/global/rds/ecs-tudo/rds"
    },
    "requiredFields": [
      "Size"
    ]
  },
  "s3": {
    "name": {
      "de": "S3",
      "en": "S3"
    },
    "path": "ResourceTypeWaterbutlerS3\\Coscine.ResourceTypeWaterbutlerS3.dll",
    "className": "ResourceTypeWaterbutlerS3",
    "status": "hidden",
    "config": {},
    "requiredFields": [
      "BucketName",
      "AccessKey",
      "SecretKey",
      "ResourceUrl"
    ]
  },
  "rdss3": {
    "name": {
      "de": "FDS S3",
      "en": "RDS S3"
    },
    "path": "ResourceTypeWaterbutlerRdsS3\\Coscine.ResourceTypeWaterbutlerRdsS3.dll",
    "className": "ResourceTypeWaterbutlerRdsS3",
    "status": "active",
    "config": {
      "rdss3Key": "coscine/global/rds/ecs-rwth/rds-s3",
      "userKey": "coscine/global/rds/ecs-rwth/users"
    },
    "requiredFields": [
      "Size"
    ]
  },
  "rdss3ude": {
    "name": {
      "de": "FDS S3 UDE",
      "en": "RDS S3 UDE"
    },
    "path": "ResourceTypeWaterbutlerRdsS3\\Coscine.ResourceTypeWaterbutlerRdsS3.dll",
    "className": "ResourceTypeWaterbutlerRdsS3",
    "status": "active",
    "config": {
      "rdss3Key": "coscine/global/rds/ecs-ude/rds-s3",
      "userKey": "coscine/global/rds/ecs-ude/users"
    },
    "requiredFields": [
      "Size"
    ]
  },
  "rdss3nrw": {
    "name": {
      "de": "FDS S3 NRW",
      "en": "RDS S3 NRW"
    },
    "path": "ResourceTypeWaterbutlerRdsS3\\Coscine.ResourceTypeWaterbutlerRdsS3.dll",
    "className": "ResourceTypeWaterbutlerRdsS3",
    "status": "active",
    "config": {
      "rdss3Key": "coscine/global/rds/ecs-nrw/rds-s3",
      "userKey": "coscine/global/rds/ecs-nrw/users"
    },
    "requiredFields": [
      "Size"
    ]
  },
  "rdss3tudo": {
    "name": {
      "de": "FDS S3 TUDo",
      "en": "RDS S3 TUDo"
    },
    "path": "ResourceTypeWaterbutlerRdsS3\\Coscine.ResourceTypeWaterbutlerRdsS3.dll",
    "className": "ResourceTypeWaterbutlerRdsS3",
    "status": "hidden",
    "config": {
      "rdss3Key": "coscine/global/rds/ecs-tudo/rds-s3",
      "userKey": "coscine/global/rds/ecs-tudo/users"
    },
    "requiredFields": [
      "Size"
    ]
  },
  "gitlab": {
    "name": {
      "de": "Gitlab",
      "en": "Gitlab"
    },
    "path": "ResourceTypeWaterbutlerGitlab\\Coscine.ResourceTypeWaterbutlerGitlab.dll",
    "className": "ResourceTypeWaterbutlerGitlab",
    "status": "hidden",
    "config": {},
    "requiredFields": [
      "RepositoryNumber",
      "RepositoryUrl",
      "Token"
    ]
  }
}