﻿{
  "CanCreate": true,
  "CanRead": true,
  "CanSetResourceReadonly": true,
  "CanUpdate": true,
  "CanUpdateResource": false,
  "CanDelete": true,
  "CanDeleteResource": false,
  "CanList": true,
  "CanCreateLinks": false,
  "IsArchived": false,
  "IsQuotaAvailable": false,
  "IsQuotaAdjustable": false,
  "ResourceCreate": {
    "Components": [
      [

      ],
      [

      ],
      [

      ],
      [

      ]
    ]
  },
  "ResourceContent": {
    "ReadOnly": false,
    "MetadataView": {
      "EditableDataUrl": false,
      "EditableKey": false
    },
    "EntriesView": {
      "Columns": {
        "Always": [
          "name",
          "size"
        ]
      }
    }
  }
}