{
  "Language": "de",
  "SubjectTemplate": "[Coscine] Ressource {{values.resource_name}} gelöscht",
  "MessageTemplate": "{{header}}Die Ressource {{values.resource_name}} wurde aus dem Projekt {{values.project_name}} entfernt und gelöscht.{{footer}}"
}