{
  "Language": "de",
  "SubjectTemplate": "",
  "MessageTemplate": "<ul><li>{{values.resource_display_name}}</li><ul><li><b>Metadatenprofil:</b> {{values.ap_display_name_or_label}}</li><li><b>Persistent Identifier (PID):</b> {{values.resource_pid}}</li><li><b>Ressourcenbeschreibung:</b> {{values.resource_description}}</li><li><b>Disziplin:</b> {{values.resource_disciplines}}</li></ul></ul>"
}
