{
    "Version": "2012-10-17",
    "Id": "WritePolicy",
    "Statement": [
        {
            "Sid": "AllowStatement",
            "Action": [
                "s3:PutObject",
                "s3:GetObject",
                "s3:GetObjectAcl",
                "s3:GetObjectVersion",
                "s3:DeleteObject",
                "s3:DeleteObjectVersion"
            ],
            "Effect": "Allow",
            "Resource": [],
            "Principal": []
        },
        {
            "Sid": "DenyStatement",
            "Action": [
                "s3:GetObject",
                "s3:GetObjectAcl",
                "s3:GetObjectVersion"
            ],
            "Effect": "Deny",
            "Resource": [],
            "Principal": []
        }
    ]
}