{
  "profiles": {
    "Coscine.Api": {
      "commandName": "Project",
      "launchBrowser": true,
      "launchUrl": "coscine/api/swagger",
      "environmentVariables": {
        "ASPNETCORE_ENVIRONMENT": "Development",
        "CONSUL_URL": "http://localhost:8500",
        "ASPNETCORE_URLS": "http://localhost:7206"
      },
      "applicationUrl": "http://localhost:7206",
      "dotnetRunMessages": true
    },
    "Docker": {
      "commandName": "Docker",
      "launchBrowser": true,
      "launchUrl": "{Scheme}://{ServiceHost}:{ServicePort}/coscine/api/swagger",
      "publishAllPorts": true
    }
  },
  "$schema": "https://json.schemastore.org/launchsettings.json"
}