{
  "version": 1,
  "isRoot": true,
  "tools": {
    "gitversion.tool": {
      "version": "6.1.0",
      "commands": [
        "dotnet-gitversion"
      ],
      "rollForward": false
    },
    "swashbuckle.aspnetcore.cli": {
      "version": "6.5.0",
      "commands": [
        "swagger"
      ],
      "rollForward": false
    },
    "dotnet-version-cli": {
      "version": "3.0.3",
      "commands": [
        "dotnet-version"
      ],
      "rollForward": false
    }
  }
}