{
  "Language": "de",
  "SubjectTemplate": "[Coscine] Ressource {{values.resource_name}} erstellt",
  "MessageTemplate": "{{header}}Die Ressource {{values.resource_name}} wurde im Projekt {{values.project_name}} erstellt.{{footer}}"
}