{
  "Language": "de",
  "SubjectTemplate": "[Coscine] Änderung der E-Mail-Adresse bestätigen",
  "MessageTemplate": "{{header}}Die Änderung Ihrer E-Mail-Adresse wurde in Coscine beantragt. Um die Änderungen abzuschließen, bestätigen Sie die neue Adresse bitte <b>innerhalb von 24 Stunden</b> unter dem folgenden Link: <a href={{values.confirmation_link}}>Link zur Bestätigung</a>. <br/><br/>Wenn der Link nicht funktioniert, können Sie die URL direkt aufrufen: <br/>{{values.confirmation_link}} <br/><br/> Sollten Sie keine Änderung der E-Mail-Adresse in Auftrag gegeben haben, wenden Sie sich bitte an den Servicedesk um Missbrauch auszuschließen.{{footer}}"
}