{
  "Language": "en",
  "SubjectTemplate": "[Coscine] Resource {{values.resource_name}} created",
  "MessageTemplate": "{{header}}The resource {{values.resource_name}} was created in project {{values.project_name}}.{{footer}}"
}