{
  "Language": "en",
  "SubjectTemplate": "[Coscine] Request for PID: {{values.pid}}",
  "MessageTemplate": "{{header}}Dear {{values.requester_name}},<br/><br/>You have made an inquiry about the PID <b>{{values.pid}}</b>.<br/><br/>Your message is forwarded by Coscine to the respective owner(s).<br/><br/><br/>With kind regards<br/>Your Coscine Team<br/><br/>---<br/><br/>Request <br/>Name: <b>{{values.requester_name}}</b><br/>Contact Email: <b>{{values.requester_email}}</b><br/><br/>Message: {{values.requester_message}}<br/>{{footer}}"
}