{
	"JSON": {
		"ID": "1ee823a5-7a86-66bd-aa74-aa5aa4e2ec74",
		"label": "",
		"comment": "UUID6 is used"
	},
	"instrument": {
		"name": "digital analog converter",
		"type": "MCP4725",
		"model": "com-dac01",
		"manufacturer": "joy-it",
		"bus": "i2c",
		"voltage": "5"
	}
}
