{
	"JSON": {
		"ID": "xxxxxxxx-xxxx-xxxx-xxxx-xxxx(UUID)xx",
		"label": "",
		"comment": "UUID6 is used"
	},
    "comment": "Diese setup-file beinhaltet alle notwendigen UUIDs der jeweiligen Json-Files, die für den Versuch Newtonsches Abkühlgesetz benötigt werden",
    "info": "List below ALL components, you used in your experiment. By using the UUID there is no possibility to mix something up.",
	"setup": {
		"1ee7ee3d-b9e0-68b9-ad27-e4a9726a1886": {
            "type": "group_info",
			"name": "group_info",
            "comment": ""
        },
		"1ee7ee41-a313-6818-a6ca-867475f67c0b": {
            "type": "instrument",
			"name": "raspberry_pi",
            "comment": ""
        },
		"1ee7ee1e-5051-605e-bc55-a5821f91babe": {
            "type": "sensor ",
			"name": "sensor 1,
            "comment": "Temperatur des Wassers in der Tasse"
        },
		"1ee7ee4b-1070-6221-a305-9023cc05ce11": {
            "type": "probe",
			"name": "probe_newton",
            "comment": "Probe für den Versuch Newtonsches Abkühlgesetz"
        },
		"1ee7ee1f-0703-63aa-b149-1e12a795f04f": {
			"type": "sensor",
			"name": "sensor 2",
			"comment": "Temperatur in der Umgebung"
		}
	}
}