<?xml version="1.0" encoding="utf-8"?>
<!-- Generator: Adobe Illustrator 27.4.0, SVG Export Plug-In . SVG Version: 6.00 Build 0)  -->
<svg version="1.1" id="Capa_1" xmlns="http://www.w3.org/2000/svg" xmlns:xlink="http://www.w3.org/1999/xlink" x="0px" y="0px"
	 viewBox="0 0 27 44.4" style="enable-background:new 0 0 27 44.4;" xml:space="preserve">
<style type="text/css">
	.st0{fill:none;}
	.st1{fill:#FFFFFF;}
</style>
<g>
	<g>
		<path d="M12,12.4c3.3,0,6-2.7,6-6s-2.7-6-6-6S6,3,6,6.4S8.7,12.4,12,12.4z M12,2.4c2.2,0,4,1.8,4,4s-1.8,4-4,4s-4-1.8-4-4
			S9.8,2.4,12,2.4z"/>
		<path d="M54,14.4v13c0,1.7-1.3,3-3,3v-11c0-2.8-2.2-5-5-5h-5c-0.6,0-1,0.4-1,1v4v1v1h-8c-0.6,0-1,0.4-1,1v3h-6v-3c0-0.6-0.4-1-1-1
			h-8v-1v-1v-4c0-0.6-0.4-1-1-1h-5c-2.8,0-5,2.2-5,5v11c-1.7,0-3-1.3-3-3v-13H0v13c0,2,1.2,3.8,3,4.6v12.4h2v-12h1h1h8v11
			c0,0.6,0.4,1,1,1h3h1h1v-1v-15v-1h3h8h3v1v15v1h1h1h3c0.6,0,1-0.4,1-1v-11h8h1h1v12h2V31.9c1.8-0.8,3-2.5,3-4.6v-13H54z M20,25.4
			h-2h-6v-6h-2v7c0,0.6,0.4,1,1,1h7c0.6,0,1,0.4,1,1v14h-2v-11c0-0.6-0.4-1-1-1H7v-11c0-1.7,1.3-3,3-3h4v3v1v2c0,0.6,0.4,1,1,1h8v2
			H20z M40,30.4c-0.6,0-1,0.4-1,1v11h-2v-14c0-0.6,0.4-1,1-1h7c0.6,0,1-0.4,1-1v-7h-2v6h-6h-2h-3v-2h8c0.6,0,1-0.4,1-1v-2v-1v-3h4
			c1.7,0,3,1.3,3,3v11H40z"/>
		<path d="M19-1.6v3c0,0.4,0.3,0.8,0.7,0.9c0.1,0,0.2,0.1,0.3,0.1c0.3,0,0.6-0.1,0.8-0.4l2.7-3.6H31c1.7,0,3-1.3,3-3v-4
			c0-1.7-1.3-3-3-3H19c-1.7,0-3,1.3-3,3v4C16-3,17.3-1.6,19-1.6z M18-8.6c0-0.6,0.4-1,1-1h12c0.6,0,1,0.4,1,1v4c0,0.6-0.4,1-1,1h-8
			c-0.3,0-0.6,0.1-0.8,0.4L21-1.6v-1c0-0.6-0.4-1-1-1h-1c-0.6,0-1-0.4-1-1V-8.6z"/>
		<rect x="20" y="-7.6" width="10" height="2"/>
	</g>
</g>
<rect id="_x3C_Slice_x3E_" x="27" y="11.4" class="st0" width="29" height="14"/>
<rect x="27" y="7.3" class="st1" width="29" height="37.1"/>
<rect x="14.9" y="-11.6" class="st1" width="26.3" height="11.6"/>
<rect x="18" y="-1.6" class="st1" width="7.3" height="6.2"/>
</svg>
