#log10(E)	total	-9.500000e-01	-8.500000e-01	-7.500000e-01	-6.500000e-01	-5.500000e-01	-4.500000e-01	-3.500000e-01	-2.500000e-01	-1.500000e-01	-5.000000e-02	5.000000e-02
1.625000e+00	0.000000e+00	0.000000e+00	0.000000e+00	0.000000e+00	0.000000e+00	0.000000e+00	0.000000e+00	0.000000e+00	0.000000e+00	0.000000e+00	0.000000e+00	0.000000e+00
1.875000e+00	0.000000e+00	0.000000e+00	0.000000e+00	0.000000e+00	0.000000e+00	0.000000e+00	0.000000e+00	0.000000e+00	0.000000e+00	0.000000e+00	0.000000e+00	0.000000e+00
2.125000e+00	1.883993e-03	2.653457e-03	2.813274e-03	2.473344e-03	2.305216e-03	2.216349e-03	2.143694e-03	1.932602e-03	1.701943e-03	1.399816e-03	8.767628e-04	2.061682e-04
2.375000e+00	1.684873e-02	2.046492e-02	2.197670e-02	2.054581e-02	1.964774e-02	1.958197e-02	1.890584e-02	1.755127e-02	1.628185e-02	1.479275e-02	1.136124e-02	4.207907e-03
2.625000e+00	7.751619e-02	8.789679e-02	9.486086e-02	9.085334e-02	8.916950e-02	8.821226e-02	8.684557e-02	8.124281e-02	7.625850e-02	7.045513e-02	6.061668e-02	2.618270e-02
2.875000e+00	2.698802e-01	2.911871e-01	3.148339e-01	3.055142e-01	3.033413e-01	3.050340e-01	2.992301e-01	2.881779e-01	2.711913e-01	2.557179e-01	2.264048e-01	1.078410e-01
3.125000e+00	8.173225e-01	8.410095e-01	9.105349e-01	9.064782e-01	8.974491e-01	9.160297e-01	9.186595e-01	8.859433e-01	8.368173e-01	7.909548e-01	7.268097e-01	3.590885e-01
3.375000e+00	2.187576e+00	2.193298e+00	2.340330e+00	2.349937e+00	2.372884e+00	2.399784e+00	2.400391e+00	2.367417e+00	2.301405e+00	2.202075e+00	2.063932e+00	1.070206e+00
3.625000e+00	5.349089e+00	5.063176e+00	5.503311e+00	5.678921e+00	5.691909e+00	5.722906e+00	5.889772e+00	5.804760e+00	5.680013e+00	5.548544e+00	5.283081e+00	2.971825e+00
3.875000e+00	1.180912e+01	1.064756e+01	1.144992e+01	1.202900e+01	1.214171e+01	1.243147e+01	1.296267e+01	1.294415e+01	1.287222e+01	1.263511e+01	1.234841e+01	7.434141e+00
4.125000e+00	2.399742e+01	1.920925e+01	2.247317e+01	2.380492e+01	2.433322e+01	2.546462e+01	2.546179e+01	2.641100e+01	2.646506e+01	2.694830e+01	2.713523e+01	1.624493e+01
4.375000e+00	4.418034e+01	3.106298e+01	3.723070e+01	4.104106e+01	4.445795e+01	4.722537e+01	4.668300e+01	4.888560e+01	5.078613e+01	5.143559e+01	5.255760e+01	3.459385e+01
4.625000e+00	7.590041e+01	4.622350e+01	5.929653e+01	6.589677e+01	7.198644e+01	7.835962e+01	7.976250e+01	8.588394e+01	8.936960e+01	9.328664e+01	9.730036e+01	6.746376e+01
4.875000e+00	1.213027e+02	5.675709e+01	8.361721e+01	9.858088e+01	1.096704e+02	1.243239e+02	1.325500e+02	1.397238e+02	1.439787e+02	1.580978e+02	1.694919e+02	1.174083e+02
5.125000e+00	1.809401e+02	6.495504e+01	1.059268e+02	1.341330e+02	1.540537e+02	1.757828e+02	1.894983e+02	2.090928e+02	2.271705e+02	2.500989e+02	2.737632e+02	2.055674e+02
5.375000e+00	2.559065e+02	6.075931e+01	1.218171e+02	1.760258e+02	1.957512e+02	2.315077e+02	2.676459e+02	3.021614e+02	3.330164e+02	3.761159e+02	4.341095e+02	3.155586e+02
5.625000e+00	3.452351e+02	4.751266e+01	1.204120e+02	1.816894e+02	2.289148e+02	2.849504e+02	3.563943e+02	4.188872e+02	4.814327e+02	5.375706e+02	6.468575e+02	4.922457e+02
5.875000e+00	4.484007e+02	3.748192e+01	1.103964e+02	1.804147e+02	2.450101e+02	3.302408e+02	4.165768e+02	5.318607e+02	6.382380e+02	7.488592e+02	9.432721e+02	7.489761e+02
6.125000e+00	5.647963e+02	2.039364e+01	8.505432e+01	1.457159e+02	2.357380e+02	3.305485e+02	4.973648e+02	6.112100e+02	8.304701e+02	1.016459e+03	1.361000e+03	1.077413e+03
6.375000e+00	6.988892e+02	1.027374e+01	6.400536e+01	1.172938e+02	2.051241e+02	3.365100e+02	4.903137e+02	7.465285e+02	9.809263e+02	1.311875e+03	1.856423e+03	1.566555e+03
6.625000e+00	8.431142e+02	4.869857e+00	3.377441e+01	8.312587e+01	1.516432e+02	2.600742e+02	4.517016e+02	7.459595e+02	1.079655e+03	1.653712e+03	2.489980e+03	2.317231e+03
6.875000e+00	1.029851e+03	2.375155e+00	1.482414e+01	4.734840e+01	9.767331e+01	2.095232e+02	4.222980e+02	7.555637e+02	1.190837e+03	2.013165e+03	3.391092e+03	3.179085e+03
7.125000e+00	1.235195e+03	1.220587e+00	6.293030e+00	3.787838e+01	5.440748e+01	1.329271e+02	4.449910e+02	6.465394e+02	1.015935e+03	2.952229e+03	3.963527e+03	4.331195e+03
7.375000e+00	1.520986e+03	5.020159e-01	1.817077e+00	8.580235e+00	3.120547e+01	5.193072e+01	1.496233e+02	6.876666e+02	1.151726e+03	2.356892e+03	6.146436e+03	6.144463e+03
7.625000e+00	1.670547e+03	1.697125e-01	6.276535e-01	4.813215e+00	1.335604e+01	8.796525e+01	1.115032e+02	3.636238e+02	1.044595e+03	2.384502e+03	7.402545e+03	6.962318e+03
7.875000e+00	2.048371e+03	5.238608e-01	3.816783e-01	1.857408e+00	4.119891e+00	2.044332e+01	9.165702e+01	1.941861e+02	5.067541e+02	2.655229e+03	8.653472e+03	1.038648e+04
8.125000e+00	2.419168e+03	2.620553e-02	3.081823e-01	2.326758e+00	4.044391e+00	8.924584e+00	3.022419e+01	2.071748e+02	6.376754e+02	2.486447e+03	1.010471e+04	1.312898e+04
8.375000e+00	2.868292e+03	9.100597e-02	5.052864e-02	4.531146e-01	2.323941e+00	3.871353e+00	1.638313e+01	1.383496e+02	2.830757e+02	2.556859e+03	1.136145e+04	1.717413e+04
8.625000e+00	3.370277e+03	1.209649e-01	1.544977e-02	3.923168e-01	6.342562e-01	1.812988e+00	2.993300e+00	4.078903e+01	2.662170e+02	1.608077e+03	1.374167e+04	2.141033e+04
8.875000e+00	3.819434e+03	2.566769e-03	2.918980e+00	3.079187e-02	7.695262e-01	1.146890e+00	2.232383e+00	1.728538e+01	1.153041e+02	1.884559e+03	1.454757e+04	2.544195e+04
9.125000e+00	0.000000e+00	0.000000e+00	0.000000e+00	0.000000e+00	0.000000e+00	0.000000e+00	0.000000e+00	0.000000e+00	0.000000e+00	0.000000e+00	0.000000e+00	0.000000e+00
