#log10(E)	total	-9.500000e-01	-8.500000e-01	-7.500000e-01	-6.500000e-01	-5.500000e-01	-4.500000e-01	-3.500000e-01	-2.500000e-01	-1.500000e-01	-5.000000e-02	5.000000e-02
1.625000e+00	1.950933e-07	1.615908e-06	1.892814e-07	1.214592e-07	7.673400e-08	3.937364e-08	1.032697e-07	0.000000e+00	0.000000e+00	0.000000e+00	0.000000e+00	0.000000e+00
1.875000e+00	2.058110e-05	1.239260e-04	2.068994e-05	1.499231e-05	1.312074e-05	1.226669e-05	1.418789e-05	1.003847e-05	7.493096e-06	6.823057e-06	2.247991e-06	6.059085e-07
2.125000e+00	8.397189e-04	1.863140e-03	1.055688e-03	9.735672e-04	9.650935e-04	9.339215e-04	9.351434e-04	9.160732e-04	7.255378e-04	5.248814e-04	2.783781e-04	6.548401e-05
2.375000e+00	9.396252e-03	1.322691e-02	1.085487e-02	1.062711e-02	1.112081e-02	1.157224e-02	1.185529e-02	1.119375e-02	9.622382e-03	7.417113e-03	4.856923e-03	1.008833e-03
2.625000e+00	4.927510e-02	5.921918e-02	5.472324e-02	5.447147e-02	5.684772e-02	6.044238e-02	6.030570e-02	5.847581e-02	5.251805e-02	4.525915e-02	3.203235e-02	7.725315e-03
2.875000e+00	1.790306e-01	1.978583e-01	1.932009e-01	1.942109e-01	2.032120e-01	2.094643e-01	2.179634e-01	2.138865e-01	1.998490e-01	1.738559e-01	1.326180e-01	3.317279e-02
3.125000e+00	5.667673e-01	5.926454e-01	5.958611e-01	5.897469e-01	6.197587e-01	6.559457e-01	6.900329e-01	6.849597e-01	6.404123e-01	5.812064e-01	4.553214e-01	1.285494e-01
3.375000e+00	1.585622e+00	1.555809e+00	1.604927e+00	1.633486e+00	1.672784e+00	1.799730e+00	1.913752e+00	1.914738e+00	1.832757e+00	1.695576e+00	1.430898e+00	3.873799e-01
3.625000e+00	3.949996e+00	3.625554e+00	3.850864e+00	4.000222e+00	4.168057e+00	4.374556e+00	4.614455e+00	4.660777e+00	4.654445e+00	4.504429e+00	3.844594e+00	1.152001e+00
3.875000e+00	9.096982e+00	7.852408e+00	8.335833e+00	8.593639e+00	9.219847e+00	9.930582e+00	1.051088e+01	1.146230e+01	1.083764e+01	1.051967e+01	9.562045e+00	3.240497e+00
4.125000e+00	1.874729e+01	1.448385e+01	1.595406e+01	1.747561e+01	1.859144e+01	2.024268e+01	2.146388e+01	2.274486e+01	2.323831e+01	2.312158e+01	2.104184e+01	7.862098e+00
4.375000e+00	3.579945e+01	2.342687e+01	2.897135e+01	3.117950e+01	3.489857e+01	3.750165e+01	3.998533e+01	4.315512e+01	4.487505e+01	4.517177e+01	4.541818e+01	1.919492e+01
4.625000e+00	6.242011e+01	3.607126e+01	4.632689e+01	5.217889e+01	6.031622e+01	6.254676e+01	6.979388e+01	7.508356e+01	7.857320e+01	8.081872e+01	8.646073e+01	3.843735e+01
4.875000e+00	1.004144e+02	4.535537e+01	6.602976e+01	7.597159e+01	9.036837e+01	9.911594e+01	1.119371e+02	1.225648e+02	1.355613e+02	1.417205e+02	1.462193e+02	6.969198e+01
5.125000e+00	1.531572e+02	4.851222e+01	8.296239e+01	1.048462e+02	1.237878e+02	1.460542e+02	1.708614e+02	1.955862e+02	2.137959e+02	2.313313e+02	2.427734e+02	1.242180e+02
5.375000e+00	2.196564e+02	4.798257e+01	9.111111e+01	1.377611e+02	1.639811e+02	1.948050e+02	2.405136e+02	2.771118e+02	3.039440e+02	3.586564e+02	3.824026e+02	2.179065e+02
5.625000e+00	2.957566e+02	4.146768e+01	9.277925e+01	1.523725e+02	1.865653e+02	2.360260e+02	2.974320e+02	3.744221e+02	4.461708e+02	5.022332e+02	5.875698e+02	3.361062e+02
5.875000e+00	3.925869e+02	2.558438e+01	8.062867e+01	1.459199e+02	1.975896e+02	2.783937e+02	3.856239e+02	4.956961e+02	5.853980e+02	7.120328e+02	8.783764e+02	5.330659e+02
6.125000e+00	4.928241e+02	1.725561e+01	6.463878e+01	1.315751e+02	1.951993e+02	2.795931e+02	4.199083e+02	5.809241e+02	7.445404e+02	9.398424e+02	1.250278e+03	7.972637e+02
6.375000e+00	6.115986e+02	7.490168e+00	4.479301e+01	9.571569e+01	1.788463e+02	2.710937e+02	4.069581e+02	6.330758e+02	9.006183e+02	1.220021e+03	1.783551e+03	1.184631e+03
6.625000e+00	7.450435e+02	4.115994e+00	2.522002e+01	6.175574e+01	1.185128e+02	2.215123e+02	3.826813e+02	7.063474e+02	1.042500e+03	1.532938e+03	2.420023e+03	1.678769e+03
6.875000e+00	8.975575e+02	2.161081e+00	9.608390e+00	3.963117e+01	7.337582e+01	1.466697e+02	3.487685e+02	6.833961e+02	1.167748e+03	1.878649e+03	3.189268e+03	2.333065e+03
7.125000e+00	1.068905e+03	1.232331e+00	4.682996e+00	2.035513e+01	4.006626e+01	9.606141e+01	2.540190e+02	5.683407e+02	1.097345e+03	2.101972e+03	4.263527e+03	3.308190e+03
7.375000e+00	1.251803e+03	4.187866e-01	3.171314e+00	6.451575e+00	2.590890e+01	5.582701e+01	1.752033e+02	4.600411e+02	1.034789e+03	2.227862e+03	5.255445e+03	4.523085e+03
7.625000e+00	1.482132e+03	2.403387e-01	2.235493e+00	7.561603e+00	1.351508e+01	3.984293e+01	1.011584e+02	3.138101e+02	9.342057e+02	2.263372e+03	6.718136e+03	5.907147e+03
7.875000e+00	1.719588e+03	3.602688e-01	7.690539e-01	2.886407e+00	8.778108e+00	1.477431e+01	6.377906e+01	1.969506e+02	6.617607e+02	2.247248e+03	7.892512e+03	7.824215e+03
8.125000e+00	2.002262e+03	0.000000e+00	2.082147e-01	3.893867e-01	4.568924e+00	4.567114e+00	3.588224e+01	1.334331e+02	4.621677e+02	2.001266e+03	9.536466e+03	9.838774e+03
8.375000e+00	2.423433e+03	0.000000e+00	8.463977e-01	2.666677e-01	3.281929e-01	6.146839e+00	1.701862e+01	5.706687e+01	2.865851e+02	1.620699e+03	1.124667e+04	1.341564e+04
8.625000e+00	2.848254e+03	0.000000e+00	5.159547e-01	1.054835e+00	6.033632e-02	2.944247e+00	3.724161e+00	1.678529e+01	1.488138e+02	1.295739e+03	1.294837e+04	1.690241e+04
8.875000e+00	3.351743e+03	0.000000e+00	2.363918e-01	2.704262e-01	1.153286e-01	0.000000e+00	3.483207e+00	1.159788e+01	7.623142e+01	6.385655e+02	1.414217e+04	2.198268e+04
9.125000e+00	0.000000e+00	0.000000e+00	0.000000e+00	0.000000e+00	0.000000e+00	0.000000e+00	0.000000e+00	0.000000e+00	0.000000e+00	0.000000e+00	0.000000e+00	0.000000e+00
