<<DATA>>
110.764295 501.602514 23.883892 61.733856 22058.807500 109.764295 -0.160880 
110.787206 501.607451 23.890598 61.751556 22322.301600 109.787206 -0.160880 
110.799654 501.605451 23.893396 61.758314 22163.417100 109.799654 -0.160880 
110.809440 501.613424 23.895123 61.763325 22183.059900 109.809440 -0.160879 
110.817127 501.607982 23.897529 61.769650 22099.768600 109.817127 -0.160880 
110.816245 501.605865 23.897746 61.770479 22215.574700 109.816245 -0.160880 
110.826389 501.614373 23.899752 61.775050 22457.650900 109.826389 -0.160879 
110.831239 501.611367 23.900381 61.776787 22887.602900 109.831239 -0.160880 
110.839090 501.613270 23.902894 61.783263 22414.064000 109.839090 -0.160879 
110.851506 501.611063 23.906015 61.791755 23020.728300 109.851506 -0.160880 
<<END>>
