<<DATA>>
74.975185	0.101027
74.946709	0.102789
74.918196	0.101426
74.889625	0.102124
74.861040	0.104352
74.832421	0.101127
74.803741	0.103188
74.774954	0.102789
74.746201	0.102024
74.717366	0.100628
74.688448	0.100794
74.659493	0.102822
74.630479	0.102157
74.601406	0.102756
74.572322	0.103188
74.543133	0.100961
74.513909	0.104551
74.484648	0.102723
74.455376	0.102457
74.426044	0.101725
74.396654	0.102822
74.367228	0.102689
74.337696	0.102157
74.308176	0.102257
74.278551	0.100861
74.248889	0.102423
74.219215	0.101559
74.189458	0.105847
74.159620	0.102191
74.129768	0.102856
74.099809	0.101792
74.069791	0.102357
74.039806	0.102457
74.009737	0.102224
73.979609	0.102922
73.949420	0.102257
73.919218	0.102590
73.888979	0.103953
73.858678	0.103587
73.828247	0.102590
73.797823	0.102457
73.767363	0.103487
73.736866	0.102789
73.706307	0.103022
73.675664	0.100927
73.644983	0.104817
73.614217	0.101925
73.583415	0.101227
73.552575	0.100861
73.521697	0.101592
73.490760	0.101127
73.459763	0.101958
73.428730	0.103653
73.397660	0.103820
73.366532	0.102623
73.335298	0.101792
73.304048	0.102922
73.272762	0.100695
73.241416	0.102889
73.210032	0.102290
73.178586	0.103953
73.147056	0.103254
73.115487	0.100794
73.083834	0.103653
73.052143	0.102623
73.020392	0.104551
72.988603	0.100695
72.956755	0.101094
72.924892	0.104152
72.892946	0.103055
72.860962	0.100961
72.828895	0.103487
72.796767	0.101360
72.764599	0.103421
72.732370	0.100994
72.700106	0.105216
72.667759	0.103919
72.635376	0.103687
72.602956	0.102490
72.570451	0.102257
72.537909	0.104484
72.505330	0.101825
72.472667	0.103720
72.439967	0.099298
72.407207	0.103254
72.374408	0.101526
72.341500	0.102324
72.308576	0.104518
72.275661	0.104784
72.242615	0.102224
72.209532	0.103155
72.176435	0.103254
72.143324	0.102224
72.110082	0.104484
72.076826	0.102889
72.043509	0.102490
72.010153	0.101592
71.976713	0.102024
71.943213	0.103321
71.909628	0.103321
71.876004	0.101592
71.842318	0.104717
71.808615	0.102191
71.774850	0.105449
71.741047	0.104817
71.707135	0.103820
71.673162	0.105648
71.639175	0.101991
71.605150	0.104052
71.571085	0.103288
71.536937	0.103421
71.502682	0.102955
71.468367	0.101027
71.434061	0.103421
71.399694	0.103188
71.365291	0.102191
71.330829	0.102457
71.296305	0.102822
71.261744	0.105050
71.227170	0.103354
71.192512	0.101858
71.157773	0.101094
71.122974	0.103587
71.088141	0.103387
71.053273	0.103886
71.018323	0.101692
70.983337	0.102922
70.948316	0.104019
70.913167	0.103088
70.878005	0.102390
70.842831	0.101360
70.807553	0.103254
70.772241	0.102789
70.736847	0.102556
70.701418	0.102756
70.665932	0.104784
70.630341	0.102689
70.594761	0.104484
70.559147	0.102324
70.523498	0.101991
70.487701	0.104484
70.451892	0.102723
70.416050	0.104451
70.380150	0.103221
70.344240	0.102789
70.308273	0.101792
70.272226	0.103387
70.236121	0.104385
70.199983	0.105216
70.163837	0.103587
70.127565	0.100495
70.091282	0.102457
70.054943	0.103022
70.018502	0.102024
69.982097	0.103188
69.945661	0.103155
69.909125	0.102590
69.872556	0.104518
69.835887	0.102357
69.799185	0.100063
69.762404	0.103221
69.725616	0.103354
69.688797	0.102058
69.651878	0.104318
69.614952	0.103620
69.577974	0.101459
69.540987	0.102490
69.503925	0.104385
69.466809	0.102157
69.429641	0.104352
69.392350	0.105050
69.355076	0.103986
69.317795	0.102590
69.280415	0.102922
69.243029	0.104385
69.205591	0.105149
69.168078	0.103919
69.130560	0.104451
69.093010	0.103088
69.055385	0.103121
69.017731	0.104385
68.980004	0.105847
68.942225	0.105016
68.904396	0.105216
68.866517	0.102889
68.828587	0.104086
68.790629	0.102889
68.752644	0.104152
68.714609	0.104584
68.676545	0.105482
68.638431	0.105116
68.600218	0.104252
68.561955	0.101293
68.523664	0.102490
68.485275	0.103886
68.446903	0.101692
68.408458	0.104950
68.369987	0.104950
68.331467	0.102157
68.292920	0.103653
68.254346	0.101858
68.215699	0.104451
68.177024	0.102290
68.138298	0.103155
68.099498	0.106546
68.060648	0.104917
68.021724	0.101326
67.982748	0.102856
67.943746	0.103886
67.904693	0.103720
67.865567	0.103254
67.826415	0.104086
67.787212	0.103055
67.748006	0.103487
67.708773	0.102656
67.669444	0.102889
67.630089	0.104252
67.590686	0.103886
67.551256	0.104285
67.511730	0.104352
67.472199	0.102756
67.432594	0.104983
67.392916	0.103886
67.353280	0.105582
67.313525	0.100462
67.273744	0.104684
67.233891	0.104119
67.193988	0.103055
67.154105	0.106313
67.114126	0.103421
67.074075	0.106745
67.034021	0.102224
66.993943	0.106944
66.953769	0.102590
66.913545	0.102590
66.873272	0.100828
66.833020	0.104119
66.792670	0.102290
66.752224	0.104518
66.711728	0.103886
66.671207	0.104883
66.630638	0.104152
66.590020	0.104086
66.549307	0.104983
66.508524	0.102357
66.467762	0.108474
66.426929	0.104750
66.386093	0.104052
66.345256	0.101891
66.304276	0.102756
66.263294	0.106180
66.222264	0.104352
66.181140	0.101759
66.140038	0.103953
66.098864	0.106113
66.057641	0.103520
66.016348	0.102423
65.975009	0.105548
65.933644	0.107077
65.892231	0.104252
65.850723	0.101293
65.809167	0.106313
65.767632	0.105814
65.726002	0.107111
65.684370	0.106080
65.642712	0.106546
65.600982	0.105748
65.559182	0.104484
65.517381	0.104318
65.475462	0.104252
65.433540	0.107011
65.391549	0.104418
65.349533	0.102024
65.307424	0.105515
65.265244	0.104950
65.223089	0.105947
65.180887	0.105648
65.138640	0.104352
65.096324	0.103055
65.053963	0.105016
65.011555	0.102822
64.969079	0.107144
64.926602	0.104850
64.884057	0.104917
64.841445	0.105548
64.798787	0.104917
64.756061	0.106778
64.713313	0.105648
64.670544	0.105648
64.627658	0.106446
64.584774	0.104185
64.541847	0.106546
64.498875	0.104052
64.455810	0.103354
64.412745	0.104152
64.369658	0.105748
64.326433	0.104318
64.283208	0.104717
64.239984	0.106911
64.196667	0.104883
64.153307	0.107543
64.109925	0.107909
64.066451	0.106978
64.022910	0.103454
63.979347	0.105947
63.935761	0.102590
63.892153	0.105249
63.848478	0.105681
63.804758	0.103387
63.760947	0.106280
63.717137	0.104883
63.673280	0.106047
63.629403	0.105714
63.585437	0.105249
63.541429	0.105149
63.497354	0.107077
63.453260	0.105681
63.409099	0.106080
63.364872	0.103454
63.320648	0.106712
63.276287	0.106213
63.231931	0.106612
63.187532	0.106147
63.143161	0.104784
63.098746	0.104750
63.054242	0.105382
63.009718	0.104883
62.965105	0.106014
62.920472	0.105415
62.875820	0.107875
62.831125	0.103886
62.786318	0.108042
62.741516	0.104185
62.696650	0.104651
62.651766	0.105748
62.606841	0.105947
62.561897	0.107909
62.516889	0.104617
62.471838	0.105116
62.426746	0.104917
62.381588	0.108607
62.336458	0.106978
62.291264	0.105515
62.246026	0.105748
62.200701	0.103221
62.155312	0.107044
62.109926	0.106712
62.064453	0.105382
62.018938	0.106612
61.973452	0.107543
61.927878	0.106612
61.882262	0.105980
61.836581	0.107077
61.790882	0.104883
61.745165	0.107343
61.699384	0.107742
61.653536	0.106512
61.607625	0.104019
61.561674	0.105781
61.515708	0.105947
61.469700	0.106213
61.423676	0.106512
61.377589	0.109205
61.331439	0.106180
61.285295	0.108307
61.239089	0.106280
61.192820	0.105980
61.146488	0.107776
61.100162	0.107975
61.053795	0.105648
61.007365	0.106147
60.960942	0.107244
60.914433	0.105947
60.867839	0.107410
60.821274	0.106878
60.774579	0.108873
60.727890	0.107377
60.681163	0.106180
60.634396	0.107909
60.587519	0.107875
60.540624	0.104052
60.493692	0.108640
60.446744	0.108042
60.399735	0.104385
60.352712	0.107676
60.305650	0.105016
60.258505	0.107975
60.211322	0.105249
60.164103	0.107111
60.116777	0.109338
60.069414	0.106978
60.022038	0.105748
59.974624	0.106878
59.927196	0.109670
59.879709	0.107410
59.832140	0.107443
59.784536	0.110069
59.736919	0.107643
59.689267	0.106878
59.641558	0.109737
59.593812	0.108008
59.545984	0.105681
59.498142	0.107742
59.450241	0.107410
59.402303	0.108274
59.354306	0.106213
59.306320	0.107510
59.258229	0.105814
59.210128	0.107177
59.161992	0.107875
59.113822	0.109704
59.065595	0.108141
59.017334	0.107742
58.969018	0.108773
58.920644	0.106745
58.872212	0.108008
58.823770	0.106745
58.775296	0.106778
58.726787	0.106645
58.678197	0.109205
58.629574	0.105382
58.580895	0.107909
58.532159	0.109405
58.483414	0.109072
58.434589	0.107942
58.385732	0.107244
58.336844	0.109205
58.287924	0.106745
58.238951	0.109072
58.189900	0.109172
58.140863	0.109637
58.091818	0.107776
58.042671	0.108673
57.993493	0.107476
57.944261	0.108175
57.894999	0.107609
57.845752	0.108673
57.796357	0.108341
57.747021	0.107776
57.697585	0.106313
57.648164	0.107942
57.598713	0.109405
57.549231	0.106778
57.499695	0.109338
57.450128	0.108972
57.400579	0.108407
57.350931	0.109637
57.301253	0.108075
57.251521	0.109903
57.201688	0.109837
57.151871	0.109039
57.102024	0.110867
57.052100	0.111599
57.002216	0.110202
56.952255	0.109105
56.902217	0.108939
56.852148	0.110601
56.802074	0.110734
56.751948	0.110003
56.701793	0.110900
56.651583	0.112064
56.601367	0.110136
56.551098	0.109072
56.500752	0.107676
56.450423	0.109837
56.400016	0.109936
56.349576	0.110402
56.299126	0.109537
56.248621	0.110768
56.198038	0.111166
56.147425	0.109338
56.096782	0.111233
56.046085	0.107742
55.995358	0.109338
55.944647	0.111432
55.893861	0.111432
55.843045	0.107543
55.792154	0.110535
55.741256	0.110036
55.690306	0.110169
55.639349	0.110801
55.588339	0.110701
55.537276	0.109305
55.486185	0.110402
55.435017	0.110568
55.383891	0.111432
55.332668	0.110967
55.281417	0.110402
55.230139	0.109637
55.178810	0.109371
55.127407	0.114059
55.076002	0.110635
55.024548	0.111033
54.973045	0.110302
54.921492	0.109704
54.869936	0.109737
54.818329	0.112696
54.766717	0.111299
54.715078	0.111466
54.663364	0.109837
54.611598	0.110834
54.559853	0.110468
54.507988	0.110635
54.456166	0.110069
54.404272	0.109803
54.352397	0.112596
54.300402	0.114291
54.248401	0.111798
54.196373	0.113095
54.144294	0.111233
54.092166	0.111732
54.039988	0.112064
53.987782	0.111432
53.935526	0.111166
53.883268	0.112729
53.830916	0.110435
53.778610	0.110934
53.726187	0.109970
53.673785	0.111865
53.621359	0.112064
53.568839	0.110236
53.516341	0.111665
53.463798	0.110202
53.411231	0.111366
53.358547	0.112729
53.305839	0.111133
53.253106	0.111466
53.200303	0.113527
53.147501	0.109205
53.094652	0.112662
53.041757	0.109405
52.988793	0.113560
52.935875	0.111366
52.882866	0.111532
52.829859	0.112629
52.776739	0.111532
52.723643	0.113527
52.670501	0.112297
52.617291	0.111998
52.564058	0.110834
52.510757	0.115654
52.457436	0.111399
52.404114	0.114424
52.350677	0.111831
52.297194	0.112928
52.243760	0.112197
52.190258	0.115122
52.136712	0.112995
52.083166	0.112263
52.029599	0.112995
51.975918	0.112895
51.922214	0.111100
51.868488	0.112396
51.814741	0.111299
51.760925	0.113194
51.707065	0.113028
51.653160	0.113726
51.599256	0.115355
51.545353	0.113793
51.491428	0.112463
51.437413	0.115122
51.383331	0.116319
51.329250	0.114092
51.275124	0.114158
51.220954	0.114025
51.166785	0.116286
51.112546	0.113626
51.058286	0.112363
51.003980	0.115388
50.949584	0.113759
50.895142	0.112031
50.840702	0.113660
50.786194	0.113493
50.731643	0.113460
50.677094	0.115222
50.622478	0.114059
50.567864	0.113726
50.513184	0.113826
50.458484	0.113726
50.403738	0.113892
50.348970	0.115887
50.294180	0.116086
50.239347	0.115588
50.184446	0.114723
50.129571	0.114757
50.074604	0.114956
50.019615	0.113826
49.964627	0.113992
49.909595	0.114723
49.854495	0.115056
49.799399	0.113726
49.744305	0.113926
49.689144	0.114192
49.633893	0.114690
49.578622	0.114657
49.523330	0.116618
49.468042	0.118081
49.412643	0.114823
49.357271	0.114757
49.301834	0.116352
49.246354	0.115721
49.190832	0.114491
49.135313	0.116153
49.079729	0.115654
49.024102	0.114158
48.968433	0.116319
48.912790	0.116851
48.857036	0.112729
48.801310	0.115754
48.745542	0.115023
48.689687	0.113959
48.633791	0.115953
48.577925	0.115056
48.521971	0.116785
48.466024	0.115555
48.410015	0.116020
48.353989	0.116352
48.297946	0.116984
48.241840	0.115821
48.185671	0.115422
48.129509	0.117084
48.073330	0.118281
48.017112	0.115322
47.960900	0.116386
47.904604	0.118447
47.848315	0.117416
47.791988	0.115821
47.735623	0.116785
47.679244	0.118812
47.622804	0.117084
47.566306	0.117084
47.509818	0.116685
47.453246	0.117649
47.396661	0.117616
47.340041	0.118214
47.283388	0.116652
47.226723	0.116851
47.170000	0.114923
47.113288	0.117516
47.056470	0.116452
46.999664	0.116419
46.942779	0.118247
46.885906	0.116319
46.828930	0.116884
46.771943	0.117915
46.714992	0.118148
46.657891	0.119211
46.600806	0.117682
46.543710	0.119909
46.486581	0.119677
46.429466	0.118214
46.372249	0.119178
46.315024	0.120009
46.257813	0.118048
46.200524	0.119710
46.143200	0.120973
46.085912	0.116751
46.028546	0.117915
45.971216	0.119943
45.913807	0.117981
45.856365	0.120741
45.798890	0.118713
45.741381	0.121638
45.683839	0.120275
45.626265	0.121239
45.568634	0.119078
45.510994	0.119710
45.453273	0.119145
45.395540	0.118912
45.337773	0.120342
45.279997	0.120508
45.222210	0.119211
45.164391	0.118912
45.106561	0.119544
45.048674	0.121206
44.990730	0.121804
44.932775	0.119012
44.874765	0.121040
44.816768	0.118679
44.758737	0.120973
44.700717	0.118779
44.642592	0.121206
44.584454	0.120242
44.526305	0.120840
44.468031	0.120342
44.409861	0.120641
44.351587	0.121472
44.293279	0.118779
44.234984	0.120342
44.176654	0.120308
44.118244	0.121904
44.059847	0.122835
44.001397	0.118846
43.942938	0.121671
43.884469	0.119644
43.825922	0.121206
43.767367	0.122303
43.708733	0.122635
43.650133	0.121007
43.591430	0.123467
43.532669	0.120408
43.473946	0.119909
43.415143	0.119710
43.356355	0.120275
43.297509	0.121405
43.238654	0.121139
43.179696	0.124065
43.120727	0.122602
43.061724	0.124697
43.002689	0.122237
42.943598	0.122070
42.884498	0.121771
42.825366	0.123400
42.766156	0.122004
42.706961	0.122735
42.647736	0.124796
42.588481	0.123998
42.529172	0.123167
42.469902	0.122237
42.410532	0.124630
42.351086	0.124165
42.291657	0.123400
42.232198	0.122004
42.172710	0.122137
42.113146	0.122802
42.053600	0.124264
41.994003	0.125062
41.934400	0.122170
41.874815	0.125627
41.815154	0.122469
41.755466	0.124198
41.695749	0.124331
41.636006	0.124697
41.576234	0.123034
41.516435	0.123766
41.456609	0.124364
41.396804	0.125095
41.336902	0.126060
41.276973	0.126060
41.217040	0.125062
41.157036	0.124431
41.097055	0.124165
41.037003	0.123899
40.976925	0.124929
40.916869	0.127090
40.856788	0.124165
40.796659	0.125095
40.736506	0.125029
40.676260	0.123998
40.616036	0.127489
40.555741	0.125395
40.495446	0.126658
40.435106	0.128154
40.374745	0.125528
40.314338	0.126226
40.253910	0.124397
40.193508	0.127323
40.133037	0.125760
40.072545	0.126259
40.012030	0.126857
39.951423	0.125594
39.890864	0.129018
39.830239	0.126159
39.769594	0.127090
39.708973	0.127954
39.648307	0.127589
39.587550	0.127855
39.526818	0.126758
39.466041	0.125162
39.405242	0.129484
39.344470	0.129085
39.283676	0.130680
39.222839	0.129617
39.162026	0.128586
39.101147	0.127090
39.040225	0.127988
38.979284	0.130946
38.918323	0.127855
38.857343	0.130847
38.796343	0.126625
38.735253	0.129949
38.674166	0.131146
38.613059	0.126791
38.551932	0.128154
38.490785	0.131013
38.429595	0.130248
38.368406	0.128619
38.307173	0.129351
38.245895	0.128486
38.184595	0.131744
38.123320	0.130248
38.062000	0.128752
38.000589	0.128852
37.939178	0.129583
37.877747	0.133041
37.816297	0.131212
37.754825	0.130148
37.693308	0.129683
37.631818	0.130614
37.570261	0.130215
37.508705	0.129583
37.447106	0.131345
37.385463	0.132276
37.323799	0.130016
37.262136	0.132974
37.200475	0.133174
37.138722	0.130614
37.076948	0.131079
37.015130	0.132509
36.953292	0.132808
36.891411	0.132841
36.829557	0.132476
36.767661	0.132575
36.705722	0.132741
36.643763	0.131877
36.581764	0.133772
36.519746	0.131877
36.457732	0.134370
36.395652	0.133506
36.333576	0.134736
36.271459	0.133706
36.209300	0.132941
36.147122	0.135002
36.084879	0.133107
36.022640	0.134470
35.960382	0.134836
35.898059	0.132243
35.835785	0.133839
35.773445	0.135069
35.711062	0.134171
35.648662	0.133872
35.586290	0.133506
35.523832	0.138193
35.461310	0.137628
35.398820	0.136066
35.336315	0.135235
35.273794	0.133972
35.211258	0.133240
35.148659	0.136631
35.086067	0.133872
35.023412	0.135667
34.960744	0.134204
34.898086	0.137130
34.835391	0.137595
34.772705	0.136033
34.709984	0.135767
34.647203	0.135767
34.584457	0.136398
34.521700	0.136033
34.458907	0.136631
34.396055	0.135102
34.333168	0.137263
34.270339	0.136033
34.207453	0.135933
34.144510	0.135368
34.081555	0.135667
34.018566	0.137961
33.955519	0.135567
33.892531	0.136132
33.829461	0.136066
33.766424	0.139590
33.703328	0.136997
33.640197	0.138526
33.577032	0.138426
33.513879	0.137329
33.450693	0.137296
33.387473	0.138792
33.324243	0.139124
33.261002	0.138892
33.197705	0.137961
33.134421	0.139390
33.071104	0.140088
33.007776	0.140653
32.944413	0.138094
32.881015	0.143213
32.817583	0.140587
32.754140	0.141086
32.690709	0.140919
32.627267	0.138227
32.563745	0.139955
32.500188	0.140155
32.436573	0.140786
32.372946	0.140255
32.309285	0.140487
32.245613	0.137828
32.182001	0.140155
32.118285	0.140155
32.054555	0.139490
31.990861	0.142050
31.927085	0.143147
31.863272	0.138526
31.799447	0.140520
31.735635	0.142016
31.671811	0.141318
31.607907	0.142116
31.543991	0.139822
31.480109	0.140520
31.416123	0.143047
31.352149	0.139324
31.288093	0.145308
31.224049	0.143579
31.160039	0.140620
31.095948	0.141485
31.031847	0.143645
30.967688	0.143446
30.903518	0.144011
30.839291	0.141119
30.775054	0.141518
30.710852	0.141817
30.646616	0.143679
30.582322	0.141086
30.518019	0.142615
30.453707	0.144909
30.389317	0.144809
30.324987	0.144111
30.260601	0.141551
30.196184	0.141917
30.131759	0.142050
30.067347	0.145740
30.002833	0.145042
29.938332	0.141850
29.873870	0.142681
29.809354	0.143579
29.744805	0.143878
29.680226	0.144643
29.615640	0.144343
29.551046	0.144011
29.486422	0.146139
29.421744	0.147369
29.357012	0.146172
29.292273	0.145773
29.227505	0.144111
29.162754	0.144011
29.097973	0.145873
29.033139	0.149363
28.968299	0.144343
28.903409	0.145839
28.838512	0.147535
28.773565	0.145108
28.708637	0.146538
28.643704	0.147269
28.578744	0.147335
28.513780	0.145042
28.448812	0.148100
28.383772	0.147867
28.318727	0.148698
28.253633	0.146238
28.188512	0.145873
28.123434	0.150660
28.058353	0.148034
27.993200	0.148964
27.928046	0.149230
27.862890	0.145740
27.797756	0.150793
27.732597	0.148499
27.667392	0.151125
27.602188	0.147801
27.536937	0.149031
27.471686	0.151059
27.406412	0.150926
27.341114	0.150394
27.275863	0.147834
27.210565	0.150560
27.145267	0.151624
27.079926	0.150460
27.014538	0.152156
26.949128	0.151059
26.883743	0.150560
26.818290	0.149297
26.752863	0.151291
26.687414	0.151890
26.621921	0.151391
26.556429	0.152754
26.490914	0.152555
26.425353	0.151790
26.359815	0.153652
26.294302	0.151990
26.228720	0.151557
26.163141	0.152156
26.097563	0.154250
26.031961	0.150793
25.966359	0.154416
25.900714	0.151757
25.835047	0.152787
25.769359	0.152156
25.703650	0.155081
25.637943	0.156012
25.572189	0.154383
25.506459	0.153851
25.440683	0.152954
25.374861	0.154815
25.309018	0.154450
25.243175	0.155979
25.177332	0.153352
25.111444	0.154450
25.045581	0.154948
24.979652	0.156411
24.913746	0.154882
24.847817	0.156344
24.781843	0.155912
24.715824	0.158206
24.649784	0.156976
24.583746	0.155414
24.517687	0.156843
24.451584	0.157508
24.385461	0.156411
24.319314	0.159336
24.253168	0.160068
24.186979	0.154981
24.120816	0.157874
24.054634	0.161464
23.988431	0.158040
23.922209	0.159469
23.855989	0.159735
23.789725	0.157807
23.723464	0.158605
23.657162	0.161530
23.590842	0.158372
23.524480	0.160733
23.458122	0.160334
23.391745	0.160334
23.325372	0.158439
23.258980	0.159203
23.192547	0.160533
23.126119	0.159403
23.059651	0.162062
22.993187	0.163392
22.926705	0.159336
22.860135	0.160500
22.793616	0.160500
22.727055	0.163126
22.660501	0.162661
22.593905	0.161364
22.527316	0.162927
22.460733	0.164456
22.394113	0.162361
22.327478	0.161198
22.260850	0.163392
22.194158	0.162661
22.127451	0.165686
22.060728	0.164090
21.994035	0.164888
21.927351	0.165786
21.860607	0.166317
21.793824	0.165586
21.727051	0.164822
21.660263	0.165486
21.593506	0.165985
21.526711	0.164024
21.459834	0.165287
21.392989	0.165486
21.326129	0.166417
21.259258	0.166317
21.192351	0.169176
21.125431	0.166550
21.058566	0.169974
20.991665	0.169708
20.924729	0.168578
20.857827	0.168711
20.790843	0.168212
20.723869	0.167780
20.656835	0.166617
20.589834	0.169575
20.522843	0.170207
20.455840	0.172501
20.388779	0.172601
20.321752	0.171803
20.254691	0.171470
20.187595	0.170739
20.120466	0.173099
20.053328	0.171503
19.986182	0.172235
19.919048	0.172601
19.851858	0.175061
19.784680	0.170706
19.717513	0.175360
19.650381	0.175061
19.583214	0.174728
19.515964	0.173465
19.448727	0.173631
19.381501	0.175725
19.314263	0.173930
19.247037	0.174828
19.179800	0.177122
19.112529	0.176789
19.045227	0.178518
18.977893	0.176922
18.910570	0.175825
18.843214	0.177787
18.775801	0.177388
18.708402	0.178584
18.640992	0.178751
18.573596	0.176856
18.506167	0.176158
18.438705	0.179482
18.371279	0.180114
18.303797	0.181044
18.236326	0.180413
18.168867	0.178451
18.101352	0.180978
18.033850	0.180679
17.966293	0.180047
17.898704	0.184203
17.831151	0.185433
17.763588	0.184070
17.696038	0.179648
17.628433	0.183039
17.560842	0.181078
17.493221	0.181709
17.425546	0.183538
17.357884	0.184834
17.290213	0.185499
17.222534	0.184335
17.154870	0.184402
17.087198	0.185034
17.019449	0.188059
16.951739	0.186762
16.884042	0.187859
16.816313	0.188724
16.748484	0.190087
16.680715	0.187826
16.612894	0.191051
16.545064	0.185366
16.477227	0.189056
16.409358	0.190984
16.341529	0.189721
16.273646	0.188690
16.205710	0.190153
16.137814	0.190220
16.069911	0.193311
16.002002	0.192580
15.934042	0.191849
15.866125	0.193511
15.798157	0.193212
15.730183	0.190785
15.662227	0.196503
15.594222	0.194375
15.526236	0.194076
15.458271	0.195073
15.390324	0.195705
15.322305	0.195472
15.254281	0.195306
15.186300	0.192912
15.118245	0.195605
15.050186	0.197666
14.982102	0.197965
14.914016	0.198896
14.845952	0.196004
14.777841	0.196669
14.709729	0.201057
14.641614	0.199295
14.573497	0.201556
14.505379	0.199162
14.437238	0.203351
14.369071	0.201057
14.300902	0.200691
14.232732	0.199295
14.164563	0.202819
14.096371	0.200159
14.028178	0.204348
13.959986	0.202619
13.891748	0.202752
13.823509	0.202187
13.755269	0.207008
13.687028	0.205611
13.618788	0.205279
13.550547	0.205279
13.482307	0.208005
13.414045	0.207174
13.345807	0.203550
13.277523	0.205046
13.209264	0.210731
13.140982	0.207107
13.072701	0.208271
13.004396	0.208736
12.936090	0.210232
12.867763	0.212293
12.799412	0.209800
12.731083	0.206509
12.662754	0.208504
12.594401	0.209734
12.525977	0.211263
12.457575	0.208803
12.389196	0.209501
12.320816	0.214188
12.252435	0.214820
12.184076	0.215285
12.115622	0.213424
12.047168	0.213756
11.978689	0.216582
11.910186	0.216449
11.841730	0.216183
11.773251	0.215684
11.704748	0.214654
11.636221	0.213922
11.567694	0.218876
11.499189	0.216216
11.430661	0.218211
11.362063	0.217878
11.293487	0.216981
11.224911	0.219042
11.156380	0.219208
11.087781	0.220106
11.019182	0.220770
10.950607	0.222034
10.881987	0.219241
10.813369	0.222998
10.744706	0.220205
10.676066	0.222931
10.607429	0.224959
10.538794	0.222200
10.470090	0.221535
10.401390	0.224726
10.332692	0.221668
10.263994	0.225292
10.195252	0.227286
10.126512	0.223629
10.057798	0.223962
9.989066	0.228051
9.920314	0.227120
9.851565	0.227918
9.782797	0.225890
9.714009	0.230611
9.645225	0.228782
9.576422	0.226355
9.507646	0.228649
9.438851	0.227818
9.370036	0.227386
9.301180	0.232705
9.232376	0.226522
9.163529	0.231575
9.094687	0.230378
9.025828	0.230577
8.956973	0.231708
8.888101	0.233104
8.819257	0.231408
8.750464	0.231076
8.681582	0.231375
8.612660	0.235065
8.543767	0.235231
8.474881	0.231342
8.405955	0.230943
8.337036	0.235497
8.268099	0.235364
8.199170	0.233436
8.130271	0.234866
8.061332	0.234600
7.992378	0.234234
7.923406	0.237193
7.854440	0.235963
7.785529	0.235198
7.716578	0.236761
7.647633	0.237725
7.578673	0.237791
7.509699	0.239553
7.440755	0.238788
7.371770	0.237226
7.302768	0.237027
7.233796	0.240185
7.164784	0.242744
7.095779	0.240052
7.026759	0.242179
6.957723	0.240251
6.888672	0.241880
6.819651	0.242844
6.750613	0.239121
6.681581	0.242080
6.612511	0.241082
6.543471	0.243609
6.474415	0.241581
6.405369	0.239320
6.336356	0.242080
6.267330	0.242246
6.198265	0.241681
6.129210	0.241847
6.060140	0.242179
5.991055	0.242212
5.921951	0.242379
5.852807	0.243941
5.783716	0.243875
5.714633	0.244340
5.645463	0.242811
5.576302	0.243708
5.507146	0.246235
5.437974	0.246700
5.368831	0.243742
5.299697	0.246734
5.230502	0.246734
5.161292	0.242944
5.092091	0.244872
5.022923	0.245570
4.953719	0.248230
4.884524	0.245537
4.815315	0.246235
4.746069	0.244041
4.676879	0.243675
4.607651	0.246368
4.538408	0.247299
4.469173	0.248130
4.399898	0.249958
4.330655	0.249393
4.261351	0.247831
4.192104	0.249194
4.122821	0.247930
4.053502	0.247997
3.984193	0.248861
3.914847	0.248728
3.845534	0.244772
3.776208	0.247797
3.706938	0.249692
3.637632	0.248163
3.568266	0.252186
3.498912	0.247066
3.429592	0.246601
3.360189	0.251720
3.290798	0.251354
3.221420	0.246036
3.152008	0.251554
3.082583	0.248629
3.013168	0.249526
2.943766	0.250324
2.874352	0.249991
2.804952	0.251155
2.735541	0.253050
2.666119	0.250490
2.596732	0.246833
2.527287	0.249991
2.457855	0.249493
2.388483	0.250058
2.319076	0.250324
2.249612	0.250590
2.180162	0.248163
2.110772	0.248030
2.041327	0.251820
1.971874	0.250291
1.902457	0.249127
1.832984	0.250390
1.763549	0.250756
1.694130	0.251521
1.624632	0.250357
1.555148	0.247831
1.485678	0.250390
1.416200	0.249958
1.346689	0.249426
1.277215	0.246168
1.207733	0.250889
1.138267	0.245637
1.068793	0.248562
0.999336	0.248163
0.929894	0.249127
0.860422	0.249859
0.790919	0.245504
0.721410	0.247897
0.651918	0.245803
0.582421	0.249792
0.512917	0.246601
0.443407	0.249493
0.373915	0.246767
0.304419	0.244706
0.234940	0.247232
0.165433	0.246468
0.095944	0.243875
0.026496	0.246534
-0.043004	0.246036
-0.112486	0.245038
-0.181975	0.245603
-0.251445	0.248263
-0.320945	0.248928
-0.390429	0.245504
-0.459940	0.243742
-0.529434	0.243143
-0.598933	0.248562
-0.668460	0.242279
-0.737991	0.244905
-0.807527	0.242778
-0.877068	0.244041
-0.946636	0.243575
-1.016162	0.245869
-1.085737	0.245005
-1.155269	0.243044
-1.224853	0.244573
-1.294441	0.246501
-1.363963	0.242911
-1.433535	0.243875
-1.503110	0.240351
-1.572712	0.243609
-1.642296	0.244639
-1.711885	0.241947
-1.781458	0.239752
-1.851011	0.240384
-1.920592	0.241581
-1.990153	0.241780
-2.059762	0.243110
-2.129396	0.243276
-2.199009	0.238556
-2.268601	0.240251
-2.338195	0.239254
-2.407837	0.237492
-2.477459	0.240085
-2.547080	0.236594
-2.616680	0.237891
-2.686305	0.240118
-2.756001	0.236894
-2.825604	0.232572
-2.895230	0.236162
-2.964903	0.237891
-3.034506	0.236594
-3.104133	0.237791
-3.173759	0.237359
-3.243361	0.235298
-3.313009	0.232705
-3.382679	0.234733
-3.452300	0.236794
-3.521918	0.235896
-3.591578	0.231541
-3.661214	0.234733
-3.730824	0.231907
-3.800431	0.235098
-3.870058	0.230079
-3.939681	0.229447
-4.009299	0.229680
-4.078935	0.231475
-4.148543	0.230577
-4.218124	0.230178
-4.287723	0.231442
-4.357317	0.228649
-4.426952	0.227286
-4.496557	0.228749
-4.566134	0.228815
-4.635660	0.223397
-4.705271	0.228117
-4.774808	0.226920
-4.844363	0.223696
-4.913934	0.223729
-4.983498	0.225292
-5.053054	0.225790
-5.122626	0.223962
-5.192240	0.220970
-5.261778	0.226123
-5.331309	0.224593
-5.400831	0.223164
-5.470346	0.223895
-5.539853	0.223097
-5.609375	0.220737
-5.678888	0.223596
-5.748346	0.222931
-5.817888	0.224028
-5.887376	0.220172
-5.956830	0.219873
-6.026323	0.218078
-6.095785	0.218244
-6.165282	0.222532
-6.234771	0.219973
-6.304253	0.218676
-6.373724	0.215884
-6.443161	0.215385
-6.512636	0.217978
-6.582148	0.215684
-6.651581	0.214886
-6.721028	0.212160
-6.790489	0.218909
-6.859940	0.214554
-6.929379	0.212393
-6.998785	0.212526
-7.068202	0.212958
-7.137632	0.211529
-7.207075	0.214321
-7.276508	0.211861
-7.345929	0.210797
-7.415338	0.208769
-7.484759	0.210099
-7.554167	0.211828
-7.623563	0.208470
-7.692947	0.210964
-7.762367	0.208670
-7.831750	0.211063
-7.901144	0.209401
-7.970526	0.209567
-8.039921	0.208703
-8.109281	0.207373
-8.178653	0.203816
-8.248083	0.207074
-8.317407	0.206642
-8.386764	0.205079
-8.456131	0.205778
-8.525464	0.200193
-8.594831	0.205113
-8.664184	0.201755
-8.733501	0.204182
-8.802849	0.204215
-8.872158	0.201256
-8.941475	0.200392
-9.010777	0.200359
-9.080110	0.201622
-9.149427	0.200193
-9.218704	0.197566
-9.288034	0.201689
-9.357326	0.198431
-9.426625	0.196735
-9.495977	0.199328
-9.565266	0.196070
-9.634539	0.195605
-9.703796	0.197334
-9.773057	0.195339
-9.842323	0.194342
-9.911570	0.194541
-9.980775	0.195239
-10.050030	0.195007
-10.119220	0.193976
-10.188460	0.195140
-10.257704	0.192813
-10.326930	0.193212
-10.396113	0.193045
-10.465275	0.190386
-10.534463	0.191416
-10.603630	0.190884
-10.672776	0.190020
-10.741898	0.191716
-10.811021	0.189588
-10.880123	0.190053
-10.949226	0.190918
-11.018306	0.191416
-11.087387	0.187593
-11.156446	0.184236
-11.225528	0.187161
-11.294586	0.187394
-11.363669	0.187394
-11.432683	0.185067
-11.501697	0.183172
-11.570734	0.185798
-11.639773	0.183903
-11.708743	0.183471
-11.777736	0.183471
-11.846727	0.184901
-11.915671	0.184867
-11.984638	0.180778
-12.053604	0.183837
-12.122523	0.182374
-12.191440	0.181377
-12.260356	0.181676
-12.329249	0.180080
-12.398139	0.176457
-12.467005	0.181942
-12.535847	0.181477
-12.604688	0.181410
-12.673528	0.174728
-12.742344	0.177321
-12.811182	0.175659
-12.879993	0.177255
-12.948781	0.177687
-13.017591	0.175592
-13.086400	0.176523
-13.155137	0.174196
-13.223873	0.174163
-13.292583	0.174861
-13.361291	0.174795
-13.430019	0.174130
-13.498699	0.174096
-13.567377	0.174662
-13.636029	0.171603
-13.704702	0.174994
-13.773350	0.170539
-13.841995	0.169442
-13.910640	0.172368
-13.979238	0.172567
-14.047904	0.171836
-14.116522	0.169442
-14.185161	0.169409
-14.253798	0.169276
-14.322411	0.169110
-14.390997	0.169609
-14.459582	0.169808
-14.528165	0.166550
-14.596745	0.169609
-14.665297	0.167049
-14.733824	0.166617
-14.802370	0.167115
-14.870865	0.166583
-14.939424	0.166018
-15.007908	0.164456
-15.076410	0.164954
-15.144907	0.164689
-15.213375	0.164655
-15.281839	0.166484
-15.350297	0.165553
-15.418726	0.163990
-15.487150	0.163292
-15.555567	0.166251
-15.624027	0.162328
-15.692437	0.162029
-15.760864	0.162561
-15.829286	0.162893
-15.897679	0.162893
-15.966041	0.162893
-16.034372	0.161165
-16.102718	0.162727
-16.171057	0.159802
-16.239365	0.160134
-16.307689	0.161830
-16.375958	0.158206
-16.444241	0.159037
-16.512516	0.159137
-16.580716	0.157541
-16.648907	0.159536
-16.717135	0.161464
-16.785377	0.158306
-16.853562	0.157574
-16.921737	0.157009
-16.989882	0.158273
-17.058040	0.156378
-17.126190	0.159868
-17.194329	0.157741
-17.262434	0.153286
-17.330526	0.155979
-17.398607	0.153652
-17.466653	0.153552
-17.534710	0.152754
-17.602756	0.151790
-17.670767	0.154283
-17.738790	0.153419
-17.806776	0.154283
-17.874726	0.152954
-17.942664	0.155613
-18.010611	0.151857
-18.078568	0.152122
-18.146513	0.150327
-18.214397	0.153585
-18.282266	0.150992
-18.350098	0.151059
-18.417941	0.152222
-18.485819	0.149928
-18.553612	0.152688
-18.621440	0.152920
-18.689255	0.150627
-18.757009	0.151158
-18.824772	0.149330
-18.892476	0.150560
-18.960189	0.149762
-19.027911	0.148366
-19.095620	0.148399
-19.163313	0.150793
-19.230992	0.147036
-19.298657	0.151258
-19.366330	0.147834
-19.433942	0.146471
-19.501562	0.146438
-19.569168	0.148765
-19.636714	0.148067
-19.704292	0.146172
-19.771878	0.145308
-19.839449	0.147335
-19.906982	0.144643
-19.974476	0.148266
-20.042024	0.143679
-20.109509	0.147402
-20.176956	0.146471
-20.244434	0.144842
-20.311918	0.143645
-20.379338	0.145574
-20.446765	0.146371
-20.514177	0.144011
-20.581550	0.145407
-20.648906	0.143911
-20.716268	0.142582
-20.783591	0.143546
-20.850899	0.145075
-20.918214	0.145374
-20.985513	0.143745
-21.052793	0.143280
-21.120079	0.143679
-21.187345	0.140487
-21.254571	0.142648
-21.321777	0.140886
-21.388965	0.139191
-21.456183	0.142881
-21.523358	0.140321
-21.590490	0.139723
-21.657650	0.142482
-21.724791	0.141285
-21.791891	0.141352
-21.859019	0.141285
-21.926127	0.139623
-21.993214	0.140388
-22.060281	0.139025
-22.127350	0.137828
-22.194375	0.139157
-22.261404	0.140454
-22.328412	0.140687
-22.395422	0.136598
-22.462387	0.137396
-22.529306	0.140255
-22.596227	0.138227
-22.663172	0.137229
-22.730025	0.139191
-22.796856	0.137495
-22.863688	0.140288
-22.930520	0.137063
-22.997306	0.136797
-23.064115	0.138659
-23.130877	0.137728
-23.197613	0.136631
-23.264324	0.137828
-23.331057	0.137628
-23.397742	0.137562
-23.464425	0.136432
-23.531036	0.136830
-23.597621	0.137795
-23.664273	0.136199
-23.730784	0.134636
-23.797385	0.136199
-23.863912	0.136864
-23.930411	0.136199
-23.996884	0.135235
-24.063353	0.135268
-24.129794	0.135700
-24.196255	0.133506
-24.262617	0.134537
-24.328975	0.133140
-24.395327	0.134005
-24.461650	0.134271
-24.527991	0.133273
-24.594280	0.133107
-24.660541	0.133639
-24.726818	0.134603
-24.793042	0.133905
-24.859237	0.133307
-24.925379	0.135069
-24.991514	0.132143
-25.057643	0.133938
-25.123721	0.133672
-25.189816	0.132343
-25.255858	0.132176
-25.321917	0.135202
-25.387922	0.133273
-25.453896	0.133041
-25.519863	0.131611
-25.585778	0.131412
-25.651707	0.131179
-25.717583	0.134969
-25.783407	0.131312
-25.849248	0.132442
-25.915060	0.131412
-25.980841	0.130182
-26.046592	0.131013
-26.112362	0.130946
-26.178102	0.130448
-26.243813	0.130547
-26.309495	0.130016
-26.375147	0.128918
-26.440769	0.132110
-26.506408	0.131678
-26.572017	0.129683
-26.637595	0.129650
-26.703189	0.133207
-26.768752	0.130182
-26.834307	0.130980
-26.899810	0.129450
-26.965305	0.130315
-27.030770	0.130148
-27.096205	0.130082
-27.161657	0.132908
-27.227079	0.130049
-27.292447	0.130614
-27.357877	0.128520
-27.423231	0.128819
-27.488579	0.129218
-27.553875	0.125361
-27.619117	0.127190
-27.684400	0.127821
-27.749628	0.128154
-27.814849	0.129218
-27.880040	0.126259
-27.945224	0.126758
-28.010400	0.127223
-28.075522	0.126724
-28.140658	0.128819
-28.205830	0.127655
-28.270923	0.127256
-28.336005	0.128187
-28.401007	0.127090
-28.466044	0.126026
-28.531048	0.125361
-28.595994	0.125561
-28.660952	0.127655
-28.725877	0.127223
-28.790769	0.126193
-28.855672	0.126226
-28.920541	0.126824
-28.985375	0.124065
-29.050176	0.126093
-29.114943	0.124830
-29.179700	0.125095
-29.244399	0.126126
-29.309088	0.126758
-29.373765	0.126691
-29.438429	0.123433
-29.503058	0.126359
-29.567652	0.127788
-29.632257	0.125129
-29.696780	0.126093
-29.761338	0.124497
-29.825814	0.123433
-29.890324	0.124165
-29.954823	0.123899
-30.019311	0.123367
-30.083739	0.123101
-30.148086	0.122935
-30.212442	0.124530
-30.276809	0.126226
-30.341164	0.124630
-30.405483	0.124298
-30.469767	0.121605
-30.534013	0.123899
-30.598223	0.122768
-30.662419	0.121405
-30.726579	0.123766
-30.790748	0.126392
-30.854879	0.123732
-30.918974	0.126891
-30.983102	0.122336
-31.047167	0.125494
-31.111194	0.123001
-31.175206	0.124131
-31.239183	0.122602
-31.303144	0.122635
-31.367068	0.121007
-31.430953	0.121073
-31.494801	0.122203
-31.558634	0.120508
-31.622478	0.123234
-31.686286	0.119477
-31.750034	0.122303
-31.813769	0.120508
-31.877515	0.120375
-31.941201	0.119976
-32.004896	0.121638
-32.068554	0.123068
-32.132223	0.119544
-32.195855	0.121206
-32.259428	0.120209
-32.322988	0.120641
-32.386534	0.118713
-32.450042	0.122403
-32.513538	0.119909
-32.576996	0.120042
-32.640463	0.120807
-32.703915	0.117582
-32.767376	0.118713
-32.830776	0.121239
-32.894117	0.117582
-32.957422	0.117782
-33.020713	0.119145
-33.084014	0.116918
-33.147277	0.119012
-33.210503	0.118414
-33.273715	0.118812
-33.336935	0.120242
-33.400073	0.118646
-33.463196	0.121139
-33.526326	0.118447
-33.589464	0.119577
-33.652563	0.118214
-33.715647	0.119278
-33.778692	0.117749
-33.841722	0.117316
-33.904737	0.119644
-33.967715	0.116785
-34.030657	0.120674
-34.093561	0.117948
-34.156474	0.120109
-34.219346	0.117649
-34.282178	0.115987
-34.345017	0.119411
-34.407840	0.116851
-34.470646	0.116386
-34.533413	0.119444
-34.596117	0.116053
-34.658851	0.117350
-34.721522	0.117017
-34.784198	0.115887
-34.846858	0.116153
-34.909455	0.115887
-34.972011	0.117882
-35.034549	0.115621
-35.097069	0.115721
-35.159569	0.117848
-35.222051	0.115255
-35.284514	0.115588
-35.346913	0.118546
-35.409292	0.115488
-35.471674	0.116186
-35.534014	0.117449
-35.596334	0.116585
-35.658588	0.115189
-35.720892	0.116685
-35.783154	0.116219
-35.845373	0.117051
-35.907572	0.114458
-35.969796	0.115289
-36.031929	0.114424
-36.094040	0.114690
-36.156151	0.114923
-36.218216	0.117217
-36.280259	0.114358
-36.342233	0.114923
-36.404163	0.114291
-36.466095	0.115122
-36.528007	0.116319
-36.589896	0.115189
-36.651762	0.113294
-36.713584	0.114524
-36.775337	0.115422
-36.837091	0.114358
-36.898823	0.114757
-36.960534	0.115355
-37.022221	0.114557
-37.083839	0.113626
-37.145457	0.114325
-37.207053	0.116153
-37.268626	0.113892
-37.330151	0.114956
-37.391653	0.114424
-37.453153	0.113593
-37.514628	0.112463
-37.575985	0.114358
-37.637365	0.114025
-37.698720	0.114723
-37.760096	0.114325
-37.821423	0.112463
-37.882680	0.114591
-37.943938	0.114358
-38.005125	0.113793
-38.066312	0.111366
-38.127429	0.112596
-38.188522	0.112928
-38.249614	0.111166
-38.310682	0.112596
-38.371704	0.112928
-38.432679	0.110202
-38.493676	0.112829
-38.554674	0.112895
-38.615624	0.112463
-38.676505	0.112197
-38.737387	0.111166
-38.798245	0.112396
-38.859081	0.113892
-38.919826	0.113061
-38.980639	0.112363
-39.041406	0.112563
-39.102126	0.112529
-39.162868	0.112396
-39.223539	0.112795
-39.284141	0.112130
-39.344743	0.112164
-39.405297	0.111299
-39.465803	0.113759
-39.526332	0.112164
-39.586813	0.109670
-39.647247	0.110369
-39.707681	0.109471
-39.768091	0.112729
-39.828477	0.110036
-39.888793	0.111565
-39.949109	0.112529
-40.009354	0.111632
-40.069643	0.111333
-40.129885	0.111565
-40.190081	0.110169
-40.250300	0.111366
-40.310427	0.110236
-40.370576	0.111432
-40.430700	0.110601
-40.490799	0.111100
-40.550852	0.110402
-40.610857	0.110003
-40.670860	0.110202
-40.730814	0.111200
-40.790694	0.111865
-40.850548	0.109537
-40.910398	0.110900
-40.970245	0.109305
-41.030017	0.109803
-41.089763	0.108706
-41.149483	0.109970
-41.209176	0.110302
-41.268865	0.110502
-41.328505	0.109105
-41.388093	0.107842
-41.447654	0.110635
-41.507211	0.111499
-41.566763	0.109837
-41.626311	0.110103
-41.685784	0.109637
-41.745253	0.109471
-41.804694	0.108573
-41.864084	0.112064
-41.923423	0.110535
-41.982756	0.109006
-42.042083	0.108640
-42.101335	0.109571
-42.160605	0.109970
-42.219822	0.108839
-42.279056	0.108540
-42.338213	0.111366
-42.397364	0.107875
-42.456438	0.110069
-42.515504	0.109172
-42.574586	0.110635
-42.633591	0.108108
-42.692543	0.108474
-42.751512	0.106280
-42.810425	0.111665
-42.869330	0.110003
-42.928157	0.109936
-42.987023	0.109105
-43.045810	0.107842
-43.104566	0.107643
-43.163269	0.110468
-43.221963	0.109305
-43.280625	0.109704
-43.339232	0.109770
-43.397783	0.108706
-43.456348	0.107011
-43.514903	0.107510
-43.573402	0.108839
-43.631847	0.107410
-43.690305	0.107177
-43.748706	0.107609
-43.807099	0.107676
-43.865438	0.109936
-43.923745	0.107210
-43.982067	0.104983
-44.040357	0.108573
-44.098592	0.107044
-44.156773	0.106014
-44.214969	0.106546
-44.273132	0.107576
-44.331238	0.108839
-44.389290	0.107643
-44.447333	0.109837
-44.505345	0.109272
-44.563303	0.106712
-44.621230	0.108573
-44.679172	0.106080
-44.737060	0.109837
-44.794915	0.106446
-44.852761	0.105914
-44.910504	0.106512
-44.968237	0.108008
-45.025961	0.107210
-45.083654	0.106280
-45.141339	0.106745
-45.198994	0.109936
-45.256616	0.106379
-45.314206	0.108607
-45.371763	0.108706
-45.429288	0.105249
-45.486758	0.107742
-45.544265	0.108141
-45.601694	0.107310
-45.659067	0.106512
-45.716429	0.106147
-45.773756	0.107343
-45.831027	0.106778
-45.888287	0.106413
-45.945514	0.106147
-46.002706	0.105449
-46.059889	0.106180
-46.117063	0.106812
-46.174204	0.106280
-46.231265	0.107410
-46.288291	0.107377
-46.345306	0.106246
-46.402266	0.104850
-46.459213	0.106379
-46.516125	0.105382
-46.573002	0.107310
-46.629868	0.106845
-46.686721	0.108740
-46.743538	0.107410
-46.800294	0.106213
-46.857037	0.106878
-46.913722	0.105781
-46.970418	0.108673
-47.027053	0.106645
-47.083675	0.108440
-47.140214	0.104318
-47.196739	0.106579
-47.253227	0.106413
-47.309703	0.107277
-47.366118	0.104518
-47.422518	0.104318
-47.478881	0.103853
-47.535206	0.108274
-47.591494	0.107377
-47.647744	0.106080
-47.703979	0.105847
-47.760153	0.106080
-47.816311	0.107476
-47.872360	0.106313
-47.928438	0.104983
-47.984499	0.103986
-48.040426	0.105515
-48.096406	0.104750
-48.152320	0.106512
-48.208218	0.107044
-48.264123	0.106944
-48.319964	0.103720
-48.375765	0.107210
-48.431503	0.105083
-48.487223	0.104717
-48.542925	0.105714
-48.598608	0.104584
-48.654274	0.105415
-48.709897	0.105382
-48.765456	0.104484
-48.820994	0.105847
-48.876467	0.105116
-48.931923	0.105050
-48.987359	0.106512
-49.042706	0.106246
-49.098080	0.104950
-49.153363	0.106679
-49.208626	0.105548
-49.263820	0.105249
-49.319062	0.105582
-49.374237	0.105415
-49.429368	0.103520
-49.484405	0.102856
-49.539421	0.105149
-49.594461	0.103820
-49.649433	0.103554
-49.704384	0.105582
-49.759291	0.104086
-49.814176	0.106413
-49.869017	0.105149
-49.923792	0.104584
-49.978590	0.105050
-50.033320	0.105847
-50.088029	0.103786
-50.142692	0.104817
-50.197309	0.104684
-50.251879	0.104152
-50.306427	0.104252
-50.360930	0.104252
-50.415411	0.105714
-50.469847	0.103753
-50.524306	0.102922
-50.578650	0.105748
-50.632946	0.105016
-50.687220	0.102889
-50.741400	0.106679
-50.795603	0.105515
-50.849784	0.100894
-50.903896	0.102058
-50.957985	0.102822
-51.012053	0.103919
-51.066073	0.103454
-51.120092	0.104086
-51.174041	0.104817
-51.227944	0.103886
-51.281825	0.102523
-51.335635	0.106180
-51.389469	0.105548
-51.443233	0.102157
-51.496952	0.105847
-51.550624	0.104817
-51.604250	0.103720
-51.657854	0.105914
-51.711413	0.101991
-51.764950	0.102357
-51.818397	0.104651
-51.871797	0.102955
-51.925176	0.104086
-51.978556	0.102390
-52.031846	0.103221
-52.085137	0.105216
-52.138381	0.102490
-52.191626	0.104584
-52.244824	0.104950
-52.297954	0.104484
-52.351061	0.103221
-52.404098	0.102191
-52.457115	0.102390
-52.510133	0.103554
-52.563083	0.106778
-52.616011	0.103221
-52.668893	0.102390
-52.721752	0.105050
-52.774567	0.104052
-52.827337	0.103421
-52.880038	0.104518
-52.932715	0.104019
-52.985392	0.102324
-53.038022	0.102523
-53.090582	0.102989
-53.143164	0.105216
-53.195722	0.103022
-53.248185	0.103853
-53.300602	0.101759
-53.352995	0.102423
-53.405341	0.103554
-53.457663	0.104617
-53.509868	0.104052
-53.562095	0.106579
-53.614296	0.104451
-53.666473	0.101659
-53.718577	0.103753
-53.770656	0.102822
-53.822686	0.104983
-53.874692	0.103421
-53.926628	0.102689
-53.978537	0.103853
-54.030375	0.104418
-54.082235	0.103786
-54.134022	0.105316
-54.185782	0.105016
-54.237563	0.101991
-54.289248	0.102257
-54.340908	0.102989
-54.392542	0.101526
-54.444148	0.102191
-54.495705	0.103387
-54.547212	0.102523
-54.598668	0.102157
-54.650120	0.102523
-54.701545	0.105316
-54.752872	0.101193
-54.804194	0.103653
-54.855489	0.104617
-54.906756	0.102789
-54.957973	0.104518
-55.009139	0.103221
-55.060230	0.104717
-55.111362	0.102689
-55.162421	0.101060
-55.213429	0.102490
-55.264361	0.104086
-55.315311	0.102457
-55.366256	0.103288
-55.417125	0.103853
-55.467989	0.100030
-55.518802	0.103254
-55.569588	0.102423
-55.620322	0.101759
-55.671027	0.101360
-55.721679	0.103088
-55.772278	0.101193
-55.822849	0.103820
-55.873368	0.101293
-55.923860	0.103421
-55.974347	0.101792
-56.024806	0.103786
-56.075189	0.104152
-56.125520	0.103055
-56.175821	0.102556
-56.226116	0.102423
-56.276335	0.100728
-56.326548	0.102723
-56.376686	0.100030
-56.426817	0.104551
-56.476917	0.102590
-56.526942	0.102091
-56.576959	0.103055
-56.626945	0.102124
-56.676878	0.102024
-56.726735	0.101293
-56.776586	0.102955
-56.826408	0.102822
-56.876176	0.102191
-56.925846	0.104185
-56.975556	0.102789
-57.025213	0.101160
-57.074817	0.103853
-57.124394	0.101891
-57.173917	0.102590
-57.223388	0.100628
-57.272830	0.103354
-57.322242	0.101891
-57.371600	0.104484
-57.420880	0.102590
-57.470153	0.101991
-57.519417	0.104252
-57.568650	0.102157
-57.617806	0.103188
-57.666930	0.100296
-57.715999	0.104252
-57.765059	0.101858
-57.814088	0.102922
-57.863063	0.101759
-57.912028	0.103653
-57.960961	0.102856
-58.009814	0.100961
-58.058634	0.102257
-58.107400	0.102590
-58.156134	0.102157
-58.204836	0.100961
-58.253483	0.099897
-58.302120	0.100595
-58.350656	0.100030
-58.399183	0.102756
-58.447657	0.099564
-58.496097	0.101925
-58.544527	0.099564
-58.592879	0.101991
-58.641174	0.103421
-58.689484	0.101626
-58.737690	0.100562
-58.785887	0.101692
-58.834029	0.100994
-58.882138	0.102058
-58.930238	0.102955
-58.978258	0.100462
-59.026243	0.101094
-59.074148	0.100695
-59.122019	0.102723
-59.169879	0.102024
-59.217657	0.100196
-59.265448	0.102623
-59.313182	0.100263
-59.360836	0.101725
-59.408524	0.103221
-59.456130	0.102756
-59.503700	0.101559
-59.551165	0.100828
-59.598642	0.105216
-59.646059	0.102423
-59.693440	0.103487
-59.740737	0.101759
-59.788022	0.102157
-59.835272	0.100961
-59.882416	0.100794
-59.929572	0.102091
-59.976714	0.100695
-60.023795	0.103254
-60.070817	0.101459
-60.117801	0.102024
-60.164773	0.102091
-60.211614	0.100528
-60.258442	0.101326
-60.305257	0.099531
-60.352010	0.102423
-60.398701	0.099897
-60.445355	0.100828
-60.491995	0.100429
-60.538596	0.101493
-60.585113	0.100196
-60.631615	0.100994
-60.678032	0.101792
-60.724387	0.100562
-60.770728	0.102490
-60.817031	0.098866
-60.863320	0.100030
-60.909548	0.100063
-60.955737	0.100628
-61.001909	0.101925
-61.048019	0.101326
-61.094090	0.102357
-61.140075	0.100728
-61.186018	0.102523
-61.231944	0.102922
-61.277829	0.102756
-61.323652	0.100495
-61.369480	0.099664
-61.415219	0.099166
-61.460895	0.100562
-61.506532	0.097537
-61.552129	0.099066
-61.597709	0.100196
-61.643249	0.100495
-61.688727	0.102423
-61.734189	0.099664
-61.779634	0.101127
-61.825039	0.100263
-61.870404	0.101825
-61.915683	0.099830
-61.960991	0.100429
-62.006190	0.098035
-62.051349	0.100828
-62.096443	0.101227
-62.141520	0.100495
-62.186533	0.101393
-62.231505	0.098634
-62.276484	0.100030
-62.321423	0.101958
-62.366253	0.098102
-62.411066	0.101060
-62.455885	0.101958
-62.500615	0.101127
-62.545327	0.100462
-62.589975	0.100994
-62.634606	0.100661
-62.679196	0.100429
-62.723722	0.099332
-62.768205	0.099598
-62.812646	0.102224
-62.857068	0.101958
-62.901333	0.102290
-62.945602	0.100528
-62.989851	0.101792
-63.034059	0.101692
-63.078227	0.099332
-63.122353	0.099498
-63.166391	0.100196
-63.210459	0.100927
-63.254441	0.098401
-63.298335	0.098567
-63.342212	0.101459
-63.386048	0.100562
-63.429820	0.100828
-63.473597	0.100096
-63.517334	0.101260
-63.561030	0.100695
-63.604662	0.099332
-63.648277	0.100296
-63.691806	0.100961
-63.735294	0.098833
-63.778764	0.100695
-63.822169	0.099033
-63.865577	0.099199
-63.908898	0.098767
-63.952177	0.099631
-63.995390	0.100362
-64.038583	0.099166
-64.081712	0.099465
-64.124822	0.101160
-64.167889	0.097736
-64.210888	0.100429
-64.253845	0.100229
-64.296783	0.099764
-64.339653	0.098800
-64.382434	0.099797
-64.425220	0.099398
-64.467940	0.098833
-64.510640	0.102257
-64.553251	0.098767
-64.595888	0.099265
-64.638435	0.098866
-64.680962	0.100495
-64.723422	0.099033
-64.765838	0.097570
-64.808208	0.099465
-64.850511	0.100229
-64.892792	0.099764
-64.935007	0.099864
-64.977199	0.100661
-65.019323	0.099564
-65.061401	0.099033
-65.103412	0.098933
-65.145425	0.097836
-65.187394	0.099564
-65.229318	0.100396
-65.271175	0.101094
-65.312940	0.099298
-65.354684	0.098434
-65.396384	0.099365
-65.438086	0.097370
-65.479694	0.099997
-65.521280	0.100130
-65.562820	0.098767
-65.604269	0.100961
-65.645674	0.100429
-65.687055	0.100661
-65.728391	0.096772
-65.769657	0.098900
-65.810877	0.101360
-65.852051	0.099631
-65.893227	0.098600
-65.934333	0.098301
-65.975348	0.098035
-66.016341	0.100528
-66.057359	0.099398
-66.098263	0.098467
-66.139143	0.099066
-66.180001	0.097304
-66.220813	0.099830
-66.261556	0.099232
-66.302276	0.099498
-66.342929	0.100362
-66.383513	0.097470
-66.424075	0.099332
-66.464592	0.096971
-66.505064	0.100163
-66.545466	0.097869
-66.585821	0.099166
-66.626154	0.099498
-66.666416	0.099265
-66.706679	0.099365
-66.746848	0.099298
-66.786971	0.098966
-66.827047	0.099664
-66.867054	0.099930
-66.906989	0.100462
-66.946878	0.098634
-66.986767	0.099598
-67.026632	0.097470
-67.066427	0.099398
-67.106198	0.100429
-67.145876	0.098900
-67.185553	0.097304
-67.225181	0.099066
-67.264787	0.100196
-67.304323	0.098600
-67.343788	0.099997
-67.383252	0.096672
-67.422666	0.098501
-67.462055	0.101060
-67.501326	0.097603
-67.540597	0.097570
-67.579751	0.097636
-67.618929	0.098434
-67.658038	0.098434
-67.697122	0.098168
-67.736156	0.098401
-67.775142	0.099332
-67.814102	0.097237
-67.852992	0.101193
-67.891834	0.098800
-67.930627	0.098999
-67.969350	0.098501
-68.008049	0.098301
-68.046724	0.099431
-68.085303	0.097503
-68.123833	0.097437
-68.162337	0.097769
-68.200816	0.096872
-68.239247	0.098235
-68.277606	0.098534
-68.315916	0.097736
-68.354200	0.096805
-68.392436	0.097271
-68.430602	0.098002
-68.468767	0.100861
-68.506840	0.100063
-68.544841	0.098168
-68.582816	0.098501
-68.620789	0.097404
-68.658690	0.096107
-68.696542	0.096772
-68.734391	0.098268
-68.772192	0.096938
-68.809898	0.097038
-68.847578	0.097104
-68.885208	0.097503
-68.922790	0.097537
-68.960347	0.097204
-68.997852	0.096838
-69.035307	0.098667
-69.072690	0.096606
-69.110047	0.099265
-69.147378	0.096373
-69.184684	0.100994
-69.221895	0.098002
-69.259103	0.097171
-69.296237	0.096772
-69.333298	0.097071
-69.370309	0.097337
-69.407314	0.095874
-69.444267	0.097836
-69.481168	0.099099
-69.518040	0.098301
-69.554836	0.098667
-69.591603	0.095309
-69.628295	0.097503
-69.664888	0.096805
-69.701452	0.096705
-69.738011	0.097470
-69.774543	0.097171
-69.810977	0.098866
-69.847406	0.097005
-69.883737	0.099365
-69.920063	0.097570
-69.956291	0.099365
-69.992490	0.096739
-70.028636	0.095941
-70.064728	0.098135
-70.100813	0.097437
-70.136797	0.097636
-70.172774	0.096007
-70.208696	0.098600
-70.244542	0.094711
-70.280334	0.098102
-70.316096	0.097603
-70.351806	0.097138
-70.387461	0.095043
-70.423062	0.098168
-70.458633	0.096739
-70.494150	0.098102
-70.529567	0.096573
-70.564974	0.096174
-70.600304	0.098401
-70.635601	0.097803
-70.670822	0.098534
-70.705987	0.096506
-70.741122	0.099398
-70.776200	0.094777
-70.811177	0.096373
-70.846122	0.097603
-70.881106	0.095342
-70.915989	0.096672
-70.950816	0.098700
-70.985588	0.098600
-71.020307	0.097237
-71.054948	0.096373
-71.089605	0.097404
-71.124183	0.096705
-71.158730	0.096373
-71.193224	0.097869
-71.227664	0.096041
-71.262096	0.094611
-71.296427	0.095808
-71.330681	0.096705
-71.364928	0.096007
-71.399142	0.097703
-71.433277	0.097603
-71.467380	0.097071
-71.501429	0.098102
-71.535447	0.096373
-71.569386	0.097437
-71.603270	0.098135
-71.637074	0.093946
-71.670868	0.096074
-71.704585	0.094279
-71.738270	0.097337
-71.771945	0.095475
-71.805563	0.097171
-71.839101	0.096872
-71.872559	0.096107
-71.905984	0.095841
-71.939376	0.095475
-71.972688	0.098334
-72.005966	0.095442
-72.039212	0.095775
-72.072380	0.095376
-72.105470	0.097138
-72.138574	0.096207
-72.171598	0.098534
-72.204544	0.098235
-72.237457	0.097138
-72.270313	0.095509
-72.303136	0.097902
-72.335901	0.094578
-72.368609	0.096805
-72.401283	0.095176
-72.433877	0.095675
-72.466461	0.097636
-72.498942	0.095675
-72.531410	0.094877
-72.563799	0.096606
-72.596177	0.093182
-72.628476	0.096506
-72.660741	0.098002
-72.692947	0.095874
-72.725073	0.097337
-72.757189	0.095509
-72.789272	0.093680
-72.821299	0.097138
-72.853244	0.094112
-72.885108	0.095043
-72.916961	0.094478
-72.948733	0.096506
-72.980518	0.097370
-73.012291	0.097836
-73.043935	0.094678
-73.075500	0.095741
-73.107031	0.095974
-73.138528	0.096938
-73.169969	0.096140
-73.201376	0.095409
-73.232725	0.095874
-73.264062	0.094744
-73.295320	0.096440
-73.326497	0.096307
-73.357641	0.097836
-73.388727	0.094445
-73.419777	0.096207
-73.450723	0.094744
-73.481658	0.095841
-73.512513	0.095974
-73.543357	0.093248
-73.574146	0.095342
-73.604854	0.094478
-73.635529	0.097171
-73.666149	0.094212
-73.696712	0.096240
-73.727241	0.095908
-73.757691	0.095908
-73.788131	0.095309
-73.818490	0.094279
-73.848815	0.095309
-73.879061	0.095110
-73.909298	0.095675
-73.939502	0.094179
-73.969671	0.094977
-73.999807	0.095509
-74.029840	0.095908
-74.059839	0.097670
-74.089780	0.096772
-74.119642	0.094811
-74.149494	0.095941
-74.179265	0.094877
-74.209024	0.094478
-74.238724	0.094644
-74.268367	0.094412
-74.297929	0.097138
-74.327434	0.095874
-74.356903	0.095442
-74.386312	0.094345
-74.415709	0.094844
-74.445025	0.096705
-74.474353	0.097603
-74.503603	0.095077
-74.532794	0.095509
-74.561926	0.094811
-74.590999	0.097071
-74.620013	0.094711
-74.648967	0.095775
-74.677932	0.095642
-74.706814	0.095342
-74.735682	0.093880
-74.764469	0.093813
-74.793220	0.093847
-74.821890	0.096140
-74.850523	0.095874
-74.879097	0.094312
-74.907635	0.094046
-74.936114	0.094245
-74.964534	0.096074
-74.992895	0.094412
<<END>>
