<<DATA>>
106.436358 501.615801 22.817061 58.995491 26368.283900 105.436358 -0.160879 
106.432339 501.617572 22.815755 58.993098 26354.945200 105.432339 -0.160879 
106.424569 501.624081 22.813592 58.987257 25910.650000 105.424569 -0.160879 
106.410058 501.625388 22.810764 58.979239 26192.000000 105.410058 -0.160879 

97.553499 502.891701 20.680212 53.507925 31681.449600 96.553499 -0.160813 
97.526882 502.903756 20.673457 53.490956 31292.400600 96.526882 -0.160813 
97.485633 502.912281 20.664484 53.468227 31176.218700 96.485633 -0.160812 
97.464805 502.913423 20.660148 53.457022 31259.408000 96.464805 -0.160812 

91.331856 504.987107 19.196973 49.695995 37112.337600 90.331856 -0.160706 
91.323120 504.990137 19.194425 49.690015 37296.438600 90.323120 -0.160706 
91.252406 505.024040 19.177614 49.646641 37241.555000 90.252406 -0.160704 
91.233772 505.028929 19.172819 49.634922 37303.648100 90.233772 -0.160704 

83.382499 509.156601 17.300310 44.814208 51631.075100 82.382499 -0.160493 
83.359117 509.172781 17.294917 44.800349 51219.353900 82.359117 -0.160492 
83.280946 509.226699 17.276751 44.753700 52162.083800 82.280946 -0.160490 
83.239437 509.249162 17.266816 44.728157 52047.366500 82.239437 -0.160489 

77.666679 513.259448 15.942420 41.316069 67051.213400 76.666679 -0.160286 
77.637932 513.285990 15.935104 41.297470 67400.314900 76.637932 -0.160285 
77.593525 513.322577 15.924252 41.269167 68193.035800 76.593525 -0.160283 
77.567599 513.346694 15.919072 41.255720 68193.222000 76.567599 -0.160282 

72.128233 518.187142 14.631213 37.932352 87829.206000 71.128233 -0.160041 
72.107752 518.209170 14.625260 37.917213 87693.215100 71.107752 -0.160040 
72.036464 518.284864 14.608305 37.873301 88458.034800 71.036464 -0.160036 
72.015660 518.295017 14.604342 37.863453 88239.639500 71.015660 -0.160036 

69.043698 521.397410 13.907826 36.063536 103213.568000 68.043698 -0.159883 
69.030869 521.411782 13.904463 36.054623 103040.423000 68.030869 -0.159882 
68.999238 521.444652 13.897933 36.037959 103773.874000 67.999238 -0.159880 
68.975430 521.470074 13.891316 36.020620 103815.363000 67.975430 -0.159879 

65.984990 525.015807 13.186156 34.198637 120907.595000 64.984990 -0.159706 
65.957853 525.048167 13.179235 34.181258 120889.964000 64.957853 -0.159704 
65.885728 525.135665 13.162079 34.136440 121294.261000 64.885728 -0.159700 
65.862882 525.174517 13.155401 34.119451 121879.164000 64.862882 -0.159698 

61.247704 531.428903 12.068036 31.308638 155897.355000 60.247704 -0.159396 
61.199209 531.510953 12.056481 31.278409 156121.836000 60.199209 -0.159392 
61.090368 531.671593 12.030975 31.212784 157714.386000 60.090368 -0.159384 
61.066939 531.702905 12.025403 31.198562 158017.470000 60.066939 -0.159383 

56.789176 538.586756 11.012066 28.574458 200591.083000 55.789176 -0.159056 
56.763614 538.633244 11.005721 28.557900 200481.881000 55.763614 -0.159054 
56.726193 538.706721 10.996476 28.533805 200877.370000 55.726193 -0.159050 
56.701658 538.743501 10.990180 28.518146 201218.327000 55.701658 -0.159049 

56.628029 538.880346 10.972068 28.470113 201806.648000 55.628029 -0.159042 
56.588631 538.942492 10.962949 28.447138 202134.205000 55.588631 -0.159039 
56.561299 538.989208 10.957050 28.431701 203964.538000 55.561299 -0.159037 
56.527895 539.056497 10.948013 28.408438 204764.776000 55.527895 -0.159034 

52.538456 546.536649 10.000003 25.952088 249137.286000 51.538456 -0.158686 
52.490382 546.625798 9.988666 25.922540 250167.687000 51.490382 -0.158681 
52.459623 546.699260 9.980120 25.900762 250182.289000 51.459623 -0.158678 
52.441664 546.724238 9.977401 25.893857 250255.665000 51.441664 -0.158677 

46.291656 560.551440 8.513003 22.094423 338628.394000 45.291656 -0.158049 
46.259023 560.642826 8.504130 22.070996 342398.151000 45.259023 -0.158045 
46.200950 560.783417 8.490820 22.036742 342766.144000 45.200950 -0.158039 
46.185378 560.831080 8.486484 22.025742 343597.077000 45.185378 -0.158037 

40.055185 578.102607 7.026447 18.231561 455839.079000 39.055185 -0.157282 
40.028454 578.192033 7.020111 18.215253 455313.141000 39.028454 -0.157278 
39.988722 578.326056 7.010344 18.189921 454682.820000 38.988722 -0.157272 
39.978229 578.385824 7.006563 18.179831 455596.221000 38.978229 -0.157270 

21.863531 665.565672 2.942905 7.588550 820339.896000 20.863531 -0.153867 
21.874955 665.576616 2.942864 7.588455 819009.494000 20.874955 -0.153866 
21.869750 665.554875 2.942943 7.588370 818606.603000 20.869750 -0.153867 
21.862082 665.583252 2.942958 7.588475 819095.676000 20.862082 -0.153866 

21.855542 665.597136 2.942144 7.586989 820755.734000 20.855542 -0.153866 
21.853274 665.604365 2.942197 7.586904 823001.259000 20.853274 -0.153865 
21.851109 665.605518 2.942134 7.586839 818304.153000 20.851109 -0.153865 
21.851833 665.588764 2.942187 7.587298 822082.324000 20.851833 -0.153866
 
21.855920 665.609519 2.941444 7.586301 854624.636000 20.855920 -0.153865 
21.847274 665.605141 2.941531 7.586416 854579.316000 20.847274 -0.153865 
21.843266 665.601932 2.941455 7.585980 853871.946000 20.843266 -0.153865 
21.853686 665.604027 2.941438 7.586391 853397.354000 20.853686 -0.153865 

21.832047 665.537611 2.942737 7.589617 859538.142000 20.832047 -0.153868 
21.836466 665.531633 2.942673 7.589408 859127.811000 20.836466 -0.153868 
21.839185 665.535159 2.942676 7.589224 858153.732000 20.839185 -0.153868 
21.839878 665.540388 2.942715 7.589318 858146.407000 20.839878 -0.153868 

21.815847 665.472453 2.943828 7.592459 854699.794000 20.815847 -0.153870 
21.821614 665.471493 2.943844 7.592566 866188.432000 20.821614 -0.153870 
21.817348 665.485118 2.943805 7.592511 858952.006000 20.817348 -0.153870 
21.820703 665.477170 2.943895 7.592676 856002.784000 20.820703 -0.153870 

21.795301 665.387269 2.945513 7.596939 906048.614000 20.795301 -0.153873 
21.796243 665.398048 2.945526 7.596834 918732.845000 20.796243 -0.153873 
21.800980 665.384784 2.945493 7.597026 888660.991000 20.800980 -0.153873 
21.792595 665.397123 2.945449 7.596917 886719.755000 20.792595 -0.153873 

21.777682 665.340486 2.946676 7.599942 896060.683000 20.777682 -0.153875 
21.787277 665.334724 2.946740 7.600055 887072.200000 20.787277 -0.153875 
21.779005 665.329917 2.946834 7.599913 887114.875000 20.779005 -0.153875 
21.782170 665.326249 2.946736 7.599947 883890.577000 20.782170 -0.153875 
21.786835 665.337051 2.946737 7.600042 884491.628000 20.786835 -0.153875 
<<END>>
