{
    "uploaded": [], 
    "Experiments missing calculated data": [], 
    "Experiments missing raw data": [], 
    "Experiments missing metadata for raw data": [], 
    "Experiments missing metadata for calculated data": []
}