{
    "token_cos" : "",
    "token_elab" : "",
    "ENDPOINT_elab" : "", 
    "data_folder" : ".",
    "device" : "Tensiometer, Drop Shape Analyzer (R 105)",
    "report_folder" : "uploadReports",
    "reportinfo_name" : "reportinfo.json", 
    "LOG_FOLDER" : "logs",
    "log_file_name" : "DSA_script_error.log"
}
