\contentsline {chapter}{Abstract}{ii}{chapter*.1}% 
\contentsline {chapter}{\numberline {1}Introduction}{1}{chapter.1}% 
\contentsline {section}{\numberline {1.1}Motivation}{1}{section.1.1}% 
\contentsline {section}{\numberline {1.2}Problem Statement}{1}{section.1.2}% 
\contentsline {section}{\numberline {1.3}Research Goals}{1}{section.1.3}% 
\contentsline {section}{\numberline {1.4}Contribution}{1}{section.1.4}% 
\contentsline {section}{\numberline {1.5}Thesis Structure}{1}{section.1.5}% 
\contentsline {chapter}{\numberline {2}Related Work}{2}{chapter.2}% 
\contentsline {chapter}{\numberline {3}Preliminaries}{3}{chapter.3}% 
\contentsline {chapter}{\numberline {4}Method}{4}{chapter.4}% 
\contentsline {chapter}{\numberline {5}Implementation}{5}{chapter.5}% 
\contentsline {chapter}{\numberline {6}Evaluation}{6}{chapter.6}% 
\contentsline {chapter}{\numberline {7}Conclusion}{7}{chapter.7}% 
\contentsline {chapter}{Bibliography}{8}{chapter*.3}% 
\contentsline {chapter}{Acknowledgement}{9}{chapter*.4}% 
