\relax 
\providecommand\hyper@newdestlabel[2]{}
\providecommand\HyperFirstAtBeginDocument{\AtBeginDocument}
\HyperFirstAtBeginDocument{\ifx\hyper@anchor\@undefined
\global\let\oldcontentsline\contentsline
\gdef\contentsline#1#2#3#4{\oldcontentsline{#1}{#2}{#3}}
\global\let\oldnewlabel\newlabel
\gdef\newlabel#1#2{\newlabelxx{#1}#2}
\gdef\newlabelxx#1#2#3#4#5#6{\oldnewlabel{#1}{{#2}{#3}}}
\AtEndDocument{\ifx\hyper@anchor\@undefined
\let\contentsline\oldcontentsline
\let\newlabel\oldnewlabel
\fi}
\fi}
\global\let\hyper@last\relax 
\gdef\HyperFirstAtBeginDocument#1{#1}
\providecommand\HyField@AuxAddToFields[1]{}
\providecommand\HyField@AuxAddToCoFields[2]{}
\bibstyle{unsrtnat}
\providecommand \oddpage@label [2]{}
\pgfsyspdfmark {pgfid1}{6526379}{48320183}
\@writefile{toc}{\contentsline {chapter}{Abstract}{ii}{chapter*.1}\protected@file@percent }
\@writefile{toc}{\contentsline {chapter}{\numberline {1}Introduction}{1}{chapter.1}\protected@file@percent }
\@writefile{lof}{\addvspace {10\p@ }}
\@writefile{lot}{\addvspace {10\p@ }}
\@writefile{loa}{\addvspace {10\p@ }}
\newlabel{chap:intro}{{1}{1}{Introduction}{chapter.1}{}}
\newlabel{chap:intro@cref}{{[chapter][1][]1}{[1][1][]1}}
\@writefile{toc}{\contentsline {section}{\numberline {1.1}Motivation}{1}{section.1.1}\protected@file@percent }
\@writefile{toc}{\contentsline {section}{\numberline {1.2}Problem Statement}{1}{section.1.2}\protected@file@percent }
\@writefile{toc}{\contentsline {section}{\numberline {1.3}Research Goals}{1}{section.1.3}\protected@file@percent }
\@writefile{toc}{\contentsline {section}{\numberline {1.4}Contribution}{1}{section.1.4}\protected@file@percent }
\@writefile{toc}{\contentsline {section}{\numberline {1.5}Thesis Structure}{1}{section.1.5}\protected@file@percent }
\@writefile{toc}{\contentsline {chapter}{\numberline {2}Related Work}{2}{chapter.2}\protected@file@percent }
\@writefile{lof}{\addvspace {10\p@ }}
\@writefile{lot}{\addvspace {10\p@ }}
\@writefile{loa}{\addvspace {10\p@ }}
\newlabel{chap:related_work}{{2}{2}{Related Work}{chapter.2}{}}
\newlabel{chap:related_work@cref}{{[chapter][2][]2}{[1][2][]2}}
\@writefile{toc}{\contentsline {chapter}{\numberline {3}Preliminaries}{3}{chapter.3}\protected@file@percent }
\@writefile{lof}{\addvspace {10\p@ }}
\@writefile{lot}{\addvspace {10\p@ }}
\@writefile{loa}{\addvspace {10\p@ }}
\newlabel{chap:prelim}{{3}{3}{Preliminaries}{chapter.3}{}}
\newlabel{chap:prelim@cref}{{[chapter][3][]3}{[1][3][]3}}
\@writefile{toc}{\contentsline {chapter}{\numberline {4}Method}{4}{chapter.4}\protected@file@percent }
\@writefile{lof}{\addvspace {10\p@ }}
\@writefile{lot}{\addvspace {10\p@ }}
\@writefile{loa}{\addvspace {10\p@ }}
\newlabel{chap:method}{{4}{4}{Method}{chapter.4}{}}
\newlabel{chap:method@cref}{{[chapter][4][]4}{[1][4][]4}}
\@writefile{toc}{\contentsline {chapter}{\numberline {5}Implementation}{5}{chapter.5}\protected@file@percent }
\@writefile{lof}{\addvspace {10\p@ }}
\@writefile{lot}{\addvspace {10\p@ }}
\@writefile{loa}{\addvspace {10\p@ }}
\newlabel{chap:impl}{{5}{5}{Implementation}{chapter.5}{}}
\newlabel{chap:impl@cref}{{[chapter][5][]5}{[1][5][]5}}
\@writefile{toc}{\contentsline {chapter}{\numberline {6}Evaluation}{6}{chapter.6}\protected@file@percent }
\@writefile{lof}{\addvspace {10\p@ }}
\@writefile{lot}{\addvspace {10\p@ }}
\@writefile{loa}{\addvspace {10\p@ }}
\newlabel{chap:eval}{{6}{6}{Evaluation}{chapter.6}{}}
\newlabel{chap:eval@cref}{{[chapter][6][]6}{[1][6][]6}}
\bibdata{references}
\@writefile{toc}{\contentsline {chapter}{\numberline {7}Conclusion}{7}{chapter.7}\protected@file@percent }
\@writefile{lof}{\addvspace {10\p@ }}
\@writefile{lot}{\addvspace {10\p@ }}
\@writefile{loa}{\addvspace {10\p@ }}
\newlabel{chap:conclusion}{{7}{7}{Conclusion}{chapter.7}{}}
\newlabel{chap:conclusion@cref}{{[chapter][7][]7}{[1][7][]7}}
\@writefile{toc}{\contentsline {chapter}{Bibliography}{8}{chapter*.3}\protected@file@percent }
\@writefile{toc}{\contentsline {chapter}{Acknowledgement}{9}{chapter*.4}\protected@file@percent }
