{
	"JSON": {
		"ID": "1ee866b1-2fd1-616b-b577-20e80eb34004",
		"label": "",
		"comment": "UUID6 is used"
	},
	"group": {
		"type": "group_info",
		"number": "77",
		"author": "Bianca Beer",
		"experiment": "Lerneinheit II - Kalorimetrie"
	}
}