{
	"JSON": {
		"ID": "1ee866b6-c938-671b-aa82-246725fb2f67",
		"label": "",
		"comment": "UUID6 is used"
	},
	"experiment": "affirmation_of_newtons_law_of_cooling",
    "comment": "This setup-file describes the setup for affirmation of Newton's law of cooling.",
    "info": "List below ALL components, you used in your experiment. By using the UUID there is no possibility to mix something up.",
	"setup": {
		"1ee866b1-2fd1-616b-b577-20e80eb34004": {
            "type": "group_info",
			"name": "group_info",
            "comment": ""
        },
		"1ee866b3-6b98-626f-bcb1-7c7af23a47c5": {
            "type": "instrument",
			"name": "raspberry_pi",
            "comment": ""
        },
		"1ee8667b-987d-619a-a625-f52b99d6425c": {
            "type": "sensor",
			"name": "temperature_cup",
            "comment": ""
        },
		"1ee866b5-41e7-6f67-83ac-dacbbf28cf77": {
            "type": "probe",
			"name": "hot_beverage",
            "comment": ""
        },
		"1ee866a2-a87b-6a9e-bb8d-067b4c8ccc7c": {
			"type": "sensor",
			"name": "temperature_environment",
			"comment": ""
		}
	}
}