digraph {
10[shape=box,label="(10, 1)", color="green"]
9[shape=box,label="(9, 1)", color="green"]
8[shape=box,label="(8, 0)", color="green"]
7[shape=box,label="(7, 0)", color="green"]
6[shape=box,label="(6, 0)", color="green"]
5[shape=box,label="(5, 0)", color="green"]
4[shape=box,label="(4, 1)", color="green"]
8 -> 10[label="1"]
7 -> 9[label="1"]
2 -> 8[label="-2.79402"]
7 -> 8[label="1"]
6 -> 7[label="-5.01252"]
5 -> 7[label="-1.79402"]
1 -> 7[label="-2.79402"]
5 -> 6[label="-1"]
2 -> 6[label="1"]
4 -> 5[label="3.42552"]
3 -> 5[label="3.42552"]

}
