digraph {
12[shape=box,label="(12, 0)", color="green"]
11[shape=box,label="(11, 0)", color="green"]
10[shape=box,label="(10, 1)", color="green"]
9[shape=box,label="(9, 0)", color="green"]
8[shape=box,label="(8, 0)", color="green"]
7[shape=box,label="(7, 0)", color="green"]
6[shape=box,label="(6, 1)", color="green"]
5[shape=box,label="(5, 0)", color="green"]
4[shape=box,label="(4, 1)", color="green"]
3[shape=box,label="(3, 0)", color="green"]
2[shape=box,label="(2, 0)", color="green"]
9[shape=box,label="(9, ext. function)",color="red"]
7[shape=box,label="(7, ext. function)",color="red"]
3[shape=box,label="(3, ext. function)",color="red"]
1[shape=box,label="(1, ext. function)",color="red"]
4 -> 6[label="1"]
8 -> 9[label="unknown",color="red"]
9 -> 10[label="unknown",color="red"]
7 -> 7[label="unknown",color="red"]
7 -> 8[label="unknown",color="red"]
2 -> 3[label="unknown",color="red"]
3 -> 4[label="unknown",color="red"]
1 -> 1[label="unknown",color="red"]
1 -> 2[label="unknown",color="red"]

}
