name,X (World),Y (World),Z (World),X (Data),Y (Data),Z (Data),Color Blue,Color Green,Color Red,Color Alpha
Marker,2,2,2,0,0,0,0,0,0,0
Marker,2,2.5,2.5,0,0,0,0,0,0,0
Marker,2,3,3,0,0,0,0,0,0,0
Marker,2,3.5,2,0,0,0,0,0,0,0
Marker,2,1.5,2.5,0,0,0,0,0,0,0
Marker,2,1,3,0,0,0,0,0,0,0
Marker,2,0.5,2,0,0,0,0,0,0,0
Marker,2,2,2.5,0,0,0,0,0,0,0
Marker,2,2.5,3,0,0,0,0,0,0,0
Marker,2,3,2,0,0,0,0,0,0,0
Marker,2,3.5,2.5,0,0,0,0,0,0,0
Marker,2,1.5,3,0,0,0,0,0,0,0
Marker,2,1,2,0,0,0,0,0,0,0
Marker,2,0.5,2.5,0,0,0,0,0,0,0