{
	"JSON": {
		"ID": "1ee7f108-9cb1-6762-b9fd-73379ba2084c",
		"label": "",
		"comment": "UUID6 is used"
	},
    "comment": "here you can write down something important about this setup file",
    "info": "List below ALL components, you used in your experiment. By using the UUID there is no possibility to mix something up.",
	"setup": {
		"1ee7f0f4-c64e-6c9f-96a4-2cf74c47dd84": {
            "type": "group_info",
			"name": "group_info",
            "comment": ""
        },
		"1ee7f101-5902-6fdd-ab8f-9ca126d7bf87": {
            "type": "instrument",
			"name": "raspberry_pi",
            "comment": ""
        },
		"1ee7f0ee-5505-643b-995c-c8fe94d6d482": {
            "type": "sensor",
			"name": "temperature_cup",
            "comment": ""
        },
		"1ee7f101-6807-611e-a600-c9167de36bca": {
            "type": "probe",
			"name": "probe_description",
            "comment": ""
        },
		"1ee7f0ee-b9ce-6b33-a202-94164cd40a0c": {
			"type": "sensor",
			"name": "temperature_environment",
			"comment": ""
		}
	}
}