{
	"JSON": {
		"ID": "1ee7f0f4-c64e-6c9f-96a4-2cf74c47dd84",
		"label": "",
		"comment": "UUID6 is used"
	},
	"group": {
		"number": "39",
		"author": "Bastian Bickel",
		"experiment": "Lerneinheit 2-1"
	}
}