$MeshFormat
2.2 0 8
$EndMeshFormat
$PhysicalNames
1
1 1 "LEFT"
$EndPhysicalNames
$Nodes
707
1 0 0 0
2 0.001 0 0
3 5 0 0
4 25 0 0
5 1.021512856452063e-07 0 0
6 2.095095712018202e-07 0 0
7 3.223402684747598e-07 0 0
8 4.409223622833417e-07 0 0
9 5.655489802350173e-07 0 0
10 6.96528295582596e-07 0 0
11 8.341840385195013e-07 0 0
12 9.788565842160321e-07 0 0
13 1.130903573495263e-06 0 0
14 1.290700959540838e-06 0 0
15 1.458643761398745e-06 0 0
16 1.635147191577406e-06 0 0
17 1.820647598611408e-06 0 0
18 2.015603649276696e-06 0 0
19 2.220497266609823e-06 0 0
20 2.435835018695288e-06 0 0
21 2.662149309390145e-06 0 0
22 2.899999603868696e-06 0 0
23 3.149973962482711e-06 0 0
24 3.412690450729316e-06 0 0
25 3.688798394883899e-06 0 0
26 3.978980617140209e-06 0 0
27 4.283954377845937e-06 0 0
28 4.604473754508726e-06 0 0
29 4.941331149462043e-06 0 0
30 5.295359294569031e-06 0 0
31 5.667433498042877e-06 0 0
32 6.058473616081282e-06 0 0
33 6.469446388053353e-06 0 0
34 6.901367919780196e-06 0 0
35 7.355305978670925e-06 0 0
36 7.832382850731371e-06 0 0
37 8.333777981889564e-06 0 0
38 8.860731046965105e-06 0 0
39 9.41454457723685e-06 0 0
40 9.99658814063418e-06 0 0
41 1.060830025907263e-05 0 0
42 1.125119366626659e-05 0 0
43 1.192685749898271e-05 0 0
44 1.263696225448061e-05 0 0
45 1.338326355570592e-05 0 0
46 1.416760634794912e-05 0 0
47 1.499192991663619e-05 0 0
48 1.585827216869184e-05 0 0
49 1.6768774872681e-05 0 0
50 1.772568909948111e-05 0 0
51 1.873138066248992e-05 0 0
52 1.978833579480267e-05 0 0
53 2.089916750080623e-05 0 0
54 2.206662218905655e-05 0 0
55 2.329358599281705e-05 0 0
56 2.458309256084946e-05 0 0
57 2.593832979867883e-05 0 0
58 2.736264824751585e-05 0 0
59 2.8859569055575e-05 0 0
60 3.043279306808424e-05 0 0
61 3.208621003055799e-05 0 0
62 3.382390728657539e-05 0 0
63 3.565018100834711e-05 0 0
64 3.756954632368485e-05 0 0
65 3.958674885341029e-05 0 0
66 4.170677460207347e-05 0 0
67 4.393486554465802e-05 0 0
68 4.627652993055708e-05 0 0
69 4.873755697933184e-05 0 0
70 5.132403184832667e-05 0 0
71 5.404234783166257e-05 0 0
72 5.689922566158774e-05 0 0
73 5.990172913797006e-05 0 0
74 6.305728046015991e-05 0 0
75 6.637368092021387e-05 0 0
76 6.985913027335495e-05 0 0
77 7.352224501560135e-05 0 0
78 7.7372081448811e-05 0 0
79 8.141815761112131e-05 0 0
80 8.567047673392093e-05 0 0
81 9.013955090800589e-05 0 0
82 9.483642937682297e-05 0 0
83 9.977272393267165e-05 0 0
84 0.0001049606387015757 0 0
85 0.0001104129987012617 0 0
86 0.000116143286107815 0 0
87 0.0001221656653424594 0 0
88 0.0001284950270064664 0 0
89 0.000135147017763135 0 0
90 0.0001421380836698885 0 0
91 0.0001494855085580827 0 0
92 0.0001572074574124416 0 0
93 0.0001653230227519577 0 0
94 0.0001738522647213944 0 0
95 0.0001828162713141074 0 0
96 0.0001922372055304871 0 0
97 0.0002021383562706673 0 0
98 0.0002125442049091153 0 0
99 0.0002234804754343582 0 0
100 0.0002349742047503665 0 0
101 0.0002470538107771777 0 0
102 0.0002597491560637977 0 0
103 0.0002730916275572423 0 0
104 0.0002871142102155411 0 0
105 0.0003018515749598676 0 0
106 0.0003173401531782174 0 0
107 0.0003336182372768636 0 0
108 0.000350726075810613 0 0
109 0.0003687059600540824 0 0
110 0.0003876023378329859 0 0
111 0.0004074619291975189 0 0
112 0.000428333835770605 0 0
113 0.0004502696585353847 0 0
114 0.0004733236240319821 0 0
115 0.0004975527273617118 0 0
116 0.0005230168788016275 0 0
117 0.0005497790226218368 0 0
118 0.0005779053273960338 0 0
119 0.0006074653289561295 0 0
120 0.0006385321047483596 0 0
121 0.0006711824683202463 0 0
122 0.0007054971320803414 0 0
123 0.0007415609325948019 0 0
124 0.0007794630279219539 0 0
125 0.000819297123447302 0 0
126 0.0008611617080188035 0 0
127 0.000905160274392136 0 0
128 0.0009514015940130571 0 0
129 0.001050390647098374 0 0
130 0.001101796651400676 0 0
131 0.001154238504234863 0 0
132 0.00120773707731016 0 0
133 0.001262313645036018 0 0
134 0.001317989953983605 0 0
135 0.001374788135840992 0 0
136 0.001432730826002164 0 0
137 0.001491841075981088 0 0
138 0.001552142405015161 0 0
139 0.001613658812942911 0 0
140 0.001676414785798811 0 0
141 0.001740435322151501 0 0
142 0.001805745865367163 0 0
143 0.001872372439776452 0 0
144 0.001940341549898801 0 0
145 0.002009680262096413 0 0
146 0.002080416144645099 0 0
147 0.002152577384532284 0 0
148 0.002226192691244935 0 0
149 0.002301291353611256 0 0
150 0.002377903266426335 0 0
151 0.002456058931271727 0 0
152 0.002535789440953479 0 0
153 0.002617126546280625 0 0
154 0.002700102600882176 0 0
155 0.00278475064374103 0 0
156 0.002871104366228436 0 0
157 0.002959198147625469 0 0
158 0.003049067023129438 0 0
159 0.003140746762610538 0 0
160 0.003234273891840062 0 0
161 0.00332968559243885 0 0
162 0.003427019861271789 0 0
163 0.00352631543537976 0 0
164 0.003627611835534781 0 0
165 0.00373094937791117 0 0
166 0.003836369185125294 0 0
167 0.003943913213905782 0 0
168 0.004053624301156366 0 0
169 0.004165546076170604 0 0
170 0.004279723124128044 0 0
171 0.004396200852682705 0 0
172 0.004515025611233807 0 0
173 0.004636244713649631 0 0
174 0.00475990643211718 0 0
175 0.004886059945837634 0 0
176 0.005014755475385879 0 0
177 0.005146044243739708 0 0
178 0.005279978488743723 0 0
179 0.005416611578835093 0 0
180 0.005555997833704062 0 0
181 0.005698192732616947 0 0
182 0.005843252919757394 0 0
183 0.005991236076934726 0 0
184 0.006142201139240883 0 0
185 0.006296208168031809 0 0
186 0.006453318475028599 0 0
187 0.006613594565089511 0 0
188 0.006777100279193886 0 0
189 0.006943900655075772 0 0
190 0.007114062097376764 0 0
191 0.007287652375828774 0 0
192 0.00746474043784356 0 0
193 0.007645396931559243 0 0
194 0.00782969366115371 0 0
195 0.008017703977986939 0 0
196 0.008209502838781066 0 0
197 0.00840516641631937 0 0
198 0.008604772647985173 0 0
199 0.008808400989466447 0 0
200 0.009016132464926715 0 0
201 0.00922804981473932 0 0
202 0.009444237345422837 0 0
203 0.009664781013926947 0 0
204 0.009889768807311419 0 0
205 0.01011929008531557 0 0
206 0.01035343623695072 0 0
207 0.01059230051530747 0 0
208 0.01083597798534361 0 0
209 0.01108456557892604 0 0
210 0.01133816220951363 0 0
211 0.01159686896912194 0 0
212 0.01186078865591166 0 0
213 0.01213002638543179 0 0
214 0.01240468933290875 0 0
215 0.01268488673284233 0 0
216 0.01297073022846762 0 0
217 0.01326233352890157 0 0
218 0.0135598126508341 0 0
219 0.01386328610515121 0 0
220 0.01417287456258367 0 0
221 0.01448870130900094 0 0
222 0.0148108920046255 0 0
223 0.01513957493741156 0 0
224 0.0154748808956839 0 0
225 0.01581694329957148 0 0
226 0.01616589843141364 0 0
227 0.01652188501019942 0 0
228 0.01688504469580135 0 0
229 0.01725552233764685 0 0
230 0.01763346493669135 0 0
231 0.018019023338411 0 0
232 0.01841235081997723 0 0
233 0.01881360387345825 0 0
234 0.01922294224216495 0 0
235 0.01964052874897327 0 0
236 0.02006652994409234 0 0
237 0.02050111504875522 0 0
238 0.02094445711851999 0 0
239 0.02139673261203435 0 0
240 0.02185812150568716 0 0
241 0.02232880753204267 0 0
242 0.02280897804187788 0 0
243 0.02329882401450438 0 0
244 0.0237985404512948 0 0
245 0.02430832629624722 0 0
246 0.02482838448125133 0 0
247 0.02535892196065855 0 0
248 0.02590014973606119 0 0
249 0.02645228352140682 0 0
250 0.02701554280987436 0 0
251 0.02759015201113067 0 0
252 0.02817633962298554 0 0
253 0.0287743389879983 0 0
254 0.02938438822256505 0 0
255 0.03000673009645378 0 0
256 0.03064161225767014 0 0
257 0.03128928741511117 0 0
258 0.03195001328601241 0 0
259 0.03262405307123746 0 0
260 0.03331167482129419 0 0
261 0.0340131525072902 0 0
262 0.03472876489085162 0 0
263 0.03545879670875692 0 0
264 0.0362035392095561 0 0
265 0.03696328842733007 0 0
266 0.03773834651391057 0 0
267 0.03852902225485437 0 0
268 0.03933563059395674 0 0
269 0.04015849183094234 0 0
270 0.04099793401712472 0 0
271 0.04185429130089017 0 0
272 0.04272790426330435 0 0
273 0.04361912057142062 0 0
274 0.04452829517829184 0 0
275 0.04545578992131052 0 0
276 0.04640197374072512 0 0
277 0.04736722325764957 0 0
278 0.0483519229769831 0 0
279 0.04935646458325019 0 0
280 0.05038124764207644 0 0
281 0.05142668064150288 0 0
282 0.05249317919057835 0 0
283 0.05358116786141098 0 0
284 0.05469107958891995 0 0
285 0.05582335651911845 0 0
286 0.05697844887859447 0 0
287 0.05815681681793841 0 0
288 0.05935892895181994 0 0
289 0.06058526384736436 0 0
290 0.06183630974772444 0 0
291 0.06311256439210451 0 0
292 0.06441453582132832 0 0
293 0.06574274225914352 0 0
294 0.06709771239661806 0 0
295 0.06847998540109387 0 0
296 0.06989011201684137 0 0
297 0.07132865184119765 0 0
298 0.07279617923997628 0 0
299 0.07429327797113948 0 0
300 0.07582054307406007 0 0
301 0.077378582722925 0 0
302 0.07896801748767671 0 0
303 0.08058947953237798 0 0
304 0.0822436143669074 0 0
305 0.08393108015992287 0 0
306 0.08565254890335096 0 0
307 0.08740870577267724 0 0
308 0.08920024936462549 0 0
309 0.09102789273645777 0 0
310 0.09289236410329794 0 0
311 0.0947944047346387 0 0
312 0.09673477162688479 0 0
313 0.09871423717466142 0 0
314 0.1007335895717555 0 0
315 0.1027936323260351 0 0
316 0.1048951856472558 0 0
317 0.107039085588956 0 0
318 0.1092261853655345 0 0
319 0.111457355693425 0 0
320 0.1137334845763257 0 0
321 0.1160554779360067 0 0
322 0.1184242598780128 0 0
323 0.1208407732885507 0 0
324 0.1233059799326134 0 0
325 0.1258208610224258 0 0
326 0.1283864171725351 0 0
327 0.1310036703127939 0 0
328 0.133673661416699 0 0
329 0.1363974532611273 0 0
330 0.1391761303694375 0 0
331 0.1420107988003785 0 0
332 0.1449025851358697 0 0
333 0.1478526430307223 0 0
334 0.1508621442005889 0 0
335 0.153932287168329 0 0
336 0.1570642941078433 0 0
337 0.1602594127581759 0 0
338 0.1635189127854857 0 0
339 0.1668440929697279 0 0
340 0.1702362757725899 0 0
341 0.1736968111300131 0 0
342 0.177227078490705 0 0
343 0.1808284798515548 0 0
344 0.1845024517823437 0 0
345 0.1882504541930851 0 0
346 0.1920739791258113 0 0
347 0.1959745495374156 0 0
348 0.1999537174957063 0 0
349 0.2040130654204792 0 0
350 0.2081542113587658 0 0
351 0.2123788013969441 0 0
352 0.2166885179622439 0 0
353 0.2210850763528593 0 0
354 0.2255702257516307 0 0
355 0.2301457521512973 0 0
356 0.2348134768612092 0 0
357 0.2395752566547829 0 0
358 0.2444329872549631 0 0
359 0.2493886022881466 0 0
360 0.2544440737398679 0 0
361 0.2596014143582638 0 0
362 0.2648626761918419 0 0
363 0.2702299531873173 0 0
364 0.2757053825991556 0 0
365 0.2812911446576298 0 0
366 0.286989458400503 0 0
367 0.2928025953503046 0 0
368 0.2987328669334492 0 0
369 0.3047826361679661 0 0
370 0.3109543087397872 0 0
371 0.3172503396665426 0 0
372 0.3236732403581287 0 0
373 0.3302255618826818 0 0
374 0.3369099157288827 0 0
375 0.3437289587461236 0 0
376 0.3506854086810584 0 0
377 0.3577820316304407 0 0
378 0.3650216526025279 0 0
379 0.3724071527979408 0 0
380 0.3799414736505055 0 0
381 0.3876276130573542 0 0
382 0.3954686289219713 0 0
383 0.4034676425109909 0 0
384 0.4116278380977454 0 0
385 0.4199524636897425 0 0
386 0.4284448315849518 0 0
387 0.4371083227837073 0 0
388 0.4459463845547152 0 0
389 0.4549625361499972 0 0
390 0.4641603632701674 0 0
391 0.4735435296227151 0 0
392 0.4831157700256706 0 0
393 0.4928808917204871 0 0
394 0.5028427815391844 0 0
395 0.5130054074002507 0 0
396 0.5233728111642971 0 0
397 0.533949120176781 0 0
398 0.5447385448209842 0 0
399 0.5557453781239721 0 0
400 0.5669740016682723 0 0
401 0.5784288821759078 0 0
402 0.5901145871304962 0 0
403 0.6020357556930995 0 0
404 0.6141971401897147 0 0
405 0.6266035766552335 0 0
406 0.6392600071313588 0 0
407 0.6521714676066809 0 0
408 0.6653430954369527 0 0
409 0.6787801340885486 0 0
410 0.6924879335705458 0 0
411 0.7064719466247735 0 0
412 0.7207377396928916 0 0
413 0.735290992732722 0 0
414 0.7501374977786215 0 0
415 0.7652831601875799 0 0
416 0.7807340111485381 0 0
417 0.7964962034440036 0 0
418 0.8125760034436564 0 0
419 0.8289798169312571 0 0
420 0.8457141669221385 0 0
421 0.8627857208466079 0 0
422 0.8802012696618305 0 0
423 0.8979677473641481 0 0
424 0.9160922206721108 0 0
425 0.9345819063601821 0 0
426 0.9534441615510014 0 0
427 0.9726864970332741 0 0
428 0.9923165662486381 0 0
429 1.012342190017268 0 0
430 1.032771331432525 0 0
431 1.053612125164411 0 0
432 1.074872864229109 0 0
433 1.096562013091833 0 0
434 1.118688201829479 0 0
435 1.141260240436981 0 0
436 1.164287111372743 0 0
437 1.187777974146909 0 0
438 1.211742178396532 0 0
439 1.236189273209746 0 0
440 1.261128972424169 0 0
441 1.286571226843564 0 0
442 1.31252613976602 0 0
443 1.339004047019441 0 0
444 1.366015491292919 0 0
445 1.393571219145814 0 0
446 1.421682206681171 0 0
447 1.450359633062441 0 0
448 1.479614913100672 0 0
449 1.509459695563953 0 0
450 1.539905860507199 0 0
451 1.570965518955655 0 0
452 1.602651033954131 0 0
453 1.634975018683552 0 0
454 1.667950339742735 0 0
455 1.701590119715139 0 0
456 1.73590774352232 0 0
457 1.770916880796587 0 0
458 1.806631456493925 0 0
459 1.843065691629527 0 0
460 1.880234078765532 0 0
461 1.918151422739468 0 0
462 1.956832802918047 0 0
463 1.996293626156054 0 0
464 2.036549590030505 0 0
465 2.077616714884924 0 0
466 2.11951136036687 0 0
467 2.162250187347311 0 0
468 2.20585020931461 0 0
469 2.250328779927514 0 0
470 2.295703620278239 0 0
471 2.341992751752479 0 0
472 2.389214626441278 0 0
473 2.437388028849029 0 0
474 2.486532123303939 0 0
475 2.536666499819935 0 0
476 2.587811077996702 0 0
477 2.639986251110046 0 0
478 2.693212746173293 0 0
479 2.747511772909887 0 0
480 2.802904940519336 0 0
481 2.859414279240647 0 0
482 2.917062306290068 0 0
483 2.975871932259851 0 0
484 3.03586661202676 0 0
485 3.097070184433143 0 0
486 3.159507009898831 0 0
487 3.22320196960308 0 0
488 3.288180383746507 0 0
489 3.354468133644146 0 0
490 3.422091587221787 0 0
491 3.491077671999896 0 0
492 3.561453840862097 0 0
493 3.633248100012986 0 0
494 3.706489030871948 0 0
495 3.781205780596212 0 0
496 3.857428090066473 0 0
497 3.935186284678912 0 0
498 4.014511331080985 0 0
499 4.095434801585951 0 0
500 4.177988880616814 0 0
501 4.262206448855176 0 0
502 4.34812102500552 0 0
503 4.435766792758409 0 0
504 4.525178636738294 0 0
505 4.6163921756584 0 0
506 4.709443634469947 0 0
507 4.804370145520745 0 0
508 4.901209398958933 0 0
509 5.099999999999801 0 0
510 5.199999999999698 0 0
511 5.299999999999721 0 0
512 5.399999999999744 0 0
513 5.499999999999732 0 0
514 5.599999999999643 0 0
515 5.699999999999389 0 0
516 5.799999999999057 0 0
517 5.899999999998636 0 0
518 5.999999999998354 0 0
519 6.099999999998168 0 0
520 6.199999999998191 0 0
521 6.299999999998214 0 0
522 6.399999999998236 0 0
523 6.499999999998259 0 0
524 6.599999999998282 0 0
525 6.699999999998305 0 0
526 6.799999999998327 0 0
527 6.89999999999835 0 0
528 6.999999999998373 0 0
529 7.099999999998396 0 0
530 7.199999999998418 0 0
531 7.299999999998441 0 0
532 7.399999999998402 0 0
533 7.499999999998313 0 0
534 7.599999999998003 0 0
535 7.699999999997644 0 0
536 7.799999999997222 0 0
537 7.899999999996802 0 0
538 7.999999999996449 0 0
539 8.09999999999625 0 0
540 8.199999999996217 0 0
541 8.29999999999624 0 0
542 8.399999999996263 0 0
543 8.499999999996286 0 0
544 8.599999999996308 0 0
545 8.699999999996331 0 0
546 8.799999999996354 0 0
547 8.899999999996375 0 0
548 8.999999999996398 0 0
549 9.09999999999642 0 0
550 9.199999999996443 0 0
551 9.299999999996466 0 0
552 9.399999999996488 0 0
553 9.499999999996511 0 0
554 9.599999999996534 0 0
555 9.699999999996557 0 0
556 9.799999999996579 0 0
557 9.899999999996602 0 0
558 9.999999999996623 0 0
559 10.09999999999665 0 0
560 10.19999999999667 0 0
561 10.29999999999669 0 0
562 10.39999999999671 0 0
563 10.49999999999674 0 0
564 10.59999999999676 0 0
565 10.69999999999678 0 0
566 10.7999999999968 0 0
567 10.89999999999683 0 0
568 10.99999999999685 0 0
569 11.09999999999687 0 0
570 11.19999999999689 0 0
571 11.29999999999692 0 0
572 11.39999999999694 0 0
573 11.49999999999696 0 0
574 11.59999999999698 0 0
575 11.69999999999701 0 0
576 11.79999999999703 0 0
577 11.89999999999705 0 0
578 11.99999999999707 0 0
579 12.0999999999971 0 0
580 12.19999999999712 0 0
581 12.29999999999714 0 0
582 12.39999999999716 0 0
583 12.49999999999719 0 0
584 12.59999999999721 0 0
585 12.69999999999723 0 0
586 12.79999999999725 0 0
587 12.89999999999728 0 0
588 12.9999999999973 0 0
589 13.09999999999732 0 0
590 13.19999999999734 0 0
591 13.29999999999737 0 0
592 13.39999999999739 0 0
593 13.49999999999741 0 0
594 13.59999999999743 0 0
595 13.69999999999746 0 0
596 13.79999999999748 0 0
597 13.8999999999975 0 0
598 13.99999999999752 0 0
599 14.09999999999755 0 0
600 14.19999999999757 0 0
601 14.29999999999759 0 0
602 14.39999999999761 0 0
603 14.49999999999764 0 0
604 14.59999999999766 0 0
605 14.69999999999768 0 0
606 14.7999999999977 0 0
607 14.89999999999773 0 0
608 14.99999999999775 0 0
609 15.09999999999777 0 0
610 15.19999999999779 0 0
611 15.29999999999782 0 0
612 15.39999999999784 0 0
613 15.49999999999786 0 0
614 15.59999999999788 0 0
615 15.69999999999791 0 0
616 15.79999999999793 0 0
617 15.89999999999795 0 0
618 15.99999999999797 0 0
619 16.099999999998 0 0
620 16.19999999999802 0 0
621 16.29999999999804 0 0
622 16.39999999999807 0 0
623 16.49999999999809 0 0
624 16.59999999999811 0 0
625 16.69999999999813 0 0
626 16.79999999999815 0 0
627 16.89999999999818 0 0
628 16.9999999999982 0 0
629 17.09999999999822 0 0
630 17.19999999999824 0 0
631 17.29999999999826 0 0
632 17.39999999999829 0 0
633 17.49999999999831 0 0
634 17.59999999999834 0 0
635 17.69999999999836 0 0
636 17.79999999999838 0 0
637 17.8999999999984 0 0
638 17.99999999999842 0 0
639 18.09999999999845 0 0
640 18.19999999999847 0 0
641 18.29999999999849 0 0
642 18.39999999999851 0 0
643 18.49999999999854 0 0
644 18.59999999999856 0 0
645 18.69999999999858 0 0
646 18.7999999999986 0 0
647 18.89999999999863 0 0
648 18.99999999999865 0 0
649 19.09999999999867 0 0
650 19.1999999999987 0 0
651 19.29999999999872 0 0
652 19.39999999999874 0 0
653 19.49999999999876 0 0
654 19.59999999999879 0 0
655 19.69999999999881 0 0
656 19.79999999999883 0 0
657 19.89999999999885 0 0
658 19.99999999999887 0 0
659 20.0999999999989 0 0
660 20.19999999999892 0 0
661 20.29999999999894 0 0
662 20.39999999999896 0 0
663 20.49999999999899 0 0
664 20.59999999999901 0 0
665 20.69999999999903 0 0
666 20.79999999999906 0 0
667 20.89999999999907 0 0
668 20.9999999999991 0 0
669 21.09999999999912 0 0
670 21.19999999999914 0 0
671 21.29999999999917 0 0
672 21.39999999999919 0 0
673 21.49999999999921 0 0
674 21.59999999999923 0 0
675 21.69999999999926 0 0
676 21.79999999999928 0 0
677 21.8999999999993 0 0
678 21.99999999999932 0 0
679 22.09999999999935 0 0
680 22.19999999999937 0 0
681 22.29999999999939 0 0
682 22.39999999999941 0 0
683 22.49999999999944 0 0
684 22.59999999999946 0 0
685 22.69999999999948 0 0
686 22.79999999999951 0 0
687 22.89999999999953 0 0
688 22.99999999999955 0 0
689 23.09999999999957 0 0
690 23.19999999999959 0 0
691 23.29999999999962 0 0
692 23.39999999999964 0 0
693 23.49999999999966 0 0
694 23.59999999999969 0 0
695 23.69999999999971 0 0
696 23.79999999999973 0 0
697 23.89999999999975 0 0
698 23.99999999999978 0 0
699 24.0999999999998 0 0
700 24.19999999999982 0 0
701 24.29999999999984 0 0
702 24.39999999999986 0 0
703 24.49999999999989 0 0
704 24.59999999999991 0 0
705 24.69999999999993 0 0
706 24.79999999999995 0 0
707 24.89999999999998 0 0
$EndNodes
$Elements
706
1 1 2 1 1 1 5
2 1 2 1 1 5 6
3 1 2 1 1 6 7
4 1 2 1 1 7 8
5 1 2 1 1 8 9
6 1 2 1 1 9 10
7 1 2 1 1 10 11
8 1 2 1 1 11 12
9 1 2 1 1 12 13
10 1 2 1 1 13 14
11 1 2 1 1 14 15
12 1 2 1 1 15 16
13 1 2 1 1 16 17
14 1 2 1 1 17 18
15 1 2 1 1 18 19
16 1 2 1 1 19 20
17 1 2 1 1 20 21
18 1 2 1 1 21 22
19 1 2 1 1 22 23
20 1 2 1 1 23 24
21 1 2 1 1 24 25
22 1 2 1 1 25 26
23 1 2 1 1 26 27
24 1 2 1 1 27 28
25 1 2 1 1 28 29
26 1 2 1 1 29 30
27 1 2 1 1 30 31
28 1 2 1 1 31 32
29 1 2 1 1 32 33
30 1 2 1 1 33 34
31 1 2 1 1 34 35
32 1 2 1 1 35 36
33 1 2 1 1 36 37
34 1 2 1 1 37 38
35 1 2 1 1 38 39
36 1 2 1 1 39 40
37 1 2 1 1 40 41
38 1 2 1 1 41 42
39 1 2 1 1 42 43
40 1 2 1 1 43 44
41 1 2 1 1 44 45
42 1 2 1 1 45 46
43 1 2 1 1 46 47
44 1 2 1 1 47 48
45 1 2 1 1 48 49
46 1 2 1 1 49 50
47 1 2 1 1 50 51
48 1 2 1 1 51 52
49 1 2 1 1 52 53
50 1 2 1 1 53 54
51 1 2 1 1 54 55
52 1 2 1 1 55 56
53 1 2 1 1 56 57
54 1 2 1 1 57 58
55 1 2 1 1 58 59
56 1 2 1 1 59 60
57 1 2 1 1 60 61
58 1 2 1 1 61 62
59 1 2 1 1 62 63
60 1 2 1 1 63 64
61 1 2 1 1 64 65
62 1 2 1 1 65 66
63 1 2 1 1 66 67
64 1 2 1 1 67 68
65 1 2 1 1 68 69
66 1 2 1 1 69 70
67 1 2 1 1 70 71
68 1 2 1 1 71 72
69 1 2 1 1 72 73
70 1 2 1 1 73 74
71 1 2 1 1 74 75
72 1 2 1 1 75 76
73 1 2 1 1 76 77
74 1 2 1 1 77 78
75 1 2 1 1 78 79
76 1 2 1 1 79 80
77 1 2 1 1 80 81
78 1 2 1 1 81 82
79 1 2 1 1 82 83
80 1 2 1 1 83 84
81 1 2 1 1 84 85
82 1 2 1 1 85 86
83 1 2 1 1 86 87
84 1 2 1 1 87 88
85 1 2 1 1 88 89
86 1 2 1 1 89 90
87 1 2 1 1 90 91
88 1 2 1 1 91 92
89 1 2 1 1 92 93
90 1 2 1 1 93 94
91 1 2 1 1 94 95
92 1 2 1 1 95 96
93 1 2 1 1 96 97
94 1 2 1 1 97 98
95 1 2 1 1 98 99
96 1 2 1 1 99 100
97 1 2 1 1 100 101
98 1 2 1 1 101 102
99 1 2 1 1 102 103
100 1 2 1 1 103 104
101 1 2 1 1 104 105
102 1 2 1 1 105 106
103 1 2 1 1 106 107
104 1 2 1 1 107 108
105 1 2 1 1 108 109
106 1 2 1 1 109 110
107 1 2 1 1 110 111
108 1 2 1 1 111 112
109 1 2 1 1 112 113
110 1 2 1 1 113 114
111 1 2 1 1 114 115
112 1 2 1 1 115 116
113 1 2 1 1 116 117
114 1 2 1 1 117 118
115 1 2 1 1 118 119
116 1 2 1 1 119 120
117 1 2 1 1 120 121
118 1 2 1 1 121 122
119 1 2 1 1 122 123
120 1 2 1 1 123 124
121 1 2 1 1 124 125
122 1 2 1 1 125 126
123 1 2 1 1 126 127
124 1 2 1 1 127 128
125 1 2 1 1 128 2
126 1 2 1 2 2 129
127 1 2 1 2 129 130
128 1 2 1 2 130 131
129 1 2 1 2 131 132
130 1 2 1 2 132 133
131 1 2 1 2 133 134
132 1 2 1 2 134 135
133 1 2 1 2 135 136
134 1 2 1 2 136 137
135 1 2 1 2 137 138
136 1 2 1 2 138 139
137 1 2 1 2 139 140
138 1 2 1 2 140 141
139 1 2 1 2 141 142
140 1 2 1 2 142 143
141 1 2 1 2 143 144
142 1 2 1 2 144 145
143 1 2 1 2 145 146
144 1 2 1 2 146 147
145 1 2 1 2 147 148
146 1 2 1 2 148 149
147 1 2 1 2 149 150
148 1 2 1 2 150 151
149 1 2 1 2 151 152
150 1 2 1 2 152 153
151 1 2 1 2 153 154
152 1 2 1 2 154 155
153 1 2 1 2 155 156
154 1 2 1 2 156 157
155 1 2 1 2 157 158
156 1 2 1 2 158 159
157 1 2 1 2 159 160
158 1 2 1 2 160 161
159 1 2 1 2 161 162
160 1 2 1 2 162 163
161 1 2 1 2 163 164
162 1 2 1 2 164 165
163 1 2 1 2 165 166
164 1 2 1 2 166 167
165 1 2 1 2 167 168
166 1 2 1 2 168 169
167 1 2 1 2 169 170
168 1 2 1 2 170 171
169 1 2 1 2 171 172
170 1 2 1 2 172 173
171 1 2 1 2 173 174
172 1 2 1 2 174 175
173 1 2 1 2 175 176
174 1 2 1 2 176 177
175 1 2 1 2 177 178
176 1 2 1 2 178 179
177 1 2 1 2 179 180
178 1 2 1 2 180 181
179 1 2 1 2 181 182
180 1 2 1 2 182 183
181 1 2 1 2 183 184
182 1 2 1 2 184 185
183 1 2 1 2 185 186
184 1 2 1 2 186 187
185 1 2 1 2 187 188
186 1 2 1 2 188 189
187 1 2 1 2 189 190
188 1 2 1 2 190 191
189 1 2 1 2 191 192
190 1 2 1 2 192 193
191 1 2 1 2 193 194
192 1 2 1 2 194 195
193 1 2 1 2 195 196
194 1 2 1 2 196 197
195 1 2 1 2 197 198
196 1 2 1 2 198 199
197 1 2 1 2 199 200
198 1 2 1 2 200 201
199 1 2 1 2 201 202
200 1 2 1 2 202 203
201 1 2 1 2 203 204
202 1 2 1 2 204 205
203 1 2 1 2 205 206
204 1 2 1 2 206 207
205 1 2 1 2 207 208
206 1 2 1 2 208 209
207 1 2 1 2 209 210
208 1 2 1 2 210 211
209 1 2 1 2 211 212
210 1 2 1 2 212 213
211 1 2 1 2 213 214
212 1 2 1 2 214 215
213 1 2 1 2 215 216
214 1 2 1 2 216 217
215 1 2 1 2 217 218
216 1 2 1 2 218 219
217 1 2 1 2 219 220
218 1 2 1 2 220 221
219 1 2 1 2 221 222
220 1 2 1 2 222 223
221 1 2 1 2 223 224
222 1 2 1 2 224 225
223 1 2 1 2 225 226
224 1 2 1 2 226 227
225 1 2 1 2 227 228
226 1 2 1 2 228 229
227 1 2 1 2 229 230
228 1 2 1 2 230 231
229 1 2 1 2 231 232
230 1 2 1 2 232 233
231 1 2 1 2 233 234
232 1 2 1 2 234 235
233 1 2 1 2 235 236
234 1 2 1 2 236 237
235 1 2 1 2 237 238
236 1 2 1 2 238 239
237 1 2 1 2 239 240
238 1 2 1 2 240 241
239 1 2 1 2 241 242
240 1 2 1 2 242 243
241 1 2 1 2 243 244
242 1 2 1 2 244 245
243 1 2 1 2 245 246
244 1 2 1 2 246 247
245 1 2 1 2 247 248
246 1 2 1 2 248 249
247 1 2 1 2 249 250
248 1 2 1 2 250 251
249 1 2 1 2 251 252
250 1 2 1 2 252 253
251 1 2 1 2 253 254
252 1 2 1 2 254 255
253 1 2 1 2 255 256
254 1 2 1 2 256 257
255 1 2 1 2 257 258
256 1 2 1 2 258 259
257 1 2 1 2 259 260
258 1 2 1 2 260 261
259 1 2 1 2 261 262
260 1 2 1 2 262 263
261 1 2 1 2 263 264
262 1 2 1 2 264 265
263 1 2 1 2 265 266
264 1 2 1 2 266 267
265 1 2 1 2 267 268
266 1 2 1 2 268 269
267 1 2 1 2 269 270
268 1 2 1 2 270 271
269 1 2 1 2 271 272
270 1 2 1 2 272 273
271 1 2 1 2 273 274
272 1 2 1 2 274 275
273 1 2 1 2 275 276
274 1 2 1 2 276 277
275 1 2 1 2 277 278
276 1 2 1 2 278 279
277 1 2 1 2 279 280
278 1 2 1 2 280 281
279 1 2 1 2 281 282
280 1 2 1 2 282 283
281 1 2 1 2 283 284
282 1 2 1 2 284 285
283 1 2 1 2 285 286
284 1 2 1 2 286 287
285 1 2 1 2 287 288
286 1 2 1 2 288 289
287 1 2 1 2 289 290
288 1 2 1 2 290 291
289 1 2 1 2 291 292
290 1 2 1 2 292 293
291 1 2 1 2 293 294
292 1 2 1 2 294 295
293 1 2 1 2 295 296
294 1 2 1 2 296 297
295 1 2 1 2 297 298
296 1 2 1 2 298 299
297 1 2 1 2 299 300
298 1 2 1 2 300 301
299 1 2 1 2 301 302
300 1 2 1 2 302 303
301 1 2 1 2 303 304
302 1 2 1 2 304 305
303 1 2 1 2 305 306
304 1 2 1 2 306 307
305 1 2 1 2 307 308
306 1 2 1 2 308 309
307 1 2 1 2 309 310
308 1 2 1 2 310 311
309 1 2 1 2 311 312
310 1 2 1 2 312 313
311 1 2 1 2 313 314
312 1 2 1 2 314 315
313 1 2 1 2 315 316
314 1 2 1 2 316 317
315 1 2 1 2 317 318
316 1 2 1 2 318 319
317 1 2 1 2 319 320
318 1 2 1 2 320 321
319 1 2 1 2 321 322
320 1 2 1 2 322 323
321 1 2 1 2 323 324
322 1 2 1 2 324 325
323 1 2 1 2 325 326
324 1 2 1 2 326 327
325 1 2 1 2 327 328
326 1 2 1 2 328 329
327 1 2 1 2 329 330
328 1 2 1 2 330 331
329 1 2 1 2 331 332
330 1 2 1 2 332 333
331 1 2 1 2 333 334
332 1 2 1 2 334 335
333 1 2 1 2 335 336
334 1 2 1 2 336 337
335 1 2 1 2 337 338
336 1 2 1 2 338 339
337 1 2 1 2 339 340
338 1 2 1 2 340 341
339 1 2 1 2 341 342
340 1 2 1 2 342 343
341 1 2 1 2 343 344
342 1 2 1 2 344 345
343 1 2 1 2 345 346
344 1 2 1 2 346 347
345 1 2 1 2 347 348
346 1 2 1 2 348 349
347 1 2 1 2 349 350
348 1 2 1 2 350 351
349 1 2 1 2 351 352
350 1 2 1 2 352 353
351 1 2 1 2 353 354
352 1 2 1 2 354 355
353 1 2 1 2 355 356
354 1 2 1 2 356 357
355 1 2 1 2 357 358
356 1 2 1 2 358 359
357 1 2 1 2 359 360
358 1 2 1 2 360 361
359 1 2 1 2 361 362
360 1 2 1 2 362 363
361 1 2 1 2 363 364
362 1 2 1 2 364 365
363 1 2 1 2 365 366
364 1 2 1 2 366 367
365 1 2 1 2 367 368
366 1 2 1 2 368 369
367 1 2 1 2 369 370
368 1 2 1 2 370 371
369 1 2 1 2 371 372
370 1 2 1 2 372 373
371 1 2 1 2 373 374
372 1 2 1 2 374 375
373 1 2 1 2 375 376
374 1 2 1 2 376 377
375 1 2 1 2 377 378
376 1 2 1 2 378 379
377 1 2 1 2 379 380
378 1 2 1 2 380 381
379 1 2 1 2 381 382
380 1 2 1 2 382 383
381 1 2 1 2 383 384
382 1 2 1 2 384 385
383 1 2 1 2 385 386
384 1 2 1 2 386 387
385 1 2 1 2 387 388
386 1 2 1 2 388 389
387 1 2 1 2 389 390
388 1 2 1 2 390 391
389 1 2 1 2 391 392
390 1 2 1 2 392 393
391 1 2 1 2 393 394
392 1 2 1 2 394 395
393 1 2 1 2 395 396
394 1 2 1 2 396 397
395 1 2 1 2 397 398
396 1 2 1 2 398 399
397 1 2 1 2 399 400
398 1 2 1 2 400 401
399 1 2 1 2 401 402
400 1 2 1 2 402 403
401 1 2 1 2 403 404
402 1 2 1 2 404 405
403 1 2 1 2 405 406
404 1 2 1 2 406 407
405 1 2 1 2 407 408
406 1 2 1 2 408 409
407 1 2 1 2 409 410
408 1 2 1 2 410 411
409 1 2 1 2 411 412
410 1 2 1 2 412 413
411 1 2 1 2 413 414
412 1 2 1 2 414 415
413 1 2 1 2 415 416
414 1 2 1 2 416 417
415 1 2 1 2 417 418
416 1 2 1 2 418 419
417 1 2 1 2 419 420
418 1 2 1 2 420 421
419 1 2 1 2 421 422
420 1 2 1 2 422 423
421 1 2 1 2 423 424
422 1 2 1 2 424 425
423 1 2 1 2 425 426
424 1 2 1 2 426 427
425 1 2 1 2 427 428
426 1 2 1 2 428 429
427 1 2 1 2 429 430
428 1 2 1 2 430 431
429 1 2 1 2 431 432
430 1 2 1 2 432 433
431 1 2 1 2 433 434
432 1 2 1 2 434 435
433 1 2 1 2 435 436
434 1 2 1 2 436 437
435 1 2 1 2 437 438
436 1 2 1 2 438 439
437 1 2 1 2 439 440
438 1 2 1 2 440 441
439 1 2 1 2 441 442
440 1 2 1 2 442 443
441 1 2 1 2 443 444
442 1 2 1 2 444 445
443 1 2 1 2 445 446
444 1 2 1 2 446 447
445 1 2 1 2 447 448
446 1 2 1 2 448 449
447 1 2 1 2 449 450
448 1 2 1 2 450 451
449 1 2 1 2 451 452
450 1 2 1 2 452 453
451 1 2 1 2 453 454
452 1 2 1 2 454 455
453 1 2 1 2 455 456
454 1 2 1 2 456 457
455 1 2 1 2 457 458
456 1 2 1 2 458 459
457 1 2 1 2 459 460
458 1 2 1 2 460 461
459 1 2 1 2 461 462
460 1 2 1 2 462 463
461 1 2 1 2 463 464
462 1 2 1 2 464 465
463 1 2 1 2 465 466
464 1 2 1 2 466 467
465 1 2 1 2 467 468
466 1 2 1 2 468 469
467 1 2 1 2 469 470
468 1 2 1 2 470 471
469 1 2 1 2 471 472
470 1 2 1 2 472 473
471 1 2 1 2 473 474
472 1 2 1 2 474 475
473 1 2 1 2 475 476
474 1 2 1 2 476 477
475 1 2 1 2 477 478
476 1 2 1 2 478 479
477 1 2 1 2 479 480
478 1 2 1 2 480 481
479 1 2 1 2 481 482
480 1 2 1 2 482 483
481 1 2 1 2 483 484
482 1 2 1 2 484 485
483 1 2 1 2 485 486
484 1 2 1 2 486 487
485 1 2 1 2 487 488
486 1 2 1 2 488 489
487 1 2 1 2 489 490
488 1 2 1 2 490 491
489 1 2 1 2 491 492
490 1 2 1 2 492 493
491 1 2 1 2 493 494
492 1 2 1 2 494 495
493 1 2 1 2 495 496
494 1 2 1 2 496 497
495 1 2 1 2 497 498
496 1 2 1 2 498 499
497 1 2 1 2 499 500
498 1 2 1 2 500 501
499 1 2 1 2 501 502
500 1 2 1 2 502 503
501 1 2 1 2 503 504
502 1 2 1 2 504 505
503 1 2 1 2 505 506
504 1 2 1 2 506 507
505 1 2 1 2 507 508
506 1 2 1 2 508 3
507 1 2 1 3 3 509
508 1 2 1 3 509 510
509 1 2 1 3 510 511
510 1 2 1 3 511 512
511 1 2 1 3 512 513
512 1 2 1 3 513 514
513 1 2 1 3 514 515
514 1 2 1 3 515 516
515 1 2 1 3 516 517
516 1 2 1 3 517 518
517 1 2 1 3 518 519
518 1 2 1 3 519 520
519 1 2 1 3 520 521
520 1 2 1 3 521 522
521 1 2 1 3 522 523
522 1 2 1 3 523 524
523 1 2 1 3 524 525
524 1 2 1 3 525 526
525 1 2 1 3 526 527
526 1 2 1 3 527 528
527 1 2 1 3 528 529
528 1 2 1 3 529 530
529 1 2 1 3 530 531
530 1 2 1 3 531 532
531 1 2 1 3 532 533
532 1 2 1 3 533 534
533 1 2 1 3 534 535
534 1 2 1 3 535 536
535 1 2 1 3 536 537
536 1 2 1 3 537 538
537 1 2 1 3 538 539
538 1 2 1 3 539 540
539 1 2 1 3 540 541
540 1 2 1 3 541 542
541 1 2 1 3 542 543
542 1 2 1 3 543 544
543 1 2 1 3 544 545
544 1 2 1 3 545 546
545 1 2 1 3 546 547
546 1 2 1 3 547 548
547 1 2 1 3 548 549
548 1 2 1 3 549 550
549 1 2 1 3 550 551
550 1 2 1 3 551 552
551 1 2 1 3 552 553
552 1 2 1 3 553 554
553 1 2 1 3 554 555
554 1 2 1 3 555 556
555 1 2 1 3 556 557
556 1 2 1 3 557 558
557 1 2 1 3 558 559
558 1 2 1 3 559 560
559 1 2 1 3 560 561
560 1 2 1 3 561 562
561 1 2 1 3 562 563
562 1 2 1 3 563 564
563 1 2 1 3 564 565
564 1 2 1 3 565 566
565 1 2 1 3 566 567
566 1 2 1 3 567 568
567 1 2 1 3 568 569
568 1 2 1 3 569 570
569 1 2 1 3 570 571
570 1 2 1 3 571 572
571 1 2 1 3 572 573
572 1 2 1 3 573 574
573 1 2 1 3 574 575
574 1 2 1 3 575 576
575 1 2 1 3 576 577
576 1 2 1 3 577 578
577 1 2 1 3 578 579
578 1 2 1 3 579 580
579 1 2 1 3 580 581
580 1 2 1 3 581 582
581 1 2 1 3 582 583
582 1 2 1 3 583 584
583 1 2 1 3 584 585
584 1 2 1 3 585 586
585 1 2 1 3 586 587
586 1 2 1 3 587 588
587 1 2 1 3 588 589
588 1 2 1 3 589 590
589 1 2 1 3 590 591
590 1 2 1 3 591 592
591 1 2 1 3 592 593
592 1 2 1 3 593 594
593 1 2 1 3 594 595
594 1 2 1 3 595 596
595 1 2 1 3 596 597
596 1 2 1 3 597 598
597 1 2 1 3 598 599
598 1 2 1 3 599 600
599 1 2 1 3 600 601
600 1 2 1 3 601 602
601 1 2 1 3 602 603
602 1 2 1 3 603 604
603 1 2 1 3 604 605
604 1 2 1 3 605 606
605 1 2 1 3 606 607
606 1 2 1 3 607 608
607 1 2 1 3 608 609
608 1 2 1 3 609 610
609 1 2 1 3 610 611
610 1 2 1 3 611 612
611 1 2 1 3 612 613
612 1 2 1 3 613 614
613 1 2 1 3 614 615
614 1 2 1 3 615 616
615 1 2 1 3 616 617
616 1 2 1 3 617 618
617 1 2 1 3 618 619
618 1 2 1 3 619 620
619 1 2 1 3 620 621
620 1 2 1 3 621 622
621 1 2 1 3 622 623
622 1 2 1 3 623 624
623 1 2 1 3 624 625
624 1 2 1 3 625 626
625 1 2 1 3 626 627
626 1 2 1 3 627 628
627 1 2 1 3 628 629
628 1 2 1 3 629 630
629 1 2 1 3 630 631
630 1 2 1 3 631 632
631 1 2 1 3 632 633
632 1 2 1 3 633 634
633 1 2 1 3 634 635
634 1 2 1 3 635 636
635 1 2 1 3 636 637
636 1 2 1 3 637 638
637 1 2 1 3 638 639
638 1 2 1 3 639 640
639 1 2 1 3 640 641
640 1 2 1 3 641 642
641 1 2 1 3 642 643
642 1 2 1 3 643 644
643 1 2 1 3 644 645
644 1 2 1 3 645 646
645 1 2 1 3 646 647
646 1 2 1 3 647 648
647 1 2 1 3 648 649
648 1 2 1 3 649 650
649 1 2 1 3 650 651
650 1 2 1 3 651 652
651 1 2 1 3 652 653
652 1 2 1 3 653 654
653 1 2 1 3 654 655
654 1 2 1 3 655 656
655 1 2 1 3 656 657
656 1 2 1 3 657 658
657 1 2 1 3 658 659
658 1 2 1 3 659 660
659 1 2 1 3 660 661
660 1 2 1 3 661 662
661 1 2 1 3 662 663
662 1 2 1 3 663 664
663 1 2 1 3 664 665
664 1 2 1 3 665 666
665 1 2 1 3 666 667
666 1 2 1 3 667 668
667 1 2 1 3 668 669
668 1 2 1 3 669 670
669 1 2 1 3 670 671
670 1 2 1 3 671 672
671 1 2 1 3 672 673
672 1 2 1 3 673 674
673 1 2 1 3 674 675
674 1 2 1 3 675 676
675 1 2 1 3 676 677
676 1 2 1 3 677 678
677 1 2 1 3 678 679
678 1 2 1 3 679 680
679 1 2 1 3 680 681
680 1 2 1 3 681 682
681 1 2 1 3 682 683
682 1 2 1 3 683 684
683 1 2 1 3 684 685
684 1 2 1 3 685 686
685 1 2 1 3 686 687
686 1 2 1 3 687 688
687 1 2 1 3 688 689
688 1 2 1 3 689 690
689 1 2 1 3 690 691
690 1 2 1 3 691 692
691 1 2 1 3 692 693
692 1 2 1 3 693 694
693 1 2 1 3 694 695
694 1 2 1 3 695 696
695 1 2 1 3 696 697
696 1 2 1 3 697 698
697 1 2 1 3 698 699
698 1 2 1 3 699 700
699 1 2 1 3 700 701
700 1 2 1 3 701 702
701 1 2 1 3 702 703
702 1 2 1 3 703 704
703 1 2 1 3 704 705
704 1 2 1 3 705 706
705 1 2 1 3 706 707
706 1 2 1 3 707 4
$EndElements
