$MeshFormat
2.2 0 8
$EndMeshFormat
$PhysicalNames
4
1 1 "CPLEFT"
1 2 "ELLEFT"
1 3 "ELRIGHT"
1 4 "CPRIGHT"
$EndPhysicalNames
$Nodes
294
1 0 0 0
2 0.02 0 0
3 0.38 0 0
4 0.4 0 0
5 0.42 0 0
6 0.6000000000000001 0 0
7 5000.4 0 0
8 10000.2 0 0
9 10000.38 0 0
10 10000.4 0 0
11 10000.42 0 0
12 10000.78 0 0
13 10000.8 0 0
14 2.695764632229408e-05 0 0
15 0.0002583121027071636 0 0
16 0.002009334057345231 0 0
17 0.01442191538590199 0 0
18 0.1099999999997774 0 0
19 0.1999999999995046 0 0
20 0.2899999999997741 0 0
21 0.3972037740444032 0 0
22 0.3996306823870738 0 0
23 0.3999513385477402 0 0
24 0.4000269576463225 0 0
25 0.4002583121027082 0 0
26 0.4020093340573451 0 0
27 0.4144219153859012 0 0
28 10.68388725429111 0 0
29 20.95081385463666 0 0
30 31.4041036874708 0 0
31 42.04714008165707 0 0
32 52.88336318873682 0 0
33 63.91627890248319 0 0
34 75.14946866182292 0 0
35 86.58655624677698 0 0
36 98.23124426639545 0 0
37 110.0873080250803 0 0
38 122.158576988402 0 0
39 134.4489600462344 0 0
40 146.9624355682602 0 0
41 159.7030522886539 0 0
42 172.6749328372002 0 0
43 185.8822759712307 0 0
44 199.3293551105924 0 0
45 213.0205198353412 0 0
46 226.9602059486198 0 0
47 241.1529197348111 0 0
48 255.6032549224142 0 0
49 270.3158898030801 0 0
50 285.2955826521015 0 0
51 300.5471844601989 0 0
52 316.0756299096849 0 0
53 331.8859410588561 0 0
54 347.9832383076421 0 0
55 364.372727233726 0 0
56 381.0597168301339 0 0
57 398.0496008055463 0 0
58 415.3478820333982 0 0
59 432.9601574774143 0 0
60 450.8921239504386 0 0
61 469.1495880271925 0 0
62 487.7384570759594 0 0
63 506.6647450812961 0 0
64 525.9345759100916 0 0
65 545.5541917725675 0 0
66 565.5299350773978 0 0
67 585.8682717737488 0 0
68 606.5757857662971 0 0
69 627.659179008427 0 0
70 649.1252689582973 0 0
71 670.9810061758175 0 0
72 693.2334633176112 0 0
73 715.8898333623706 0 0
74 738.9574690981157 0 0
75 762.4438145654583 0 0
76 786.356472832687 0 0
77 810.7031958164625 0 0
78 835.4918456029184 0 0
79 860.7304609277423 0 0
80 886.4271932964613 0 0
81 912.5903709833822 0 0
82 939.2284493979304 0 0
83 966.3500600711842 0 0
84 993.9639708252914 0 0
85 1022.079125430862 0 0
86 1050.704613302785 0 0
87 1079.849710038812 0 0
88 1109.523833375958 0 0
89 1139.73659648444 0 0
90 1170.497776294085 0 0
91 1201.817321278603 0 0
92 1233.705368746612 0 0
93 1266.172240536202 0 0
94 1299.228444409742 0 0
95 1332.884670572038 0 0
96 1367.151815869307 0 0
97 1402.040974369457 0 0
98 1437.563424873241 0 0
99 1473.73067349529 0 0
100 1510.554413173551 0 0
101 1548.046574102766 0 0
102 1586.219278554764 0 0
103 1625.084888981657 0 0
104 1664.65596851882 0 0
105 1704.945336366011 0 0
106 1745.966029776961 0 0
107 1787.73131996932 0 0
108 1830.254717353125 0 0
109 1873.549989317213 0 0
110 1917.631129318685 0 0
111 1962.512448857669 0 0
112 2008.208422604419 0 0
113 2054.733857315096 0 0
114 2102.103805670915 0 0
115 2150.333604619278 0 0
116 2199.438857103394 0 0
117 2249.435456014024 0 0
118 2300.339564956781 0 0
119 2352.167683490402 0 0
120 2404.936585116829 0 0
121 2458.663319843082 0 0
122 2513.365276490304 0 0
123 2569.060187738607 0 0
124 2625.766046102702 0 0
125 2683.501212813049 0 0
126 2742.284375120237 0 0
127 2802.134555361189 0 0
128 2863.071110988973 0 0
129 2925.113784330758 0 0
130 2988.282629032271 0 0
131 3052.59810268928 0 0
132 3118.081001992507 0 0
133 3184.752536370004 0 0
134 3252.634279284398 0 0
135 3321.748187542344 0 0
136 3392.116624876446 0 0
137 3463.762381726842 0 0
138 3536.708626357341 0 0
139 3610.978976316292 0 0
140 3686.597456462169 0 0
141 3763.588543470834 0 0
142 3841.977141581608 0 0
143 3921.788643862053 0 0
144 4003.048851860152 0 0
145 4085.784081660276 0 0
146 4170.021113777616 0 0
147 4255.78714145685 0 0
148 4343.110036577974 0 0
149 4432.017952380761 0 0
150 4522.539705484844 0 0
151 4614.704549152189 0 0
152 4708.542386117513 0 0
153 4804.083539238232 0 0
154 4901.358918126486 0 0
155 5099.441081872735 0 0
156 5196.716460760307 0 0
157 5292.257613880385 0 0
158 5386.095450845152 0 0
159 5478.260294512049 0 0
160 5568.782047615657 0 0
161 5657.689963417983 0 0
162 5745.012858538546 0 0
163 5830.778886217246 0 0
164 5915.01591833406 0 0
165 5997.751148133639 0 0
166 6079.011356131274 0 0
167 6158.822858411284 0 0
168 6237.211456521618 0 0
169 6314.202543529866 0 0
170 6389.821023675344 0 0
171 6464.09137363393 0 0
172 6537.037618264042 0 0
173 6608.68337511404 0 0
174 6679.051812447805 0 0
175 6748.16572070543 0 0
176 6816.047463619518 0 0
177 6882.718997996729 0 0
178 6948.201897299675 0 0
179 7012.517370956419 0 0
180 7075.68621565769 0 0
181 7137.728888999229 0 0
182 7198.665444626761 0 0
183 7258.515624867476 0 0
184 7317.298787174459 0 0
185 7375.033953884613 0 0
186 7431.739812248527 0 0
187 7487.434723496657 0 0
188 7542.136680144099 0 0
189 7595.863414870673 0 0
190 7648.632316497429 0 0
191 7700.460435031358 0 0
192 7751.364543974411 0 0
193 7801.361142885391 0 0
194 7850.466395369875 0 0
195 7898.696194318605 0 0
196 7946.066142674783 0 0
197 7992.591577385811 0 0
198 8038.2875511329 0 0
199 8083.16887067222 0 0
200 8127.250010674014 0 0
201 8170.545282638415 0 0
202 8213.068680022488 0 0
203 8254.83397021507 0 0
204 8295.854663626234 0 0
205 8336.144031473632 0 0
206 8375.715111011003 0 0
207 8414.580721438149 0 0
208 8452.753425890482 0 0
209 8490.24558682002 0 0
210 8527.069326498597 0 0
211 8563.236575120951 0 0
212 8598.759025625031 0 0
213 8633.64818412547 0 0
214 8667.91532942302 0 0
215 8701.571555585588 0 0
216 8734.62775945939 0 0
217 8767.094631249236 0 0
218 8798.982678717492 0 0
219 8830.302223702249 0 0
220 8861.063403512127 0 0
221 8891.276166620835 0 0
222 8920.950289958197 0 0
223 8950.095386694436 0 0
224 8978.720874566567 0 0
225 9006.836029172333 0 0
226 9034.449939926633 0 0
227 9061.571550600074 0 0
228 9088.209629014804 0 0
229 9114.372806701835 0 0
230 9140.069539070631 0 0
231 9165.308154395536 0 0
232 9190.096804182063 0 0
233 9214.443527165909 0 0
234 9238.356185433209 0 0
235 9261.842530900618 0 0
236 9284.910166636426 0 0
237 9307.56653668125 0 0
238 9329.818993823104 0 0
239 9351.674731040684 0 0
240 9373.140820990611 0 0
241 9394.224214232774 0 0
242 9414.931728225351 0 0
243 9435.270064921726 0 0
244 9455.245808226578 0 0
245 9474.865424089079 0 0
246 9494.135254917896 0 0
247 9513.061542923257 0 0
248 9531.650411972048 0 0
249 9549.907876048823 0 0
250 9567.839842521869 0 0
251 9585.452117965906 0 0
252 9602.750399193779 0 0
253 9619.740283169212 0 0
254 9636.427272765641 0 0
255 9652.816761691742 0 0
256 9668.914058940545 0 0
257 9684.724370089734 0 0
258 9700.252815539248 0 0
259 9715.504417347373 0 0
260 9730.484110196419 0 0
261 9745.196745077112 0 0
262 9759.64708026474 0 0
263 9773.839794050957 0 0
264 9787.779480164258 0 0
265 9801.47064488903 0 0
266 9814.917724028415 0 0
267 9828.125067162466 0 0
268 9841.096947711034 0 0
269 9853.837564431444 0 0
270 9866.351039953486 0 0
271 9878.641423011333 0 0
272 9890.712691974668 0 0
273 9902.568755733368 0 0
274 9914.213443753 0 0
275 9925.650531337968 0 0
276 9936.883721097318 0 0
277 9947.916636811078 0 0
278 9958.75285991817 0 0
279 9969.395896312388 0 0
280 9979.849186145268 0 0
281 9990.116112745662 0 0
282 10000.39720377466 0 0
283 10000.39963068236 0 0
284 10000.39995133854 0 0
285 10000.40002695765 0 0
286 10000.4002583122 0 0
287 10000.40200933371 0 0
288 10000.41442191655 0 0
289 10000.51000000027 0 0
290 10000.6 0 0
291 10000.68999999973 0 0
292 10000.79720377466 0 0
293 10000.79963068236 0 0
294 10000.79995133854 0 0
$EndNodes
$Elements
293
1 1 2 1 1 1 14
2 1 2 1 1 14 15
3 1 2 1 1 15 16
4 1 2 1 1 16 17
5 1 2 1 1 17 2
6 1 2 1 2 2 18
7 1 2 1 2 18 19
8 1 2 1 2 19 20
9 1 2 1 2 20 3
10 1 2 1 3 3 21
11 1 2 1 3 21 22
12 1 2 1 3 22 23
13 1 2 1 3 23 4
14 1 2 2 4 4 24
15 1 2 2 4 24 25
16 1 2 2 4 25 26
17 1 2 2 4 26 27
18 1 2 2 4 27 5
19 1 2 2 5 5 6
20 1 2 2 6 6 28
21 1 2 2 6 28 29
22 1 2 2 6 29 30
23 1 2 2 6 30 31
24 1 2 2 6 31 32
25 1 2 2 6 32 33
26 1 2 2 6 33 34
27 1 2 2 6 34 35
28 1 2 2 6 35 36
29 1 2 2 6 36 37
30 1 2 2 6 37 38
31 1 2 2 6 38 39
32 1 2 2 6 39 40
33 1 2 2 6 40 41
34 1 2 2 6 41 42
35 1 2 2 6 42 43
36 1 2 2 6 43 44
37 1 2 2 6 44 45
38 1 2 2 6 45 46
39 1 2 2 6 46 47
40 1 2 2 6 47 48
41 1 2 2 6 48 49
42 1 2 2 6 49 50
43 1 2 2 6 50 51
44 1 2 2 6 51 52
45 1 2 2 6 52 53
46 1 2 2 6 53 54
47 1 2 2 6 54 55
48 1 2 2 6 55 56
49 1 2 2 6 56 57
50 1 2 2 6 57 58
51 1 2 2 6 58 59
52 1 2 2 6 59 60
53 1 2 2 6 60 61
54 1 2 2 6 61 62
55 1 2 2 6 62 63
56 1 2 2 6 63 64
57 1 2 2 6 64 65
58 1 2 2 6 65 66
59 1 2 2 6 66 67
60 1 2 2 6 67 68
61 1 2 2 6 68 69
62 1 2 2 6 69 70
63 1 2 2 6 70 71
64 1 2 2 6 71 72
65 1 2 2 6 72 73
66 1 2 2 6 73 74
67 1 2 2 6 74 75
68 1 2 2 6 75 76
69 1 2 2 6 76 77
70 1 2 2 6 77 78
71 1 2 2 6 78 79
72 1 2 2 6 79 80
73 1 2 2 6 80 81
74 1 2 2 6 81 82
75 1 2 2 6 82 83
76 1 2 2 6 83 84
77 1 2 2 6 84 85
78 1 2 2 6 85 86
79 1 2 2 6 86 87
80 1 2 2 6 87 88
81 1 2 2 6 88 89
82 1 2 2 6 89 90
83 1 2 2 6 90 91
84 1 2 2 6 91 92
85 1 2 2 6 92 93
86 1 2 2 6 93 94
87 1 2 2 6 94 95
88 1 2 2 6 95 96
89 1 2 2 6 96 97
90 1 2 2 6 97 98
91 1 2 2 6 98 99
92 1 2 2 6 99 100
93 1 2 2 6 100 101
94 1 2 2 6 101 102
95 1 2 2 6 102 103
96 1 2 2 6 103 104
97 1 2 2 6 104 105
98 1 2 2 6 105 106
99 1 2 2 6 106 107
100 1 2 2 6 107 108
101 1 2 2 6 108 109
102 1 2 2 6 109 110
103 1 2 2 6 110 111
104 1 2 2 6 111 112
105 1 2 2 6 112 113
106 1 2 2 6 113 114
107 1 2 2 6 114 115
108 1 2 2 6 115 116
109 1 2 2 6 116 117
110 1 2 2 6 117 118
111 1 2 2 6 118 119
112 1 2 2 6 119 120
113 1 2 2 6 120 121
114 1 2 2 6 121 122
115 1 2 2 6 122 123
116 1 2 2 6 123 124
117 1 2 2 6 124 125
118 1 2 2 6 125 126
119 1 2 2 6 126 127
120 1 2 2 6 127 128
121 1 2 2 6 128 129
122 1 2 2 6 129 130
123 1 2 2 6 130 131
124 1 2 2 6 131 132
125 1 2 2 6 132 133
126 1 2 2 6 133 134
127 1 2 2 6 134 135
128 1 2 2 6 135 136
129 1 2 2 6 136 137
130 1 2 2 6 137 138
131 1 2 2 6 138 139
132 1 2 2 6 139 140
133 1 2 2 6 140 141
134 1 2 2 6 141 142
135 1 2 2 6 142 143
136 1 2 2 6 143 144
137 1 2 2 6 144 145
138 1 2 2 6 145 146
139 1 2 2 6 146 147
140 1 2 2 6 147 148
141 1 2 2 6 148 149
142 1 2 2 6 149 150
143 1 2 2 6 150 151
144 1 2 2 6 151 152
145 1 2 2 6 152 153
146 1 2 2 6 153 154
147 1 2 2 6 154 7
148 1 2 3 7 7 155
149 1 2 3 7 155 156
150 1 2 3 7 156 157
151 1 2 3 7 157 158
152 1 2 3 7 158 159
153 1 2 3 7 159 160
154 1 2 3 7 160 161
155 1 2 3 7 161 162
156 1 2 3 7 162 163
157 1 2 3 7 163 164
158 1 2 3 7 164 165
159 1 2 3 7 165 166
160 1 2 3 7 166 167
161 1 2 3 7 167 168
162 1 2 3 7 168 169
163 1 2 3 7 169 170
164 1 2 3 7 170 171
165 1 2 3 7 171 172
166 1 2 3 7 172 173
167 1 2 3 7 173 174
168 1 2 3 7 174 175
169 1 2 3 7 175 176
170 1 2 3 7 176 177
171 1 2 3 7 177 178
172 1 2 3 7 178 179
173 1 2 3 7 179 180
174 1 2 3 7 180 181
175 1 2 3 7 181 182
176 1 2 3 7 182 183
177 1 2 3 7 183 184
178 1 2 3 7 184 185
179 1 2 3 7 185 186
180 1 2 3 7 186 187
181 1 2 3 7 187 188
182 1 2 3 7 188 189
183 1 2 3 7 189 190
184 1 2 3 7 190 191
185 1 2 3 7 191 192
186 1 2 3 7 192 193
187 1 2 3 7 193 194
188 1 2 3 7 194 195
189 1 2 3 7 195 196
190 1 2 3 7 196 197
191 1 2 3 7 197 198
192 1 2 3 7 198 199
193 1 2 3 7 199 200
194 1 2 3 7 200 201
195 1 2 3 7 201 202
196 1 2 3 7 202 203
197 1 2 3 7 203 204
198 1 2 3 7 204 205
199 1 2 3 7 205 206
200 1 2 3 7 206 207
201 1 2 3 7 207 208
202 1 2 3 7 208 209
203 1 2 3 7 209 210
204 1 2 3 7 210 211
205 1 2 3 7 211 212
206 1 2 3 7 212 213
207 1 2 3 7 213 214
208 1 2 3 7 214 215
209 1 2 3 7 215 216
210 1 2 3 7 216 217
211 1 2 3 7 217 218
212 1 2 3 7 218 219
213 1 2 3 7 219 220
214 1 2 3 7 220 221
215 1 2 3 7 221 222
216 1 2 3 7 222 223
217 1 2 3 7 223 224
218 1 2 3 7 224 225
219 1 2 3 7 225 226
220 1 2 3 7 226 227
221 1 2 3 7 227 228
222 1 2 3 7 228 229
223 1 2 3 7 229 230
224 1 2 3 7 230 231
225 1 2 3 7 231 232
226 1 2 3 7 232 233
227 1 2 3 7 233 234
228 1 2 3 7 234 235
229 1 2 3 7 235 236
230 1 2 3 7 236 237
231 1 2 3 7 237 238
232 1 2 3 7 238 239
233 1 2 3 7 239 240
234 1 2 3 7 240 241
235 1 2 3 7 241 242
236 1 2 3 7 242 243
237 1 2 3 7 243 244
238 1 2 3 7 244 245
239 1 2 3 7 245 246
240 1 2 3 7 246 247
241 1 2 3 7 247 248
242 1 2 3 7 248 249
243 1 2 3 7 249 250
244 1 2 3 7 250 251
245 1 2 3 7 251 252
246 1 2 3 7 252 253
247 1 2 3 7 253 254
248 1 2 3 7 254 255
249 1 2 3 7 255 256
250 1 2 3 7 256 257
251 1 2 3 7 257 258
252 1 2 3 7 258 259
253 1 2 3 7 259 260
254 1 2 3 7 260 261
255 1 2 3 7 261 262
256 1 2 3 7 262 263
257 1 2 3 7 263 264
258 1 2 3 7 264 265
259 1 2 3 7 265 266
260 1 2 3 7 266 267
261 1 2 3 7 267 268
262 1 2 3 7 268 269
263 1 2 3 7 269 270
264 1 2 3 7 270 271
265 1 2 3 7 271 272
266 1 2 3 7 272 273
267 1 2 3 7 273 274
268 1 2 3 7 274 275
269 1 2 3 7 275 276
270 1 2 3 7 276 277
271 1 2 3 7 277 278
272 1 2 3 7 278 279
273 1 2 3 7 279 280
274 1 2 3 7 280 281
275 1 2 3 7 281 8
276 1 2 3 8 8 9
277 1 2 3 9 9 282
278 1 2 3 9 282 283
279 1 2 3 9 283 284
280 1 2 3 9 284 10
281 1 2 4 10 10 285
282 1 2 4 10 285 286
283 1 2 4 10 286 287
284 1 2 4 10 287 288
285 1 2 4 10 288 11
286 1 2 4 11 11 289
287 1 2 4 11 289 290
288 1 2 4 11 290 291
289 1 2 4 11 291 12
290 1 2 4 12 12 292
291 1 2 4 12 292 293
292 1 2 4 12 293 294
293 1 2 4 12 294 13
$EndElements
