\relax 
\@writefile{toc}{\contentsline {section}{\numberline {1}Introduction}{1}}
\@writefile{toc}{\contentsline {section}{\numberline {2}Task}{1}}
\@writefile{toc}{\contentsline {section}{\numberline {3}By the way}{1}}
