,0
0,100.0
1,100.0
2,100.0
3,100.0
4,100.0
5,100.0
6,100.0
7,100.0
8,100.0
9,100.0
10,100.0
11,100.0
12,100.0
13,100.0
14,100.0
15,100.0
16,100.0
17,100.0
18,100.0
19,100.0
20,100.0
21,100.0
22,100.0
23,100.0
24,100.0
25,100.0
26,100.0
27,100.0
28,100.0
29,100.0
30,100.0
31,100.0
32,100.0
33,100.0
34,100.0
35,100.0
36,100.0
37,100.0
38,100.0
39,100.0
40,100.0
41,100.0
42,100.0
43,100.0
44,100.0
45,100.0
46,100.0
47,100.0
48,100.0
49,100.0
50,100.0
51,100.0
52,100.0
53,100.0
54,100.0
55,100.0
56,100.0
57,100.0
58,-0.0
59,100.0
60,100.0
61,100.0
62,100.0
63,100.0
64,100.0
65,100.0
66,100.0
67,-0.0
68,100.0
69,100.0
70,-0.0
71,100.0
72,100.0
73,100.0
74,100.0
75,100.0
76,100.0
77,-0.0
78,100.0
79,100.0
80,100.0
81,100.0
82,100.0
83,100.0
84,100.0
85,100.0
86,100.0
87,100.0
88,100.0
89,100.0
90,100.0
91,100.0
92,100.0
93,100.0
94,100.0
95,100.0
96,100.0
97,100.0
98,100.0
99,-0.0
100,100.0
101,100.0
102,100.0
103,100.0
104,100.0
105,100.0
106,100.0
107,100.0
108,100.0
109,100.0
110,100.0
111,100.0
112,100.0
113,-0.0
114,100.0
115,-0.0
116,100.0
117,-0.0
118,100.0
119,-0.0
120,100.0
121,-0.0
122,100.0
123,100.0
124,100.0
125,-0.0
126,100.0
127,-0.0
128,100.0
129,-0.0
130,100.0
131,-0.0
132,100.0
133,-0.0
134,100.0
135,100.0
136,100.0
137,-0.0
138,100.0
139,-0.0
140,100.0
141,100.0
142,-0.0
143,100.0
144,100.0
145,-0.0
146,100.0
147,-0.0
148,100.0
149,100.0
150,-0.0
151,100.0
152,100.0
153,100.0
154,-0.0
155,100.0
156,100.0
157,100.0
158,-0.0
159,100.0
160,-0.0
161,100.0
162,-0.0
163,100.0
164,-0.0
165,100.0
166,-0.0
167,100.0
168,-0.0
169,100.0
170,-0.0
171,100.0
172,-0.0
173,100.0
174,-0.0
175,100.0
176,-0.0
177,100.0
178,-0.0
179,100.0
180,-0.0
181,100.0
182,-0.0
183,100.0
184,100.0
185,-0.0
186,100.0
187,-0.0
188,100.0
189,-0.0
190,100.0
191,100.0
192,100.0
193,100.0
194,100.0
195,-0.0
196,100.0
197,100.0
198,100.0
199,100.0
200,100.0
201,100.0
202,100.0
203,100.0
204,100.0
205,100.0
206,100.0
207,100.0
208,100.0
209,100.0
210,100.0
211,100.0
212,100.0
213,100.0
214,100.0
215,100.0
216,-0.0
217,100.0
218,100.0
219,100.0
220,-0.0
221,100.0
222,100.0
223,-0.0
224,100.0
225,-0.0
226,100.0
227,-0.0
228,100.0
229,100.0
230,100.0
231,100.0
232,100.0
233,100.0
234,100.0
235,100.0
236,100.0
237,100.0
238,100.0
239,100.0
240,100.0
241,100.0
242,100.0
243,100.0
244,100.0
245,100.0
246,100.0
247,100.0
248,100.0
249,100.0
250,100.0
251,100.0
252,100.0
253,100.0
254,100.0
255,100.0
256,100.0
257,100.0
258,100.0
259,100.0
260,100.0
261,100.0
262,100.0
263,-0.0
264,100.0
265,100.0
266,100.0
267,100.0
268,100.0
269,100.0
270,100.0
271,100.0
272,100.0
273,100.0
274,100.0
275,100.0
276,100.0
277,100.0
278,100.0
279,10.0
280,100.0
281,-0.0
282,100.0
283,100.0
284,100.0
285,-0.0
286,100.0
287,100.0
288,100.0
289,-0.0
290,100.0
291,100.0
292,-0.0
293,100.0
294,100.0
295,100.0
296,100.0
297,100.0
298,100.0
299,100.0
300,100.0
301,-0.0
302,100.0
303,100.0
304,100.0
305,100.0
306,100.0
307,100.0
308,100.0
309,100.0
310,100.0
311,100.0
312,100.0
313,-0.0
314,100.0
315,100.0
316,-0.0
317,100.0
318,-0.0
319,100.0
320,100.0
321,100.0
322,-0.0
323,100.0
324,100.0
325,-0.0
326,100.0
327,100.0
328,100.0
329,100.0
330,100.0
331,100.0
332,-0.0
333,100.0
334,-0.0
335,100.0
336,-0.0
337,100.0
338,-0.0
339,100.0
340,-0.0
341,100.0
342,100.0
343,100.0
344,100.0
345,100.0
346,100.0
347,100.0
348,100.0
349,100.0
350,100.0
351,-0.0
352,100.0
353,-0.0
354,100.0
355,-0.0
356,100.0
357,100.0
358,100.0
359,100.0
360,-0.0
361,100.0
362,100.0
363,100.0
364,100.0
365,100.0
366,100.0
367,100.0
368,100.0
369,100.0
370,-0.0
371,100.0
372,-0.0
373,100.0
374,100.0
375,100.0
376,100.0
377,100.0
378,100.0
379,100.0
380,100.0
381,100.0
382,100.0
383,100.0
384,100.0
385,100.0
386,100.0
387,100.0
388,100.0
389,100.0
390,100.0
391,100.0
392,100.0
393,100.0
394,100.0
395,100.0
396,100.0
397,100.0
398,100.0
399,100.0
400,100.0
401,100.0
402,100.0
403,100.0
404,100.0
405,100.0
406,100.0
407,100.0
408,100.0
409,100.0
410,100.0
411,100.0
412,100.0
413,100.0
414,100.0
415,100.0
416,100.0
417,100.0
418,100.0
419,100.0
420,100.0
421,100.0
422,100.0
423,100.0
424,-0.0
425,100.0
426,100.0
427,100.0
428,-0.0
429,100.0
430,100.0
431,100.0
432,100.0
433,100.0
434,-0.0
435,100.0
436,100.0
437,100.0
438,100.0
439,100.0
440,100.0
441,100.0
442,100.0
443,100.0
444,100.0
445,100.0
446,-0.0
447,100.0
448,100.0
449,100.0
450,100.0
451,100.0
452,100.0
453,100.0
454,-0.0
455,100.0
456,100.0
457,100.0
458,100.0
459,100.0
460,-0.0
461,100.0
462,100.0
463,100.0
464,100.0
465,100.0
466,100.0
467,100.0
468,100.0
469,100.0
470,100.0
471,100.0
472,100.0
473,100.0
474,100.0
475,100.0
476,100.0
477,100.0
478,100.0
479,100.0
480,100.0
481,100.0
482,100.0
483,100.0
484,100.0
485,100.0
486,100.0
487,100.0
488,100.0
489,100.0
490,100.0
491,100.0
492,-0.0
493,100.0
494,100.0
495,100.0
496,100.0
497,100.0
498,100.0
499,100.0
500,100.0
501,100.0
502,100.0
503,100.0
504,100.0
505,100.0
506,100.0
507,100.0
508,100.0
509,100.0
510,100.0
511,100.0
512,100.0
513,-0.0
514,100.0
515,100.0
516,100.0
517,100.0
518,100.0
519,100.0
520,100.0
521,100.0
522,100.0
523,100.0
524,100.0
525,100.0
526,100.0
527,100.0
528,100.0
529,100.0
530,100.0
531,100.0
532,100.0
533,100.0
534,100.0
535,100.0
536,100.0
537,100.0
538,100.0
539,100.0
540,100.0
541,100.0
542,100.0
543,-0.0
544,100.0
545,100.0
546,100.0
547,100.0
548,100.0
549,100.0
550,100.0
551,100.0
552,100.0
553,100.0
554,100.0
555,100.0
556,-0.0
557,100.0
558,100.0
559,-0.0
560,100.0
561,100.0
562,100.0
563,100.0
564,100.0
565,100.0
566,100.0
567,100.0
568,100.0
569,100.0
570,100.0
571,100.0
572,100.0
573,100.0
574,100.0
575,100.0
576,100.0
577,100.0
578,100.0
579,100.0
580,100.0
581,100.0
582,100.0
583,100.0
584,100.0
585,100.0
586,100.0
587,100.0
588,100.0
589,100.0
590,100.0
591,100.0
592,100.0
593,100.0
594,100.0
595,-0.0
596,100.0
597,100.0
598,100.0
599,100.0
600,100.0
601,100.0
602,100.0
603,100.0
604,100.0
605,100.0
606,-0.0
607,100.0
608,100.0
609,100.0
610,100.0
611,100.0
612,100.0
613,100.0
614,100.0
615,-0.0
616,100.0
617,100.0
618,100.0
619,100.0
620,100.0
621,100.0
622,100.0
623,100.0
624,100.0
625,100.0
626,100.0
627,100.0
628,100.0
629,100.0
630,100.0
631,100.0
632,100.0
633,100.0
634,100.0
635,100.0
636,100.0
637,-0.0
638,100.0
639,100.0
640,100.0
641,100.0
642,100.0
643,100.0
644,100.0
645,100.0
646,-0.0
647,100.0
648,-0.0
649,100.0
650,-0.0
651,100.0
652,100.0
653,100.0
654,100.0
655,-0.0
656,100.0
657,-0.0
658,100.0
659,-0.0
660,100.0
661,-0.0
662,100.0
663,100.0
664,100.0
665,100.0
666,100.0
667,100.0
668,100.0
669,-0.0
670,100.0
671,-0.0
672,100.0
673,100.0
674,100.0
675,100.0
676,100.0
677,100.0
678,100.0
679,100.0
680,100.0
681,100.0
682,100.0
683,100.0
684,100.0
685,100.0
686,100.0
687,100.0
688,100.0
689,100.0
690,100.0
691,100.0
692,-0.0
693,100.0
694,100.0
695,100.0
696,100.0
697,100.0
698,100.0
699,100.0
700,100.0
701,100.0
702,100.0
703,-0.0
704,100.0
705,100.0
706,100.0
707,100.0
708,100.0
709,-0.0
710,100.0
711,100.0
712,100.0
713,100.0
714,100.0
715,100.0
716,100.0
717,100.0
718,100.0
719,100.0
720,100.0
721,100.0
722,100.0
723,100.0
724,100.0
725,100.0
726,100.0
727,100.0
728,100.0
729,100.0
730,100.0
731,100.0
732,100.0
733,100.0
734,100.0
735,100.0
736,100.0
737,-0.0
738,100.0
739,100.0
740,100.0
741,100.0
742,100.0
743,100.0
744,100.0
745,100.0
746,100.0
747,100.0
748,-0.0
749,100.0
750,100.0
751,100.0
752,100.0
753,100.0
754,100.0
755,100.0
756,-0.0
757,100.0
758,100.0
759,100.0
760,100.0
761,100.0
762,100.0
763,100.0
764,-0.0
765,100.0
766,100.0
767,100.0
768,100.0
769,100.0
770,100.0
771,100.0
772,100.0
773,100.0
774,100.0
775,100.0
776,100.0
777,100.0
778,100.0
779,100.0
780,100.0
781,100.0
782,-0.0
783,100.0
784,100.0
785,100.0
786,100.0
787,100.0
788,100.0
789,100.0
790,100.0
791,100.0
792,100.0
793,100.0
794,100.0
795,-0.0
796,100.0
797,100.0
798,100.0
799,100.0
800,100.0
801,-0.0
802,100.0
803,100.0
804,100.0
805,100.0
806,100.0
807,100.0
808,100.0
809,100.0
810,100.0
811,100.0
812,100.0
813,100.0
814,100.0
815,100.0
816,100.0
817,100.0
818,100.0
819,100.0
820,-0.0
821,100.0
822,100.0
823,100.0
824,100.0
825,100.0
826,-0.0
827,100.0
828,100.0
829,100.0
830,100.0
831,100.0
832,-0.0
833,100.0
834,100.0
835,100.0
836,100.0
837,100.0
838,100.0
839,100.0
840,-0.0
841,100.0
842,100.0
843,100.0
844,100.0
845,100.0
846,100.0
847,100.0
848,100.0
849,100.0
850,100.0
851,100.0
852,100.0
853,-0.0
854,100.0
855,-0.0
856,100.0
857,100.0
858,100.0
859,100.0
860,100.0
861,100.0
862,100.0
863,100.0
864,100.0
865,100.0
866,100.0
867,100.0
868,100.0
869,-0.0
870,100.0
871,100.0
872,-0.0
873,100.0
874,100.0
875,-0.0
876,100.0
877,100.0
878,100.0
879,100.0
880,100.0
881,-0.0
882,100.0
883,-0.0
884,100.0
885,100.0
886,100.0
887,-0.0
888,100.0
889,100.0
890,100.0
891,100.0
892,100.0
893,100.0
894,100.0
895,100.0
896,-0.0
897,100.0
898,100.0
899,100.0
900,100.0
901,100.0
902,100.0
903,100.0
904,100.0
905,100.0
906,100.0
907,100.0
908,100.0
909,100.0
910,100.0
911,100.0
912,100.0
913,100.0
914,100.0
915,100.0
916,100.0
917,100.0
918,100.0
919,100.0
920,100.0
921,100.0
922,100.0
923,100.0
924,100.0
925,100.0
926,100.0
927,100.0
928,100.0
929,100.0
930,100.0
931,100.0
932,100.0
933,100.0
934,100.0
935,100.0
936,100.0
937,100.0
938,100.0
939,100.0
940,100.0
941,100.0
942,100.0
943,100.0
944,100.0
945,100.0
946,100.0
947,100.0
948,100.0
949,100.0
950,100.0
951,100.0
952,-0.0
953,100.0
954,-0.0
955,100.0
956,100.0
957,-0.0
958,100.0
959,-0.0
960,100.0
961,100.0
962,-0.0
963,100.0
964,-0.0
965,100.0
966,-0.0
967,100.0
968,100.0
969,-0.0
970,100.0
971,100.0
972,100.0
973,100.0
974,100.0
975,100.0
976,100.0
977,100.0
978,100.0
979,100.0
980,100.0
981,100.0
982,100.0
983,-0.0
984,100.0
985,100.0
986,100.0
987,100.0
988,100.0
989,100.0
990,100.0
991,100.0
992,100.0
993,100.0
994,100.0
995,100.0
996,100.0
997,-0.0
998,100.0
999,100.0
1000,100.0
1001,100.0
1002,100.0
1003,100.0
1004,100.0
1005,100.0
1006,100.0
1007,100.0
1008,100.0
1009,100.0
1010,100.0
1011,100.0
1012,100.0
1013,-0.0
1014,100.0
1015,-0.0
1016,100.0
1017,-0.0
1018,100.0
1019,-0.0
1020,100.0
1021,-0.0
1022,100.0
1023,100.0
1024,100.0
1025,100.0
1026,100.0
1027,100.0
1028,100.0
1029,100.0
1030,100.0
1031,-0.0
1032,100.0
1033,-0.0
1034,100.0
1035,-0.0
1036,100.0
1037,-0.0
1038,100.0
1039,100.0
1040,100.0
1041,100.0
1042,-0.0
1043,100.0
1044,100.0
1045,-0.0
1046,100.0
1047,100.0
1048,100.0
1049,100.0
1050,100.0
1051,-0.0
1052,100.0
1053,-0.0
1054,100.0
1055,-0.0
1056,100.0
1057,100.0
1058,100.0
1059,100.0
1060,100.0
1061,100.0
1062,100.0
1063,100.0
1064,100.0
1065,100.0
1066,100.0
1067,100.0
1068,100.0
1069,100.0
1070,100.0
1071,100.0
1072,100.0
1073,100.0
1074,100.0
1075,-0.0
1076,100.0
1077,100.0
1078,100.0
1079,100.0
1080,100.0
1081,100.0
1082,100.0
1083,100.0
1084,100.0
1085,100.0
1086,100.0
1087,100.0
1088,100.0
1089,100.0
1090,100.0
1091,100.0
1092,100.0
1093,100.0
1094,100.0
1095,100.0
1096,-0.0
1097,100.0
1098,100.0
1099,100.0
1100,100.0
1101,-0.0
1102,100.0
1103,100.0
1104,100.0
1105,100.0
1106,100.0
1107,100.0
1108,100.0
1109,100.0
1110,100.0
1111,100.0
1112,100.0
1113,100.0
1114,-0.0
1115,100.0
1116,100.0
1117,100.0
1118,100.0
1119,100.0
1120,100.0
1121,-0.0
1122,100.0
1123,100.0
1124,-0.0
1125,100.0
1126,-0.0
1127,100.0
1128,100.0
1129,-0.0
1130,100.0
1131,100.0
1132,100.0
1133,100.0
1134,100.0
1135,100.0
1136,100.0
1137,100.0
1138,100.0
1139,100.0
1140,100.0
1141,100.0
1142,100.0
1143,100.0
1144,100.0
1145,100.0
1146,100.0
1147,100.0
1148,100.0
1149,100.0
1150,100.0
1151,100.0
1152,100.0
1153,100.0
1154,100.0
1155,100.0
1156,100.0
1157,100.0
1158,100.0
1159,100.0
1160,100.0
1161,100.0
1162,100.0
1163,100.0
1164,100.0
1165,100.0
1166,100.0
1167,100.0
1168,100.0
1169,100.0
1170,100.0
1171,100.0
1172,100.0
1173,100.0
1174,100.0
1175,100.0
1176,100.0
1177,100.0
1178,100.0
1179,100.0
1180,100.0
1181,100.0
1182,100.0
1183,100.0
1184,100.0
1185,100.0
1186,100.0
1187,100.0
1188,100.0
1189,100.0
1190,100.0
1191,100.0
1192,100.0
1193,100.0
1194,100.0
1195,100.0
1196,100.0
1197,100.0
1198,100.0
1199,100.0
1200,100.0
1201,100.0
1202,100.0
1203,100.0
1204,100.0
1205,100.0
1206,100.0
1207,100.0
1208,100.0
1209,100.0
1210,100.0
1211,100.0
1212,100.0
1213,100.0
1214,100.0
1215,100.0
1216,100.0
1217,-0.0
1218,100.0
1219,100.0
1220,100.0
1221,100.0
1222,100.0
1223,100.0
1224,100.0
1225,100.0
1226,100.0
1227,100.0
1228,100.0
1229,100.0
1230,100.0
1231,100.0
1232,100.0
1233,100.0
1234,100.0
1235,100.0
1236,100.0
1237,100.0
1238,-0.0
1239,100.0
1240,-0.0
1241,100.0
1242,100.0
1243,100.0
1244,100.0
1245,100.0
1246,100.0
1247,100.0
1248,100.0
1249,100.0
1250,100.0
1251,-0.0
1252,100.0
1253,100.0
1254,100.0
1255,100.0
1256,100.0
1257,100.0
1258,100.0
1259,100.0
1260,100.0
1261,100.0
1262,100.0
1263,100.0
1264,100.0
1265,100.0
1266,100.0
1267,100.0
1268,100.0
1269,100.0
1270,100.0
1271,100.0
1272,100.0
1273,100.0
1274,100.0
1275,100.0
1276,100.0
1277,100.0
1278,100.0
1279,100.0
1280,100.0
1281,100.0
1282,100.0
1283,100.0
1284,100.0
1285,100.0
1286,100.0
1287,-0.0
1288,100.0
1289,-0.0
1290,100.0
1291,-0.0
1292,100.0
1293,-0.0
1294,100.0
1295,-0.0
1296,100.0
1297,-0.0
1298,100.0
1299,100.0
1300,100.0
1301,100.0
1302,100.0
1303,100.0
1304,100.0
1305,100.0
1306,-0.0
1307,100.0
1308,-0.0
1309,100.0
1310,-0.0
1311,100.0
1312,100.0
1313,100.0
1314,100.0
1315,100.0
1316,100.0
1317,100.0
1318,100.0
1319,100.0
1320,100.0
1321,-0.0
1322,100.0
1323,-0.0
1324,100.0
1325,100.0
1326,100.0
1327,100.0
1328,100.0
1329,100.0
1330,100.0
1331,100.0
1332,100.0
1333,100.0
1334,100.0
1335,100.0
1336,100.0
1337,100.0
1338,100.0
1339,100.0
1340,100.0
1341,100.0
1342,100.0
1343,-0.0
1344,100.0
1345,100.0
1346,100.0
1347,100.0
1348,100.0
1349,100.0
1350,100.0
1351,-0.0
1352,100.0
1353,100.0
1354,100.0
1355,100.0
1356,100.0
1357,100.0
1358,100.0
1359,100.0
1360,100.0
1361,100.0
1362,100.0
1363,100.0
1364,100.0
1365,100.0
1366,100.0
1367,100.0
1368,100.0
1369,100.0
1370,100.0
1371,100.0
1372,100.0
1373,100.0
1374,100.0
1375,100.0
1376,100.0
1377,100.0
1378,100.0
1379,100.0
1380,100.0
1381,100.0
1382,100.0
1383,100.0
1384,100.0
1385,100.0
1386,100.0
1387,100.0
1388,100.0
1389,100.0
1390,100.0
1391,100.0
1392,100.0
1393,100.0
1394,100.0
1395,100.0
1396,100.0
1397,100.0
1398,100.0
1399,100.0
1400,100.0
1401,100.0
1402,100.0
1403,100.0
1404,100.0
1405,100.0
1406,100.0
1407,100.0
1408,-0.0
1409,100.0
1410,100.0
1411,100.0
1412,-0.0
1413,100.0
1414,100.0
1415,100.0
1416,100.0
1417,100.0
1418,100.0
1419,100.0
1420,100.0
1421,100.0
1422,100.0
1423,100.0
1424,100.0
1425,100.0
1426,100.0
1427,100.0
1428,100.0
1429,100.0
1430,100.0
1431,100.0
1432,100.0
1433,100.0
1434,100.0
1435,100.0
1436,100.0
1437,100.0
1438,100.0
1439,100.0
1440,100.0
1441,100.0
1442,100.0
1443,100.0
1444,100.0
1445,100.0
1446,100.0
1447,100.0
1448,100.0
1449,100.0
1450,100.0
1451,100.0
1452,100.0
1453,100.0
1454,100.0
1455,100.0
1456,100.0
1457,100.0
1458,100.0
1459,100.0
1460,100.0
1461,100.0
1462,100.0
1463,100.0
1464,100.0
1465,100.0
1466,100.0
1467,100.0
1468,100.0
1469,100.0
1470,100.0
1471,100.0
1472,100.0
1473,100.0
1474,100.0
1475,100.0
1476,100.0
1477,100.0
1478,100.0
1479,100.0
1480,100.0
1481,100.0
1482,100.0
1483,-0.0
1484,100.0
1485,-0.0
1486,100.0
1487,-0.0
1488,100.0
1489,-0.0
1490,100.0
1491,100.0
1492,100.0
1493,100.0
1494,100.0
1495,100.0
1496,100.0
1497,100.0
1498,100.0
1499,100.0
1500,100.0
1501,100.0
1502,100.0
1503,100.0
1504,100.0
1505,-0.0
1506,100.0
1507,-0.0
1508,100.0
1509,100.0
1510,100.0
1511,-0.0
1512,100.0
1513,100.0
1514,100.0
1515,100.0
1516,100.0
1517,100.0
1518,100.0
1519,100.0
1520,100.0
1521,100.0
1522,100.0
1523,100.0
1524,100.0
1525,100.0
1526,100.0
1527,100.0
1528,100.0
1529,100.0
1530,100.0
1531,100.0
1532,100.0
1533,100.0
1534,100.0
1535,100.0
1536,100.0
1537,100.0
1538,100.0
1539,100.0
1540,100.0
1541,100.0
1542,100.0
1543,100.0
1544,100.0
1545,100.0
1546,100.0
1547,100.0
1548,100.0
1549,100.0
1550,100.0
1551,100.0
1552,100.0
1553,100.0
1554,100.0
1555,100.0
1556,100.0
1557,100.0
1558,100.0
1559,100.0
1560,100.0
1561,100.0
1562,100.0
1563,100.0
1564,100.0
1565,100.0
1566,100.0
1567,100.0
1568,100.0
1569,100.0
1570,100.0
1571,100.0
1572,100.0
1573,100.0
1574,100.0
1575,100.0
1576,100.0
1577,100.0
1578,100.0
1579,100.0
1580,100.0
1581,100.0
1582,100.0
1583,100.0
1584,100.0
1585,100.0
1586,100.0
1587,100.0
1588,100.0
1589,100.0
1590,100.0
1591,100.0
1592,100.0
1593,100.0
1594,100.0
1595,100.0
1596,100.0
1597,100.0
1598,100.0
1599,100.0
1600,100.0
1601,100.0
1602,100.0
1603,100.0
1604,100.0
1605,100.0
1606,100.0
1607,100.0
1608,100.0
1609,100.0
1610,100.0
1611,-0.0
1612,100.0
1613,100.0
1614,100.0
1615,100.0
1616,100.0
1617,100.0
1618,100.0
1619,100.0
1620,100.0
1621,100.0
1622,100.0
1623,100.0
1624,100.0
1625,-0.0
1626,100.0
1627,100.0
1628,100.0
1629,100.0
1630,100.0
1631,100.0
1632,100.0
1633,100.0
1634,100.0
1635,100.0
1636,100.0
1637,100.0
1638,100.0
1639,100.0
1640,100.0
1641,100.0
1642,100.0
1643,100.0
1644,100.0
1645,100.0
1646,100.0
1647,100.0
1648,100.0
1649,100.0
1650,100.0
1651,100.0
1652,100.0
1653,100.0
1654,100.0
1655,100.0
1656,100.0
1657,100.0
1658,100.0
1659,100.0
1660,100.0
1661,100.0
1662,100.0
1663,100.0
1664,100.0
1665,100.0
1666,100.0
1667,100.0
1668,100.0
1669,100.0
1670,100.0
1671,100.0
1672,100.0
1673,100.0
1674,100.0
1675,100.0
1676,100.0
1677,100.0
1678,100.0
1679,100.0
1680,100.0
1681,100.0
1682,100.0
1683,100.0
1684,100.0
1685,100.0
1686,100.0
1687,100.0
1688,100.0
1689,100.0
1690,100.0
1691,100.0
1692,100.0
1693,100.0
1694,100.0
1695,100.0
1696,100.0
1697,100.0
1698,100.0
1699,100.0
1700,100.0
1701,100.0
1702,100.0
1703,100.0
1704,100.0
1705,100.0
1706,100.0
1707,100.0
1708,100.0
1709,100.0
1710,100.0
1711,100.0
1712,100.0
1713,100.0
1714,100.0
1715,100.0
1716,100.0
1717,100.0
1718,100.0
1719,100.0
1720,100.0
1721,100.0
1722,100.0
1723,100.0
1724,100.0
1725,100.0
1726,100.0
1727,100.0
1728,100.0
1729,100.0
1730,100.0
1731,100.0
1732,-0.0
1733,100.0
1734,100.0
1735,-0.0
1736,100.0
1737,100.0
1738,100.0
1739,100.0
1740,100.0
1741,100.0
1742,100.0
1743,100.0
1744,100.0
1745,100.0
1746,100.0
1747,100.0
1748,100.0
1749,100.0
1750,100.0
1751,100.0
1752,100.0
1753,100.0
1754,100.0
1755,100.0
1756,100.0
1757,-0.0
1758,100.0
1759,100.0
1760,100.0
1761,100.0
1762,100.0
1763,100.0
1764,100.0
1765,100.0
1766,100.0
1767,100.0
1768,100.0
1769,100.0
1770,100.0
1771,100.0
1772,100.0
1773,100.0
1774,100.0
1775,100.0
1776,100.0
1777,100.0
1778,100.0
1779,100.0
1780,100.0
1781,100.0
1782,100.0
1783,100.0
1784,100.0
1785,100.0
1786,100.0
1787,100.0
1788,100.0
1789,100.0
1790,100.0
1791,100.0
1792,100.0
1793,100.0
1794,100.0
1795,100.0
1796,100.0
1797,100.0
1798,100.0
1799,100.0
1800,100.0
1801,100.0
1802,100.0
1803,-0.0
1804,100.0
1805,-0.0
1806,100.0
1807,-0.0
1808,100.0
1809,100.0
1810,100.0
1811,100.0
1812,100.0
1813,-0.0
1814,100.0
1815,-0.0
1816,100.0
1817,100.0
1818,100.0
1819,100.0
1820,100.0
1821,100.0
1822,100.0
1823,-0.0
1824,100.0
1825,-0.0
1826,100.0
1827,-0.0
1828,100.0
1829,100.0
1830,100.0
1831,100.0
1832,100.0
1833,100.0
1834,100.0
1835,100.0
1836,100.0
1837,100.0
1838,100.0
1839,100.0
1840,100.0
1841,100.0
1842,100.0
1843,100.0
1844,100.0
1845,100.0
1846,100.0
1847,100.0
1848,100.0
1849,100.0
1850,100.0
1851,100.0
1852,100.0
1853,100.0
1854,100.0
1855,100.0
1856,100.0
1857,100.0
1858,100.0
1859,100.0
1860,100.0
1861,100.0
1862,100.0
1863,100.0
1864,100.0
1865,100.0
1866,100.0
1867,100.0
1868,100.0
1869,100.0
1870,100.0
1871,100.0
1872,100.0
1873,-0.0
1874,100.0
1875,100.0
1876,100.0
1877,100.0
1878,100.0
1879,100.0
1880,100.0
1881,100.0
1882,100.0
1883,100.0
1884,100.0
1885,100.0
1886,100.0
1887,100.0
1888,100.0
1889,100.0
1890,100.0
1891,100.0
1892,100.0
1893,100.0
1894,100.0
1895,100.0
1896,100.0
1897,100.0
1898,100.0
1899,100.0
1900,100.0
1901,100.0
1902,100.0
1903,100.0
1904,100.0
1905,100.0
1906,100.0
1907,100.0
1908,-0.0
1909,100.0
1910,100.0
1911,100.0
1912,-0.0
1913,100.0
1914,100.0
1915,100.0
1916,100.0
1917,100.0
1918,100.0
1919,100.0
1920,100.0
1921,100.0
1922,100.0
1923,100.0
1924,100.0
1925,100.0
1926,100.0
1927,100.0
1928,100.0
1929,100.0
1930,100.0
1931,100.0
1932,100.0
1933,100.0
1934,100.0
1935,100.0
1936,100.0
1937,100.0
1938,100.0
1939,100.0
1940,100.0
1941,100.0
1942,100.0
1943,100.0
1944,100.0
1945,100.0
1946,100.0
1947,100.0
1948,100.0
1949,100.0
1950,100.0
1951,100.0
1952,100.0
1953,100.0
1954,100.0
1955,100.0
1956,100.0
1957,100.0
1958,100.0
1959,100.0
1960,100.0
1961,100.0
1962,100.0
1963,100.0
1964,100.0
1965,-0.0
1966,100.0
1967,100.0
1968,100.0
1969,100.0
1970,100.0
1971,100.0
1972,100.0
1973,100.0
1974,100.0
1975,100.0
1976,100.0
1977,100.0
1978,100.0
1979,100.0
1980,100.0
1981,100.0
1982,100.0
1983,100.0
1984,100.0
1985,100.0
1986,100.0
1987,-0.0
1988,100.0
1989,-0.0
1990,100.0
1991,100.0
1992,100.0
1993,100.0
1994,100.0
1995,100.0
1996,100.0
1997,100.0
1998,100.0
1999,100.0
2000,100.0
2001,100.0
2002,100.0
2003,100.0
2004,100.0
2005,100.0
2006,100.0
2007,100.0
2008,100.0
2009,100.0
2010,100.0
2011,100.0
2012,100.0
2013,100.0
2014,100.0
2015,100.0
2016,100.0
2017,100.0
2018,100.0
2019,100.0
2020,100.0
2021,100.0
2022,100.0
2023,100.0
2024,100.0
2025,100.0
2026,100.0
2027,100.0
2028,100.0
2029,100.0
2030,100.0
2031,100.0
2032,100.0
2033,-0.0
2034,100.0
2035,100.0
2036,100.0
2037,100.0
2038,100.0
2039,100.0
2040,100.0
2041,100.0
2042,100.0
2043,100.0
2044,100.0
2045,100.0
2046,100.0
2047,100.0
2048,100.0
2049,100.0
2050,-0.0
2051,100.0
2052,100.0
2053,-0.0
2054,100.0
2055,100.0
2056,100.0
2057,100.0
2058,100.0
2059,100.0
2060,100.0
2061,100.0
2062,100.0
2063,100.0
2064,-0.0
2065,100.0
2066,100.0
2067,100.0
2068,100.0
2069,100.0
2070,100.0
2071,100.0
2072,100.0
2073,100.0
2074,100.0
2075,100.0
2076,100.0
2077,100.0
2078,100.0
2079,100.0
2080,100.0
2081,100.0
2082,100.0
2083,-0.0
2084,100.0
2085,100.0
2086,100.0
2087,100.0
2088,100.0
2089,100.0
2090,-0.0
2091,100.0
2092,100.0
2093,-0.0
2094,100.0
2095,100.0
2096,100.0
2097,-0.0
2098,100.0
2099,100.0
2100,100.0
2101,100.0
2102,100.0
2103,100.0
2104,100.0
2105,100.0
2106,-0.0
2107,100.0
2108,100.0
2109,100.0
2110,100.0
2111,100.0
2112,100.0
2113,-0.0
2114,100.0
2115,100.0
2116,100.0
2117,-0.0
2118,100.0
2119,100.0
2120,100.0
2121,100.0
2122,100.0
2123,100.0
2124,100.0
2125,100.0
2126,100.0
2127,100.0
2128,-0.0
2129,100.0
2130,100.0
2131,100.0
2132,-0.0
2133,100.0
2134,-0.0
2135,100.0
2136,-0.0
2137,100.0
2138,100.0
2139,100.0
2140,100.0
2141,100.0
2142,100.0
2143,100.0
2144,100.0
2145,100.0
2146,100.0
2147,100.0
2148,100.0
2149,100.0
2150,100.0
2151,-0.0
2152,100.0
2153,-0.0
2154,100.0
2155,100.0
2156,100.0
2157,100.0
2158,100.0
2159,100.0
2160,-0.0
2161,100.0
2162,-0.0
2163,100.0
2164,100.0
2165,100.0
2166,-0.0
2167,100.0
2168,100.0
2169,100.0
2170,-0.0
2171,100.0
2172,100.0
2173,100.0
2174,-0.0
2175,100.0
2176,100.0
2177,100.0
2178,100.0
2179,100.0
2180,100.0
2181,100.0
2182,-0.0
2183,100.0
2184,-0.0
2185,100.0
2186,100.0
2187,100.0
2188,100.0
2189,100.0
2190,100.0
2191,100.0
2192,-0.0
2193,100.0
2194,-0.0
2195,100.0
2196,-0.0
2197,100.0
2198,100.0
2199,100.0
2200,100.0
2201,100.0
2202,100.0
2203,100.0
2204,100.0
2205,100.0
2206,-0.0
2207,100.0
2208,100.0
2209,100.0
2210,100.0
2211,100.0
2212,100.0
2213,100.0
2214,100.0
2215,100.0
2216,-0.0
2217,100.0
2218,-0.0
2219,100.0
2220,100.0
2221,100.0
2222,100.0
2223,100.0
2224,100.0
2225,100.0
2226,-0.0
2227,100.0
2228,100.0
2229,-0.0
2230,100.0
2231,100.0
2232,100.0
2233,100.0
2234,100.0
2235,100.0
2236,100.0
2237,100.0
2238,100.0
2239,100.0
2240,100.0
2241,100.0
2242,100.0
2243,-0.0
2244,100.0
2245,100.0
2246,100.0
2247,100.0
2248,100.0
2249,100.0
2250,100.0
2251,100.0
2252,100.0
2253,100.0
2254,100.0
2255,-0.0
2256,100.0
2257,100.0
2258,100.0
2259,100.0
2260,100.0
2261,100.0
2262,100.0
2263,-0.0
2264,100.0
2265,-0.0
2266,100.0
2267,-0.0
2268,100.0
2269,-0.0
2270,100.0
2271,-0.0
2272,100.0
2273,100.0
2274,100.0
2275,100.0
2276,100.0
2277,100.0
2278,100.0
2279,100.0
2280,100.0
2281,100.0
2282,100.0
2283,100.0
2284,100.0
2285,100.0
2286,100.0
2287,100.0
2288,100.0
2289,100.0
2290,100.0
2291,100.0
2292,100.0
2293,100.0
2294,100.0
2295,100.0
2296,100.0
2297,100.0
2298,100.0
2299,100.0
2300,100.0
2301,100.0
2302,100.0
2303,100.0
2304,100.0
2305,100.0
2306,100.0
2307,-0.0
2308,100.0
2309,-0.0
2310,100.0
2311,-0.0
2312,100.0
2313,100.0
2314,100.0
2315,100.0
2316,100.0
2317,100.0
2318,100.0
2319,-0.0
2320,100.0
2321,100.0
2322,-0.0
2323,100.0
2324,-0.0
2325,100.0
2326,-0.0
2327,100.0
2328,-0.0
2329,100.0
2330,-0.0
2331,100.0
2332,-0.0
2333,100.0
2334,100.0
2335,-0.0
2336,100.0
2337,-0.0
2338,100.0
2339,100.0
2340,-0.0
2341,100.0
2342,100.0
2343,-0.0
2344,100.0
2345,100.0
2346,100.0
2347,-0.0
2348,100.0
2349,-0.0
2350,100.0
2351,-0.0
2352,100.0
2353,100.0
2354,100.0
2355,-0.0
2356,100.0
2357,100.0
2358,100.0
2359,100.0
2360,100.0
2361,100.0
2362,100.0
2363,100.0
2364,-0.0
2365,100.0
2366,-0.0
2367,100.0
2368,-0.0
2369,100.0
2370,100.0
2371,100.0
2372,100.0
2373,100.0
2374,100.0
2375,100.0
2376,-0.0
2377,100.0
2378,-0.0
2379,100.0
2380,-0.0
2381,100.0
2382,100.0
2383,100.0
2384,100.0
2385,100.0
2386,100.0
2387,100.0
2388,100.0
2389,100.0
2390,100.0
2391,100.0
2392,100.0
2393,100.0
2394,100.0
2395,100.0
2396,100.0
2397,100.0
2398,100.0
2399,100.0
2400,100.0
2401,100.0
2402,100.0
2403,100.0
2404,100.0
2405,100.0
2406,100.0
2407,100.0
2408,100.0
2409,100.0
2410,100.0
2411,100.0
2412,100.0
2413,100.0
2414,100.0
2415,100.0
2416,100.0
2417,100.0
2418,100.0
2419,100.0
2420,100.0
2421,100.0
2422,100.0
2423,100.0
2424,100.0
2425,100.0
2426,100.0
2427,100.0
2428,100.0
2429,100.0
2430,100.0
2431,100.0
2432,100.0
2433,100.0
2434,100.0
2435,100.0
2436,100.0
2437,100.0
2438,100.0
2439,100.0
2440,100.0
2441,100.0
2442,100.0
2443,100.0
2444,100.0
2445,100.0
2446,100.0
2447,100.0
2448,100.0
2449,100.0
2450,100.0
2451,100.0
2452,100.0
2453,100.0
2454,100.0
2455,100.0
2456,100.0
2457,100.0
2458,100.0
2459,100.0
2460,100.0
2461,100.0
2462,100.0
2463,100.0
2464,100.0
2465,100.0
2466,100.0
2467,100.0
2468,100.0
2469,100.0
2470,100.0
2471,100.0
2472,100.0
2473,100.0
2474,100.0
2475,100.0
2476,100.0
2477,100.0
2478,100.0
2479,100.0
2480,100.0
2481,100.0
2482,100.0
2483,100.0
2484,100.0
2485,100.0
2486,100.0
2487,100.0
2488,100.0
2489,100.0
2490,-0.0
2491,100.0
2492,100.0
2493,100.0
2494,100.0
2495,100.0
2496,100.0
2497,100.0
2498,100.0
2499,100.0
2500,100.0
2501,100.0
2502,100.0
2503,100.0
2504,100.0
2505,100.0
2506,100.0
2507,100.0
2508,100.0
2509,100.0
2510,100.0
2511,-0.0
2512,100.0
2513,100.0
2514,100.0
2515,100.0
2516,100.0
2517,100.0
2518,100.0
2519,100.0
2520,100.0
2521,-0.0
2522,100.0
2523,100.0
2524,100.0
2525,100.0
2526,100.0
2527,100.0
2528,100.0
2529,100.0
2530,100.0
2531,100.0
2532,100.0
2533,100.0
2534,100.0
2535,100.0
2536,100.0
2537,100.0
2538,100.0
2539,100.0
2540,100.0
2541,100.0
2542,100.0
2543,100.0
2544,100.0
2545,100.0
2546,100.0
2547,100.0
2548,100.0
2549,100.0
2550,100.0
2551,100.0
2552,100.0
2553,100.0
2554,100.0
2555,100.0
2556,100.0
2557,100.0
2558,100.0
2559,100.0
2560,100.0
2561,100.0
2562,100.0
2563,100.0
2564,100.0
2565,100.0
2566,100.0
2567,100.0
2568,100.0
2569,100.0
2570,100.0
2571,100.0
2572,100.0
2573,100.0
2574,100.0
2575,100.0
2576,100.0
2577,100.0
2578,-0.0
2579,100.0
2580,100.0
2581,100.0
2582,100.0
2583,100.0
2584,100.0
2585,100.0
2586,100.0
2587,100.0
2588,-0.0
2589,100.0
2590,100.0
2591,100.0
2592,100.0
2593,100.0
2594,100.0
2595,100.0
2596,100.0
2597,100.0
2598,100.0
2599,100.0
2600,100.0
2601,100.0
2602,100.0
2603,100.0
2604,100.0
2605,100.0
2606,100.0
2607,100.0
2608,-0.0
2609,100.0
2610,100.0
2611,100.0
2612,100.0
2613,100.0
2614,100.0
2615,100.0
2616,100.0
2617,100.0
2618,100.0
2619,-0.0
2620,100.0
2621,100.0
2622,100.0
2623,-0.0
2624,100.0
2625,100.0
2626,-0.0
2627,100.0
2628,-0.0
2629,100.0
2630,100.0
2631,100.0
2632,100.0
2633,100.0
2634,100.0
2635,100.0
2636,-0.0
2637,100.0
2638,100.0
2639,100.0
2640,100.0
2641,100.0
2642,-0.0
2643,100.0
2644,100.0
2645,100.0
2646,100.0
2647,100.0
2648,100.0
2649,100.0
2650,100.0
2651,100.0
2652,100.0
2653,100.0
2654,100.0
2655,100.0
2656,100.0
2657,100.0
2658,-0.0
2659,100.0
2660,100.0
2661,100.0
2662,100.0
2663,100.0
2664,100.0
2665,100.0
2666,100.0
2667,100.0
2668,100.0
2669,100.0
2670,100.0
2671,100.0
2672,100.0
2673,100.0
2674,100.0
2675,100.0
2676,100.0
2677,100.0
2678,100.0
2679,100.0
2680,100.0
2681,100.0
2682,100.0
2683,100.0
2684,100.0
2685,100.0
2686,100.0
2687,100.0
2688,100.0
2689,100.0
2690,-0.0
2691,100.0
2692,-0.0
2693,100.0
2694,100.0
2695,100.0
2696,-0.0
2697,100.0
2698,-0.0
2699,100.0
2700,-0.0
2701,100.0
2702,100.0
2703,100.0
2704,100.0
2705,100.0
2706,100.0
2707,100.0
2708,100.0
2709,100.0
2710,100.0
2711,100.0
2712,100.0
2713,100.0
2714,100.0
2715,100.0
2716,100.0
2717,100.0
2718,100.0
2719,100.0
2720,100.0
2721,100.0
2722,100.0
2723,100.0
2724,100.0
2725,100.0
2726,100.0
2727,100.0
2728,100.0
2729,100.0
2730,100.0
2731,100.0
2732,100.0
2733,100.0
2734,100.0
2735,100.0
2736,100.0
2737,100.0
2738,100.0
2739,100.0
2740,100.0
2741,100.0
2742,100.0
2743,100.0
2744,100.0
2745,100.0
2746,100.0
2747,100.0
2748,100.0
2749,100.0
2750,100.0
2751,100.0
2752,100.0
2753,100.0
2754,100.0
2755,100.0
2756,100.0
2757,100.0
2758,100.0
2759,100.0
2760,100.0
2761,100.0
2762,100.0
2763,100.0
2764,100.0
2765,100.0
2766,100.0
2767,100.0
2768,100.0
2769,100.0
2770,100.0
2771,100.0
2772,100.0
2773,100.0
2774,100.0
2775,100.0
2776,100.0
2777,100.0
2778,100.0
2779,100.0
2780,100.0
2781,100.0
2782,100.0
2783,100.0
2784,100.0
2785,100.0
2786,100.0
2787,100.0
2788,100.0
2789,100.0
2790,100.0
2791,100.0
2792,100.0
2793,-0.0
2794,100.0
2795,100.0
2796,100.0
2797,100.0
2798,100.0
2799,100.0
2800,100.0
2801,100.0
2802,100.0
2803,100.0
2804,100.0
2805,100.0
2806,100.0
2807,100.0
2808,-0.0
2809,100.0
2810,100.0
2811,100.0
2812,100.0
2813,100.0
2814,100.0
2815,100.0
2816,100.0
2817,100.0
2818,100.0
2819,100.0
2820,100.0
2821,100.0
2822,100.0
2823,100.0
2824,100.0
2825,100.0
2826,100.0
2827,100.0
2828,100.0
2829,100.0
2830,100.0
2831,100.0
2832,100.0
2833,100.0
2834,100.0
2835,100.0
2836,100.0
2837,100.0
2838,100.0
2839,100.0
2840,100.0
2841,100.0
2842,100.0
2843,100.0
2844,100.0
2845,100.0
2846,100.0
2847,100.0
2848,100.0
2849,100.0
2850,100.0
2851,100.0
2852,100.0
2853,100.0
2854,100.0
2855,100.0
2856,100.0
2857,100.0
2858,100.0
2859,100.0
2860,100.0
2861,100.0
2862,100.0
2863,100.0
2864,100.0
2865,100.0
2866,100.0
2867,100.0
2868,100.0
2869,100.0
2870,100.0
2871,100.0
2872,100.0
2873,-0.0
2874,100.0
2875,100.0
2876,100.0
2877,100.0
2878,-0.0
2879,100.0
2880,100.0
2881,100.0
2882,100.0
2883,100.0
2884,100.0
2885,100.0
2886,100.0
2887,100.0
2888,100.0
2889,100.0
2890,100.0
2891,100.0
2892,-0.0
2893,100.0
2894,100.0
2895,100.0
2896,-0.0
2897,100.0
2898,100.0
2899,100.0
2900,100.0
2901,100.0
2902,100.0
2903,100.0
2904,100.0
2905,-0.0
2906,100.0
2907,100.0
2908,100.0
2909,100.0
2910,100.0
2911,100.0
2912,100.0
2913,100.0
2914,100.0
2915,100.0
2916,-0.0
2917,100.0
2918,100.0
2919,100.0
2920,100.0
2921,100.0
2922,100.0
2923,100.0
2924,100.0
2925,100.0
2926,100.0
2927,100.0
2928,100.0
2929,100.0
2930,100.0
2931,100.0
2932,100.0
2933,100.0
2934,100.0
2935,100.0
2936,100.0
2937,100.0
2938,100.0
2939,100.0
2940,-0.0
2941,100.0
2942,100.0
2943,100.0
2944,100.0
2945,100.0
2946,100.0
2947,100.0
2948,100.0
2949,100.0
2950,100.0
2951,100.0
2952,100.0
2953,100.0
2954,100.0
2955,100.0
2956,100.0
2957,100.0
2958,100.0
2959,100.0
2960,100.0
2961,100.0
2962,100.0
2963,100.0
2964,100.0
2965,100.0
2966,100.0
2967,100.0
2968,100.0
2969,100.0
2970,100.0
2971,100.0
2972,100.0
2973,100.0
2974,100.0
2975,100.0
2976,100.0
2977,100.0
2978,100.0
2979,100.0
2980,100.0
2981,100.0
2982,100.0
2983,100.0
2984,100.0
2985,100.0
2986,100.0
2987,100.0
2988,100.0
2989,100.0
2990,100.0
2991,100.0
2992,100.0
2993,100.0
2994,-0.0
2995,100.0
2996,100.0
2997,100.0
2998,100.0
2999,100.0
3000,-0.0
3001,100.0
3002,-0.0
3003,100.0
3004,100.0
3005,100.0
3006,100.0
3007,100.0
3008,100.0
3009,100.0
3010,100.0
3011,100.0
3012,100.0
3013,100.0
3014,100.0
3015,-0.0
3016,100.0
3017,100.0
3018,100.0
3019,100.0
3020,100.0
3021,100.0
3022,100.0
3023,-0.0
3024,100.0
3025,100.0
3026,100.0
3027,100.0
3028,100.0
3029,100.0
3030,100.0
3031,100.0
3032,100.0
3033,100.0
3034,100.0
3035,100.0
3036,100.0
3037,100.0
3038,100.0
3039,100.0
3040,100.0
3041,100.0
3042,-0.0
3043,100.0
3044,100.0
3045,100.0
3046,100.0
3047,100.0
3048,100.0
3049,100.0
3050,100.0
3051,-0.0
3052,100.0
3053,100.0
3054,100.0
3055,-0.0
3056,100.0
3057,100.0
3058,100.0
3059,100.0
3060,100.0
3061,100.0
3062,100.0
3063,100.0
3064,100.0
3065,100.0
3066,100.0
3067,100.0
3068,-0.0
3069,100.0
3070,100.0
3071,100.0
3072,100.0
3073,100.0
3074,100.0
3075,100.0
3076,100.0
3077,100.0
3078,100.0
3079,100.0
3080,100.0
3081,100.0
3082,100.0
3083,100.0
3084,100.0
3085,100.0
3086,100.0
3087,-0.0
3088,100.0
3089,100.0
3090,100.0
3091,100.0
3092,100.0
3093,100.0
3094,100.0
3095,-0.0
3096,100.0
3097,100.0
3098,-0.0
3099,100.0
3100,100.0
3101,100.0
3102,100.0
3103,100.0
3104,100.0
3105,-0.0
3106,100.0
3107,100.0
3108,100.0
3109,100.0
3110,100.0
3111,100.0
3112,100.0
3113,100.0
3114,100.0
3115,100.0
3116,100.0
3117,100.0
3118,100.0
3119,100.0
3120,-0.0
3121,100.0
3122,100.0
3123,100.0
3124,100.0
3125,100.0
3126,100.0
3127,100.0
3128,100.0
3129,100.0
3130,100.0
3131,100.0
3132,100.0
3133,100.0
3134,100.0
3135,-0.0
3136,100.0
3137,-0.0
3138,100.0
3139,100.0
3140,100.0
3141,100.0
3142,100.0
3143,100.0
3144,100.0
3145,100.0
3146,100.0
3147,100.0
3148,-0.0
3149,100.0
3150,-0.0
3151,100.0
3152,100.0
3153,100.0
3154,100.0
3155,100.0
3156,100.0
3157,100.0
3158,100.0
3159,100.0
3160,100.0
3161,100.0
3162,100.0
3163,100.0
3164,100.0
3165,100.0
3166,100.0
3167,100.0
3168,-0.0
3169,100.0
3170,100.0
3171,100.0
3172,100.0
3173,100.0
3174,100.0
3175,100.0
3176,100.0
3177,100.0
3178,100.0
3179,100.0
3180,100.0
3181,100.0
3182,100.0
3183,100.0
3184,100.0
3185,100.0
3186,100.0
3187,-0.0
3188,100.0
3189,100.0
3190,100.0
3191,100.0
3192,100.0
3193,100.0
3194,100.0
3195,100.0
3196,100.0
3197,100.0
3198,100.0
3199,100.0
3200,100.0
3201,100.0
3202,-0.0
3203,100.0
3204,100.0
3205,100.0
3206,100.0
3207,100.0
3208,100.0
3209,100.0
3210,100.0
3211,100.0
3212,100.0
3213,100.0
3214,100.0
3215,100.0
3216,100.0
3217,100.0
3218,100.0
3219,100.0
3220,100.0
3221,100.0
3222,100.0
3223,100.0
3224,100.0
3225,100.0
3226,100.0
3227,100.0
3228,100.0
3229,100.0
3230,100.0
3231,100.0
3232,100.0
3233,100.0
3234,100.0
3235,100.0
3236,100.0
3237,100.0
3238,100.0
3239,100.0
3240,100.0
3241,100.0
3242,100.0
3243,100.0
3244,100.0
3245,100.0
3246,100.0
3247,100.0
3248,100.0
3249,100.0
3250,100.0
3251,100.0
3252,100.0
3253,100.0
3254,100.0
3255,100.0
3256,100.0
3257,100.0
3258,100.0
3259,100.0
3260,100.0
3261,-0.0
3262,100.0
3263,100.0
3264,100.0
3265,100.0
3266,100.0
3267,100.0
3268,100.0
3269,100.0
3270,100.0
3271,100.0
3272,100.0
3273,100.0
3274,100.0
3275,100.0
3276,100.0
3277,100.0
3278,100.0
3279,100.0
3280,100.0
3281,100.0
3282,100.0
3283,100.0
3284,100.0
3285,100.0
3286,100.0
3287,100.0
3288,-0.0
3289,100.0
3290,100.0
3291,100.0
3292,100.0
3293,100.0
3294,100.0
3295,100.0
3296,100.0
3297,100.0
3298,100.0
3299,100.0
3300,100.0
3301,100.0
3302,100.0
3303,100.0
3304,100.0
3305,100.0
3306,100.0
3307,100.0
3308,100.0
3309,100.0
3310,100.0
3311,100.0
3312,100.0
3313,100.0
3314,100.0
3315,100.0
3316,100.0
3317,100.0
3318,100.0
3319,100.0
3320,100.0
3321,100.0
3322,100.0
3323,100.0
3324,100.0
3325,100.0
3326,100.0
3327,100.0
3328,100.0
3329,100.0
3330,100.0
3331,100.0
3332,100.0
3333,100.0
3334,100.0
3335,100.0
3336,100.0
3337,-0.0
3338,100.0
3339,100.0
3340,100.0
3341,100.0
3342,100.0
3343,100.0
3344,100.0
3345,100.0
3346,100.0
3347,100.0
3348,100.0
3349,100.0
3350,100.0
3351,100.0
3352,100.0
3353,100.0
3354,100.0
3355,100.0
3356,100.0
3357,100.0
3358,100.0
3359,100.0
3360,100.0
3361,100.0
3362,100.0
3363,100.0
3364,-0.0
3365,100.0
3366,100.0
3367,100.0
3368,100.0
3369,100.0
3370,100.0
3371,100.0
3372,-0.0
3373,100.0
3374,100.0
3375,100.0
3376,100.0
3377,100.0
3378,100.0
3379,100.0
3380,100.0
3381,100.0
3382,100.0
3383,100.0
3384,100.0
3385,100.0
3386,100.0
3387,100.0
3388,100.0
3389,100.0
3390,100.0
3391,100.0
3392,100.0
3393,100.0
3394,100.0
3395,100.0
3396,-0.0
3397,100.0
3398,100.0
3399,100.0
3400,100.0
3401,100.0
3402,100.0
3403,100.0
3404,100.0
3405,100.0
3406,100.0
3407,100.0
3408,100.0
3409,100.0
3410,100.0
3411,100.0
3412,100.0
3413,100.0
3414,100.0
3415,100.0
3416,100.0
3417,100.0
3418,100.0
3419,100.0
3420,100.0
3421,100.0
3422,100.0
3423,100.0
3424,100.0
3425,100.0
3426,100.0
3427,100.0
3428,100.0
3429,100.0
3430,100.0
3431,100.0
3432,100.0
3433,100.0
3434,100.0
3435,100.0
3436,100.0
3437,100.0
3438,100.0
3439,100.0
3440,100.0
3441,100.0
3442,100.0
3443,100.0
3444,100.0
3445,100.0
3446,100.0
3447,100.0
3448,100.0
3449,100.0
3450,100.0
3451,100.0
3452,100.0
3453,100.0
3454,100.0
3455,100.0
3456,100.0
3457,100.0
3458,100.0
3459,100.0
3460,100.0
3461,-0.0
3462,100.0
3463,100.0
3464,100.0
3465,100.0
3466,100.0
3467,100.0
3468,100.0
3469,100.0
3470,100.0
3471,100.0
3472,100.0
3473,100.0
3474,100.0
3475,100.0
3476,100.0
3477,100.0
3478,100.0
3479,100.0
3480,100.0
3481,-0.0
3482,100.0
3483,100.0
3484,100.0
3485,100.0
3486,100.0
3487,100.0
3488,100.0
3489,100.0
3490,100.0
3491,100.0
3492,100.0
3493,100.0
3494,100.0
3495,100.0
3496,100.0
3497,100.0
3498,100.0
3499,100.0
3500,100.0
3501,100.0
3502,100.0
3503,100.0
3504,100.0
3505,100.0
3506,100.0
3507,100.0
3508,100.0
3509,100.0
3510,100.0
3511,100.0
3512,100.0
3513,100.0
3514,100.0
3515,100.0
3516,100.0
3517,100.0
3518,100.0
3519,100.0
3520,100.0
3521,100.0
3522,100.0
3523,100.0
3524,100.0
3525,100.0
3526,100.0
3527,100.0
3528,100.0
3529,100.0
3530,100.0
3531,100.0
3532,100.0
3533,100.0
3534,100.0
3535,100.0
3536,100.0
3537,100.0
3538,100.0
3539,100.0
3540,100.0
3541,100.0
3542,100.0
3543,100.0
3544,100.0
3545,100.0
3546,100.0
3547,-0.0
3548,100.0
3549,100.0
3550,100.0
3551,100.0
3552,100.0
3553,100.0
3554,100.0
3555,100.0
3556,100.0
3557,100.0
3558,100.0
3559,-0.0
3560,100.0
3561,100.0
3562,100.0
3563,100.0
3564,-0.0
3565,100.0
3566,-0.0
3567,100.0
3568,100.0
3569,100.0
3570,100.0
3571,100.0
3572,100.0
3573,-0.0
3574,100.0
3575,100.0
3576,100.0
3577,100.0
3578,100.0
3579,-0.0
3580,100.0
3581,100.0
3582,100.0
3583,-0.0
3584,100.0
3585,100.0
3586,100.0
3587,100.0
3588,100.0
3589,100.0
3590,100.0
3591,100.0
3592,100.0
3593,100.0
3594,100.0
3595,100.0
3596,100.0
3597,100.0
3598,100.0
3599,100.0
3600,100.0
3601,100.0
3602,100.0
3603,100.0
3604,100.0
3605,100.0
3606,100.0
3607,100.0
3608,100.0
3609,100.0
3610,100.0
3611,100.0
3612,100.0
3613,-0.0
3614,100.0
3615,100.0
3616,100.0
3617,100.0
3618,100.0
3619,100.0
3620,100.0
3621,100.0
3622,-0.0
3623,100.0
3624,100.0
3625,100.0
3626,100.0
3627,100.0
3628,100.0
3629,100.0
3630,100.0
3631,100.0
3632,100.0
3633,100.0
3634,100.0
3635,100.0
3636,100.0
3637,100.0
3638,100.0
3639,100.0
3640,100.0
3641,100.0
3642,100.0
3643,100.0
3644,100.0
3645,100.0
3646,100.0
3647,100.0
3648,100.0
3649,100.0
3650,100.0
3651,100.0
3652,100.0
3653,100.0
3654,100.0
3655,100.0
3656,100.0
3657,100.0
3658,100.0
3659,100.0
3660,-0.0
3661,100.0
3662,-0.0
3663,100.0
3664,100.0
3665,100.0
3666,100.0
3667,100.0
3668,100.0
3669,100.0
3670,-0.0
3671,100.0
3672,-0.0
3673,100.0
3674,100.0
3675,100.0
3676,100.0
3677,100.0
3678,100.0
3679,100.0
3680,100.0
3681,100.0
3682,-0.0
3683,100.0
3684,100.0
3685,100.0
3686,100.0
3687,100.0
3688,100.0
3689,100.0
3690,100.0
3691,100.0
3692,100.0
3693,100.0
3694,100.0
3695,100.0
3696,100.0
3697,100.0
