,ID,Name
0,PFK,Phosphofructokinase
1,PFL,Pyruvate formate lyase
2,PGI,Glucose-6-phosphate isomerase
3,PGK,Phosphoglycerate kinase
4,PGL,6-phosphogluconolactonase
5,ACALD,Acetaldehyde dehydrogenase (acetylating)
6,AKGt2r,2 oxoglutarate reversible transport via symport
7,PGM,Phosphoglycerate mutase
8,PIt2r,Phosphate reversible transport via symport
9,ALCD2x,Alcohol dehydrogenase (ethanol)
10,ACALDt,Acetaldehyde reversible transport
11,ACKr,Acetate kinase
12,PPC,Phosphoenolpyruvate carboxylase
13,ACONTa,"Aconitase (half-reaction A, Citrate hydro-lyase)"
14,ACONTb,"Aconitase (half-reaction B, Isocitrate hydro-lyase)"
15,ATPM,ATP maintenance requirement
16,PPCK,Phosphoenolpyruvate carboxykinase
17,ACt2r,Acetate reversible transport via proton symport
18,PPS,Phosphoenolpyruvate synthase
19,ADK1,Adenylate kinase
20,AKGDH,2-Oxogluterate dehydrogenase
21,ATPS4r,ATP synthase (four protons for one ATP)
22,PTAr,Phosphotransacetylase
23,PYK,Pyruvate kinase
24,BIOMASS_Ecoli_core_w_GAM,Biomass Objective Function with GAM
25,PYRt2,Pyruvate transport in via proton symport
26,CO2t,CO2 transporter via diffusion
27,RPE,Ribulose 5-phosphate 3-epimerase
28,CS,Citrate synthase
29,RPI,Ribose-5-phosphate isomerase
30,SUCCt2_2,Succinate transport via proton symport (2 H)
31,CYTBD,Cytochrome oxidase bd (ubiquinol-8: 2 protons)
32,D_LACt2,D lactate transport via proton symport
33,ENO,Enolase
34,SUCCt3,Succinate transport out via proton antiport
35,ETOHt2r,Ethanol reversible transport via proton symport
36,SUCDi,Succinate dehydrogenase (irreversible)
37,SUCOAS,Succinyl-CoA synthetase (ADP-forming)
38,TALA,Transaldolase
39,THD2,NAD(P) transhydrogenase
40,TKT1,Transketolase
41,TKT2,Transketolase
42,TPI,Triose-phosphate isomerase
43,EX_ac_e,Acetate exchange
44,EX_acald_e,Acetaldehyde exchange
45,EX_akg_e,2-Oxoglutarate exchange
46,EX_co2_e,CO2 exchange
47,EX_etoh_e,Ethanol exchange
48,EX_for_e,Formate exchange
49,EX_fru_e,D-Fructose exchange
50,EX_fum_e,Fumarate exchange
51,EX_glc__D_e,D-Glucose exchange
52,EX_gln__L_e,L-Glutamine exchange
53,EX_glu__L_e,L-Glutamate exchange
54,EX_h_e,H+ exchange
55,EX_h2o_e,H2O exchange
56,EX_lac__D_e,D-lactate exchange
57,EX_mal__L_e,L-Malate exchange
58,EX_nh4_e,Ammonia exchange
59,EX_o2_e,O2 exchange
60,EX_pi_e,Phosphate exchange
61,EX_pyr_e,Pyruvate exchange
62,EX_succ_e,Succinate exchange
63,FBA,Fructose-bisphosphate aldolase
64,FBP,Fructose-bisphosphatase
65,FORt2,Formate transport in via proton symport
66,FORt,Formate transport via diffusion
67,FRD7,Fumarate reductase
68,FRUpts2,Fructose transport via PEP:Pyr PTS (f6p generating)
69,FUM,Fumarase
70,FUMt2_2,Fumarate transport via proton symport (2 H)
71,G6PDH2r,Glucose 6-phosphate dehydrogenase
72,GAPD,Glyceraldehyde-3-phosphate dehydrogenase
73,GLCpts,D-glucose transport via PEP:Pyr PTS
74,GLNS,Glutamine synthetase
75,GLNabc,L-glutamine transport via ABC system
76,GLUDy,Glutamate dehydrogenase (NADP)
77,GLUN,Glutaminase
78,GLUSy,Glutamate synthase (NADPH)
79,GLUt2r,L glutamate transport via proton symport  reversible
80,GND,Phosphogluconate dehydrogenase
81,H2Ot,H2O transport via diffusion
82,ICDHyr,Isocitrate dehydrogenase (NADP)
83,ICL,Isocitrate lyase
84,LDH_D,D-lactate dehydrogenase
85,MALS,Malate synthase
86,MALt2_2,Malate transport via proton symport (2 H)
87,MDH,Malate dehydrogenase
88,ME1,Malic enzyme (NAD)
89,ME2,Malic enzyme (NADP)
90,NADH16,NADH dehydrogenase (ubiquinone-8 & 3 protons)
91,NADTRHD,NAD transhydrogenase
92,NH4t,Ammonia reversible transport
93,O2t,O2 transport  diffusion 
94,PDH,Pyruvate dehydrogenase
