,0
0,0
1,1
2,2
3,3
4,3
5,4
6,4
7,5
8,5
9,6
10,6
11,7
12,7
13,8
14,9
15,9
16,10
17,11
18,12
19,12
20,13
21,14
22,14
23,15
24,15
25,16
26,17
27,18
28,19
29,19
30,20
31,21
32,22
33,22
34,23
35,24
36,25
37,26
38,26
39,27
40,28
41,28
42,29
43,30
44,31
45,32
46,32
47,33
48,33
49,34
50,35
51,36
52,37
53,38
54,39
55,40
56,40
57,41
58,41
59,42
60,43
61,44
62,45
63,45
64,46
65,46
66,47
67,47
68,48
69,49
70,49
71,50
72,50
73,51
74,51
75,52
76,53
77,53
78,54
79,55
80,55
81,56
82,57
83,57
84,58
85,59
86,59
87,60
88,61
89,62
90,63
91,64
92,65
93,66
94,66
95,67
96,68
97,69
98,70
99,70
100,71
101,72
102,73
103,74
104,75
105,76
106,77
107,77
108,78
109,79
110,80
111,80
112,81
113,81
114,82
115,82
116,83
117,83
118,84
119,84
120,85
121,85
122,86
123,86
124,87
125,87
126,88
127,88
128,89
129,89
130,90
131,90
132,91
133,91
134,92
135,92
136,93
137,93
138,94
139,94
140,95
141,96
142,96
143,97
144,98
145,98
146,99
147,99
148,100
149,101
150,101
151,102
152,102
153,103
154,103
155,104
156,104
157,105
158,105
159,106
160,106
161,107
162,107
163,108
164,108
165,109
166,109
167,110
168,110
169,111
170,111
171,112
172,112
173,113
174,113
175,114
176,114
177,115
178,115
179,116
180,116
181,117
182,117
183,118
184,119
185,119
186,120
187,120
188,121
189,121
190,122
191,123
192,123
193,124
194,125
195,125
196,126
197,126
198,127
199,127
200,128
201,128
202,129
203,130
204,130
205,131
206,132
207,133
208,133
209,134
210,135
211,136
212,137
213,137
214,138
215,139
216,139
217,140
218,140
219,141
220,141
221,142
222,143
223,143
224,144
225,144
226,145
227,145
228,146
229,147
230,148
231,149
232,150
233,151
234,152
235,153
236,154
237,154
238,155
239,156
240,157
241,157
242,158
243,158
244,159
245,159
246,160
247,160
248,161
249,161
250,162
251,162
252,163
253,163
254,164
255,164
256,165
257,165
258,166
259,166
260,167
261,167
262,168
263,168
264,169
265,170
266,170
267,171
268,172
269,173
270,174
271,175
272,175
273,176
274,177
275,177
276,178
277,179
278,180
279,180
280,181
281,181
282,182
283,182
284,183
285,183
286,184
287,185
288,186
289,186
290,187
291,188
292,188
293,189
294,190
295,190
296,191
297,192
298,192
299,193
300,194
301,194
302,195
303,195
304,196
305,197
306,198
307,199
308,200
309,201
310,201
311,202
312,203
313,203
314,204
315,205
316,205
317,206
318,206
319,207
320,208
321,209
322,209
323,210
324,211
325,211
326,212
327,212
328,213
329,214
330,214
331,215
332,215
333,216
334,216
335,217
336,217
337,218
338,218
339,219
340,219
341,220
342,221
343,222
344,223
345,223
346,224
347,225
348,225
349,226
350,227
351,227
352,228
353,228
354,229
355,229
356,230
357,231
358,232
359,233
360,233
361,234
362,235
363,235
364,236
365,237
366,238
367,239
368,240
369,241
370,241
371,242
372,242
373,243
374,244
375,245
376,246
377,247
378,248
379,249
380,250
381,251
382,252
383,252
384,253
385,253
386,254
387,254
388,255
389,256
390,256
391,257
392,258
393,258
394,259
395,260
396,260
397,261
398,261
399,262
400,263
401,264
402,265
403,266
404,267
405,268
406,269
407,270
408,270
409,271
410,272
411,272
412,273
413,274
414,275
415,275
416,276
417,276
418,277
419,278
420,279
421,280
422,280
423,281
424,281
425,282
426,282
427,283
428,283
429,284
430,285
431,286
432,287
433,288
434,288
435,289
436,290
437,291
438,291
439,292
440,293
441,294
442,294
443,295
444,296
445,297
446,297
447,298
448,299
449,299
450,300
451,301
452,302
453,303
454,303
455,304
456,304
457,305
458,305
459,306
460,306
461,307
462,307
463,308
464,309
465,310
466,311
467,312
468,313
469,314
470,315
471,316
472,317
473,318
474,319
475,320
476,321
477,322
478,322
479,323
480,324
481,324
482,325
483,325
484,326
485,326
486,327
487,327
488,328
489,329
490,329
491,330
492,330
493,331
494,332
495,333
496,334
497,334
498,335
499,335
500,336
501,336
502,337
503,338
504,339
505,340
506,341
507,342
508,343
509,344
510,345
511,346
512,347
513,347
514,348
515,349
516,350
517,351
518,351
519,352
520,353
521,353
522,354
523,355
524,356
525,357
526,358
527,359
528,360
529,361
530,362
531,363
532,364
533,365
534,365
535,366
536,367
537,367
538,368
539,369
540,370
541,371
542,372
543,372
544,373
545,373
546,374
547,375
548,375
549,376
550,376
551,377
552,378
553,378
554,379
555,380
556,380
557,381
558,382
559,382
560,383
561,383
562,384
563,385
564,386
565,387
566,388
567,389
568,389
569,390
570,390
571,391
572,391
573,392
574,393
575,393
576,394
577,395
578,396
579,397
580,398
581,399
582,400
583,401
584,402
585,403
586,404
587,405
588,406
589,407
590,408
591,409
592,410
593,411
594,412
595,412
596,413
597,413
598,414
599,415
600,416
601,417
602,418
603,418
604,419
605,420
606,420
607,421
608,422
609,422
610,423
611,424
612,425
613,426
614,427
615,427
616,428
617,429
618,430
619,431
620,432
621,432
622,433
623,433
624,434
625,434
626,435
627,436
628,437
629,438
630,439
631,440
632,440
633,441
634,442
635,443
636,444
637,444
638,445
639,446
640,447
641,448
642,449
643,450
644,451
645,452
646,452
647,453
648,453
649,454
650,454
651,455
652,456
653,457
654,458
655,458
656,459
657,459
658,460
659,460
660,461
661,461
662,462
663,463
664,464
665,465
666,466
667,467
668,468
669,468
670,469
671,469
672,470
673,470
674,471
675,471
676,472
677,472
678,473
679,474
680,474
681,475
682,476
683,476
684,477
685,478
686,479
687,480
688,481
689,482
690,483
691,484
692,484
693,485
694,486
695,487
696,488
697,489
698,490
699,491
700,492
701,493
702,494
703,494
704,495
705,496
706,497
707,498
708,499
709,499
710,500
711,501
712,502
713,503
714,504
715,505
716,506
717,507
718,508
719,509
720,510
721,511
722,512
723,513
724,514
725,515
726,516
727,516
728,517
729,518
730,519
731,520
732,521
733,522
734,523
735,524
736,525
737,525
738,526
739,526
740,527
741,528
742,529
743,530
744,531
745,531
746,532
747,533
748,533
749,534
750,535
751,535
752,536
753,537
754,538
755,539
756,539
757,540
758,541
759,541
760,542
761,542
762,543
763,544
764,544
765,545
766,546
767,546
768,547
769,547
770,548
771,549
772,550
773,550
774,551
775,552
776,553
777,554
778,555
779,556
780,557
781,558
782,558
783,559
784,560
785,561
786,562
787,562
788,563
789,564
790,565
791,566
792,567
793,568
794,569
795,569
796,570
797,571
798,572
799,573
800,574
801,574
802,575
803,575
804,576
805,577
806,578
807,579
808,580
809,581
810,582
811,583
812,583
813,584
814,585
815,585
816,586
817,587
818,587
819,588
820,588
821,589
822,590
823,590
824,591
825,592
826,592
827,593
828,594
829,595
830,596
831,597
832,597
833,598
834,599
835,600
836,601
837,601
838,602
839,603
840,603
841,604
842,605
843,605
844,606
845,607
846,608
847,609
848,610
849,611
850,611
851,612
852,613
853,613
854,614
855,614
856,615
857,615
858,616
859,617
860,617
861,618
862,619
863,620
864,621
865,621
866,622
867,622
868,623
869,623
870,624
871,625
872,625
873,626
874,627
875,627
876,628
877,629
878,630
879,630
880,631
881,631
882,632
883,632
884,633
885,633
886,634
887,634
888,635
889,636
890,637
891,638
892,639
893,640
894,641
895,642
896,642
897,643
898,644
899,644
900,645
901,646
902,647
903,647
904,648
905,648
906,649
907,649
908,650
909,650
910,651
911,651
912,652
913,653
914,654
915,655
916,655
917,656
918,657
919,658
920,658
921,659
922,660
923,660
924,661
925,662
926,662
927,663
928,664
929,664
930,665
931,666
932,667
933,668
934,668
935,669
936,669
937,670
938,671
939,671
940,672
941,672
942,673
943,674
944,675
945,676
946,677
947,678
948,679
949,680
950,680
951,681
952,681
953,682
954,682
955,683
956,684
957,684
958,685
959,685
960,686
961,687
962,687
963,688
964,688
965,689
966,689
967,690
968,691
969,691
970,692
971,692
972,693
973,693
974,694
975,695
976,696
977,697
978,698
979,699
980,700
981,700
982,701
983,701
984,702
985,702
986,703
987,704
988,704
989,705
990,706
991,706
992,707
993,707
994,708
995,709
996,710
997,710
998,711
999,711
1000,712
1001,712
1002,713
1003,713
1004,714
1005,714
1006,715
1007,715
1008,716
1009,716
1010,717
1011,717
1012,718
1013,718
1014,719
1015,719
1016,720
1017,720
1018,721
1019,721
1020,722
1021,722
1022,723
1023,723
1024,724
1025,724
1026,725
1027,726
1028,727
1029,728
1030,729
1031,729
1032,730
1033,730
1034,731
1035,731
1036,732
1037,732
1038,733
1039,734
1040,734
1041,735
1042,735
1043,736
1044,737
1045,737
1046,738
1047,739
1048,739
1049,740
1050,741
1051,741
1052,742
1053,742
1054,743
1055,743
1056,744
1057,745
1058,746
1059,747
1060,747
1061,748
1062,749
1063,750
1064,751
1065,752
1066,753
1067,753
1068,754
1069,754
1070,755
1071,755
1072,756
1073,756
1074,757
1075,757
1076,758
1077,759
1078,759
1079,760
1080,761
1081,761
1082,762
1083,762
1084,763
1085,763
1086,764
1087,765
1088,766
1089,767
1090,768
1091,768
1092,769
1093,770
1094,771
1095,772
1096,772
1097,773
1098,773
1099,774
1100,775
1101,775
1102,776
1103,776
1104,777
1105,778
1106,779
1107,780
1108,780
1109,781
1110,781
1111,782
1112,782
1113,783
1114,783
1115,784
1116,785
1117,786
1118,787
1119,787
1120,788
1121,788
1122,789
1123,790
1124,790
1125,791
1126,791
1127,792
1128,793
1129,793
1130,794
1131,795
1132,796
1133,796
1134,797
1135,797
1136,798
1137,798
1138,799
1139,799
1140,800
1141,800
1142,801
1143,801
1144,802
1145,803
1146,803
1147,804
1148,805
1149,805
1150,806
1151,806
1152,807
1153,807
1154,808
1155,809
1156,810
1157,811
1158,811
1159,812
1160,813
1161,814
1162,814
1163,815
1164,816
1165,816
1166,817
1167,818
1168,818
1169,819
1170,819
1171,820
1172,821
1173,822
1174,822
1175,823
1176,824
1177,824
1178,825
1179,826
1180,827
1181,827
1182,828
1183,828
1184,829
1185,830
1186,831
1187,831
1188,832
1189,833
1190,833
1191,834
1192,834
1193,835
1194,835
1195,836
1196,836
1197,837
1198,837
1199,838
1200,838
1201,839
1202,839
1203,840
1204,840
1205,841
1206,842
1207,842
1208,843
1209,843
1210,844
1211,844
1212,845
1213,845
1214,846
1215,846
1216,847
1217,847
1218,848
1219,848
1220,849
1221,849
1222,850
1223,850
1224,851
1225,852
1226,852
1227,853
1228,853
1229,854
1230,855
1231,855
1232,856
1233,857
1234,858
1235,859
1236,859
1237,860
1238,860
1239,861
1240,861
1241,862
1242,863
1243,864
1244,865
1245,866
1246,867
1247,868
1248,869
1249,869
1250,870
1251,870
1252,871
1253,871
1254,872
1255,873
1256,873
1257,874
1258,875
1259,876
1260,877
1261,877
1262,878
1263,879
1264,880
1265,881
1266,882
1267,883
1268,883
1269,884
1270,885
1271,886
1272,887
1273,887
1274,888
1275,889
1276,890
1277,891
1278,892
1279,892
1280,893
1281,893
1282,894
1283,894
1284,895
1285,895
1286,896
1287,896
1288,897
1289,897
1290,898
1291,898
1292,899
1293,899
1294,900
1295,900
1296,901
1297,901
1298,902
1299,903
1300,904
1301,905
1302,906
1303,907
1304,908
1305,909
1306,909
1307,910
1308,910
1309,911
1310,911
1311,912
1312,913
1313,913
1314,914
1315,914
1316,915
1317,915
1318,916
1319,916
1320,917
1321,917
1322,918
1323,918
1324,919
1325,920
1326,921
1327,921
1328,922
1329,922
1330,923
1331,923
1332,924
1333,925
1334,926
1335,927
1336,928
1337,928
1338,929
1339,929
1340,930
1341,930
1342,931
1343,931
1344,932
1345,932
1346,933
1347,933
1348,934
1349,934
1350,935
1351,935
1352,936
1353,937
1354,938
1355,939
1356,939
1357,940
1358,940
1359,941
1360,942
1361,943
1362,943
1363,944
1364,945
1365,946
1366,946
1367,947
1368,947
1369,948
1370,949
1371,949
1372,950
1373,950
1374,951
1375,952
1376,953
1377,954
1378,954
1379,955
1380,956
1381,956
1382,957
1383,958
1384,958
1385,959
1386,960
1387,961
1388,961
1389,962
1390,962
1391,963
1392,963
1393,964
1394,964
1395,965
1396,965
1397,966
1398,966
1399,967
1400,968
1401,969
1402,969
1403,970
1404,970
1405,971
1406,971
1407,972
1408,972
1409,973
1410,973
1411,974
1412,974
1413,975
1414,975
1415,976
1416,976
1417,977
1418,978
1419,979
1420,980
1421,981
1422,982
1423,983
1424,984
1425,984
1426,985
1427,985
1428,986
1429,987
1430,988
1431,988
1432,989
1433,990
1434,991
1435,991
1436,992
1437,992
1438,993
1439,993
1440,994
1441,994
1442,995
1443,995
1444,996
1445,997
1446,997
1447,998
1448,998
1449,999
1450,999
1451,1000
1452,1001
1453,1001
1454,1002
1455,1002
1456,1003
1457,1004
1458,1004
1459,1005
1460,1005
1461,1006
1462,1006
1463,1007
1464,1008
1465,1009
1466,1010
1467,1010
1468,1011
1469,1011
1470,1012
1471,1013
1472,1014
1473,1015
1474,1016
1475,1017
1476,1018
1477,1019
1478,1019
1479,1020
1480,1021
1481,1021
1482,1022
1483,1022
1484,1023
1485,1023
1486,1024
1487,1024
1488,1025
1489,1025
1490,1026
1491,1027
1492,1028
1493,1029
1494,1030
1495,1031
1496,1032
1497,1032
1498,1033
1499,1034
1500,1035
1501,1036
1502,1037
1503,1037
1504,1038
1505,1038
1506,1039
1507,1039
1508,1040
1509,1041
1510,1042
1511,1042
1512,1043
1513,1043
1514,1044
1515,1045
1516,1046
1517,1046
1518,1047
1519,1047
1520,1048
1521,1048
1522,1049
1523,1050
1524,1050
1525,1051
1526,1051
1527,1052
1528,1053
1529,1053
1530,1054
1531,1054
1532,1055
1533,1055
1534,1056
1535,1057
1536,1058
1537,1058
1538,1059
1539,1059
1540,1060
1541,1060
1542,1061
1543,1062
1544,1063
1545,1064
1546,1065
1547,1065
1548,1066
1549,1066
1550,1067
1551,1067
1552,1068
1553,1068
1554,1069
1555,1070
1556,1071
1557,1072
1558,1073
1559,1074
1560,1075
1561,1075
1562,1076
1563,1077
1564,1077
1565,1078
1566,1079
1567,1079
1568,1080
1569,1080
1570,1081
1571,1081
1572,1082
1573,1082
1574,1083
1575,1084
1576,1085
1577,1086
1578,1086
1579,1087
1580,1088
1581,1089
1582,1090
1583,1091
1584,1092
1585,1092
1586,1093
1587,1093
1588,1094
1589,1094
1590,1095
1591,1096
1592,1097
1593,1097
1594,1098
1595,1098
1596,1099
1597,1099
1598,1100
1599,1101
1600,1101
1601,1102
1602,1103
1603,1104
1604,1105
1605,1106
1606,1107
1607,1107
1608,1108
1609,1108
1610,1109
1611,1109
1612,1110
1613,1111
1614,1111
1615,1112
1616,1113
1617,1114
1618,1115
1619,1116
1620,1117
1621,1118
1622,1119
1623,1120
1624,1121
1625,1121
1626,1122
1627,1122
1628,1123
1629,1123
1630,1124
1631,1125
1632,1126
1633,1127
1634,1128
1635,1128
1636,1129
1637,1130
1638,1131
1639,1131
1640,1132
1641,1132
1642,1133
1643,1134
1644,1135
1645,1136
1646,1137
1647,1138
1648,1139
1649,1139
1650,1140
1651,1141
1652,1142
1653,1142
1654,1143
1655,1144
1656,1145
1657,1146
1658,1147
1659,1148
1660,1148
1661,1149
1662,1150
1663,1151
1664,1152
1665,1153
1666,1154
1667,1154
1668,1155
1669,1155
1670,1156
1671,1156
1672,1157
1673,1157
1674,1158
1675,1158
1676,1159
1677,1159
1678,1160
1679,1161
1680,1162
1681,1163
1682,1164
1683,1165
1684,1166
1685,1167
1686,1168
1687,1169
1688,1170
1689,1170
1690,1171
1691,1172
1692,1173
1693,1174
1694,1175
1695,1175
1696,1176
1697,1177
1698,1178
1699,1179
1700,1179
1701,1180
1702,1181
1703,1182
1704,1183
1705,1184
1706,1185
1707,1186
1708,1187
1709,1188
1710,1189
1711,1190
1712,1190
1713,1191
1714,1192
1715,1193
1716,1194
1717,1195
1718,1196
1719,1197
1720,1198
1721,1199
1722,1200
1723,1201
1724,1201
1725,1202
1726,1202
1727,1203
1728,1204
1729,1205
1730,1206
1731,1207
1732,1207
1733,1208
1734,1209
1735,1209
1736,1210
1737,1211
1738,1212
1739,1213
1740,1214
1741,1215
1742,1215
1743,1216
1744,1217
1745,1218
1746,1219
1747,1220
1748,1221
1749,1222
1750,1223
1751,1224
1752,1224
1753,1225
1754,1226
1755,1226
1756,1227
1757,1227
1758,1228
1759,1229
1760,1230
1761,1230
1762,1231
1763,1232
1764,1233
1765,1234
1766,1235
1767,1235
1768,1236
1769,1237
1770,1238
1771,1239
1772,1239
1773,1240
1774,1241
1775,1242
1776,1243
1777,1244
1778,1244
1779,1245
1780,1245
1781,1246
1782,1247
1783,1248
1784,1249
1785,1250
1786,1251
1787,1252
1788,1253
1789,1254
1790,1254
1791,1255
1792,1256
1793,1257
1794,1257
1795,1258
1796,1259
1797,1259
1798,1260
1799,1261
1800,1262
1801,1263
1802,1264
1803,1264
1804,1265
1805,1265
1806,1266
1807,1266
1808,1267
1809,1267
1810,1268
1811,1269
1812,1270
1813,1270
1814,1271
1815,1271
1816,1272
1817,1273
1818,1273
1819,1274
1820,1275
1821,1276
1822,1277
1823,1277
1824,1278
1825,1278
1826,1279
1827,1279
1828,1280
1829,1281
1830,1282
1831,1283
1832,1284
1833,1285
1834,1286
1835,1287
1836,1287
1837,1288
1838,1289
1839,1290
1840,1291
1841,1292
1842,1293
1843,1293
1844,1294
1845,1295
1846,1296
1847,1296
1848,1297
1849,1298
1850,1298
1851,1299
1852,1299
1853,1300
1854,1300
1855,1301
1856,1302
1857,1303
1858,1304
1859,1305
1860,1306
1861,1306
1862,1307
1863,1307
1864,1308
1865,1308
1866,1309
1867,1309
1868,1310
1869,1310
1870,1311
1871,1311
1872,1312
1873,1312
1874,1313
1875,1313
1876,1314
1877,1315
1878,1316
1879,1317
1880,1317
1881,1318
1882,1318
1883,1319
1884,1319
1885,1320
1886,1320
1887,1321
1888,1322
1889,1322
1890,1323
1891,1324
1892,1325
1893,1326
1894,1327
1895,1328
1896,1329
1897,1330
1898,1331
1899,1332
1900,1333
1901,1334
1902,1335
1903,1335
1904,1336
1905,1336
1906,1337
1907,1338
1908,1338
1909,1339
1910,1339
1911,1340
1912,1340
1913,1341
1914,1342
1915,1343
1916,1344
1917,1345
1918,1346
1919,1347
1920,1348
1921,1349
1922,1350
1923,1350
1924,1351
1925,1351
1926,1352
1927,1353
1928,1354
1929,1354
1930,1355
1931,1355
1932,1356
1933,1356
1934,1357
1935,1357
1936,1358
1937,1359
1938,1359
1939,1360
1940,1361
1941,1361
1942,1362
1943,1362
1944,1363
1945,1364
1946,1364
1947,1365
1948,1366
1949,1366
1950,1367
1951,1367
1952,1368
1953,1368
1954,1369
1955,1370
1956,1370
1957,1371
1958,1371
1959,1372
1960,1373
1961,1373
1962,1374
1963,1374
1964,1375
1965,1375
1966,1376
1967,1377
1968,1378
1969,1378
1970,1379
1971,1380
1972,1381
1973,1382
1974,1383
1975,1384
1976,1384
1977,1385
1978,1385
1979,1386
1980,1387
1981,1387
1982,1388
1983,1389
1984,1390
1985,1390
1986,1391
1987,1391
1988,1392
1989,1392
1990,1393
1991,1394
1992,1395
1993,1396
1994,1396
1995,1397
1996,1398
1997,1399
1998,1400
1999,1402
2000,1403
2001,1404
2002,1404
2003,1405
2004,1406
2005,1407
2006,1407
2007,1408
2008,1409
2009,1409
2010,1410
2011,1411
2012,1412
2013,1413
2014,1413
2015,1414
2016,1415
2017,1415
2018,1416
2019,1417
2020,1417
2021,1418
2022,1419
2023,1420
2024,1420
2025,1421
2026,1421
2027,1422
2028,1422
2029,1423
2030,1424
2031,1424
2032,1425
2033,1425
2034,1426
2035,1427
2036,1428
2037,1428
2038,1429
2039,1429
2040,1430
2041,1431
2042,1432
2043,1433
2044,1433
2045,1434
2046,1435
2047,1435
2048,1436
2049,1437
2050,1437
2051,1438
2052,1439
2053,1439
2054,1440
2055,1441
2056,1441
2057,1442
2058,1443
2059,1443
2060,1444
2061,1444
2062,1445
2063,1446
2064,1446
2065,1447
2066,1448
2067,1448
2068,1449
2069,1449
2070,1450
2071,1451
2072,1452
2073,1453
2074,1453
2075,1454
2076,1455
2077,1455
2078,1456
2079,1457
2080,1457
2081,1458
2082,1459
2083,1459
2084,1460
2085,1461
2086,1461
2087,1462
2088,1462
2089,1463
2090,1463
2091,1464
2092,1465
2093,1465
2094,1466
2095,1467
2096,1468
2097,1468
2098,1469
2099,1469
2100,1470
2101,1470
2102,1471
2103,1472
2104,1472
2105,1473
2106,1473
2107,1474
2108,1474
2109,1475
2110,1475
2111,1476
2112,1477
2113,1477
2114,1478
2115,1478
2116,1479
2117,1479
2118,1480
2119,1480
2120,1481
2121,1482
2122,1483
2123,1483
2124,1484
2125,1485
2126,1485
2127,1486
2128,1486
2129,1487
2130,1488
2131,1489
2132,1489
2133,1490
2134,1490
2135,1491
2136,1491
2137,1492
2138,1493
2139,1494
2140,1494
2141,1495
2142,1496
2143,1497
2144,1498
2145,1499
2146,1500
2147,1500
2148,1501
2149,1501
2150,1502
2151,1502
2152,1503
2153,1503
2154,1504
2155,1505
2156,1506
2157,1507
2158,1508
2159,1509
2160,1509
2161,1510
2162,1510
2163,1511
2164,1512
2165,1513
2166,1513
2167,1514
2168,1515
2169,1516
2170,1516
2171,1517
2172,1518
2173,1519
2174,1519
2175,1520
2176,1521
2177,1522
2178,1522
2179,1523
2180,1523
2181,1524
2182,1524
2183,1525
2184,1525
2185,1526
2186,1527
2187,1528
2188,1529
2189,1529
2190,1530
2191,1531
2192,1531
2193,1532
2194,1532
2195,1533
2196,1533
2197,1534
2198,1534
2199,1535
2200,1535
2201,1536
2202,1536
2203,1537
2204,1537
2205,1538
2206,1538
2207,1539
2208,1539
2209,1540
2210,1540
2211,1541
2212,1541
2213,1542
2214,1542
2215,1543
2216,1543
2217,1544
2218,1544
2219,1545
2220,1545
2221,1546
2222,1547
2223,1547
2224,1548
2225,1549
2226,1549
2227,1550
2228,1551
2229,1551
2230,1552
2231,1553
2232,1554
2233,1555
2234,1556
2235,1557
2236,1558
2237,1559
2238,1559
2239,1560
2240,1561
2241,1561
2242,1562
2243,1562
2244,1563
2245,1563
2246,1564
2247,1565
2248,1566
2249,1566
2250,1567
2251,1568
2252,1569
2253,1569
2254,1570
2255,1570
2256,1571
2257,1571
2258,1572
2259,1572
2260,1573
2261,1574
2262,1575
2263,1575
2264,1576
2265,1576
2266,1577
2267,1577
2268,1578
2269,1578
2270,1579
2271,1579
2272,1580
2273,1580
2274,1581
2275,1581
2276,1582
2277,1582
2278,1583
2279,1584
2280,1584
2281,1585
2282,1585
2283,1586
2284,1586
2285,1587
2286,1588
2287,1588
2288,1589
2289,1589
2290,1590
2291,1591
2292,1592
2293,1593
2294,1593
2295,1594
2296,1595
2297,1596
2298,1597
2299,1598
2300,1598
2301,1599
2302,1599
2303,1600
2304,1601
2305,1602
2306,1603
2307,1603
2308,1604
2309,1604
2310,1605
2311,1605
2312,1606
2313,1606
2314,1607
2315,1608
2316,1609
2317,1610
2318,1611
2319,1611
2320,1612
2321,1613
2322,1613
2323,1614
2324,1614
2325,1615
2326,1615
2327,1616
2328,1616
2329,1617
2330,1617
2331,1618
2332,1618
2333,1619
2334,1620
2335,1620
2336,1621
2337,1621
2338,1622
2339,1623
2340,1623
2341,1624
2342,1625
2343,1625
2344,1626
2345,1627
2346,1628
2347,1628
2348,1629
2349,1629
2350,1630
2351,1630
2352,1631
2353,1632
2354,1633
2355,1633
2356,1634
2357,1634
2358,1635
2359,1635
2360,1636
2361,1636
2362,1637
2363,1638
2364,1638
2365,1639
2366,1639
2367,1640
2368,1640
2369,1641
2370,1642
2371,1642
2372,1643
2373,1644
2374,1645
2375,1646
2376,1646
2377,1647
2378,1647
2379,1648
2380,1648
2381,1649
2382,1650
2383,1650
2384,1651
2385,1651
2386,1652
2387,1652
2388,1653
2389,1653
2390,1654
2391,1655
2392,1655
2393,1656
2394,1657
2395,1658
2396,1659
2397,1660
2398,1661
2399,1662
2400,1663
2401,1664
2402,1665
2403,1665
2404,1666
2405,1667
2406,1668
2407,1669
2408,1670
2409,1671
2410,1672
2411,1673
2412,1674
2413,1675
2414,1676
2415,1677
2416,1678
2417,1679
2418,1680
2419,1680
2420,1681
2421,1681
2422,1682
2423,1683
2424,1684
2425,1685
2426,1686
2427,1687
2428,1688
2429,1689
2430,1690
2431,1691
2432,1691
2433,1692
2434,1693
2435,1694
2436,1695
2437,1695
2438,1696
2439,1697
2440,1698
2441,1699
2442,1700
2443,1700
2444,1701
2445,1702
2446,1703
2447,1704
2448,1704
2449,1705
2450,1706
2451,1706
2452,1707
2453,1708
2454,1709
2455,1710
2456,1711
2457,1712
2458,1713
2459,1714
2460,1715
2461,1716
2462,1717
2463,1718
2464,1719
2465,1720
2466,1721
2467,1722
2468,1723
2469,1724
2470,1725
2471,1726
2472,1727
2473,1728
2474,1729
2475,1730
2476,1731
2477,1732
2478,1733
2479,1734
2480,1735
2481,1736
2482,1737
2483,1738
2484,1739
2485,1739
2486,1740
2487,1741
2488,1741
2489,1742
2490,1742
2491,1743
2492,1744
2493,1745
2494,1745
2495,1746
2496,1746
2497,1747
2498,1748
2499,1749
2500,1750
2501,1751
2502,1752
2503,1753
2504,1754
2505,1755
2506,1756
2507,1756
2508,1757
2509,1758
2510,1759
2511,1759
2512,1760
2513,1761
2514,1762
2515,1763
2516,1764
2517,1765
2518,1766
2519,1767
2520,1768
2521,1768
2522,1769
2523,1770
2524,1771
2525,1772
2526,1773
2527,1774
2528,1775
2529,1776
2530,1777
2531,1778
2532,1779
2533,1780
2534,1781
2535,1782
2536,1783
2537,1783
2538,1784
2539,1785
2540,1786
2541,1787
2542,1788
2543,1789
2544,1790
2545,1790
2546,1791
2547,1792
2548,1793
2549,1794
2550,1795
2551,1796
2552,1797
2553,1798
2554,1799
2555,1800
2556,1801
2557,1802
2558,1803
2559,1803
2560,1804
2561,1805
2562,1805
2563,1806
2564,1807
2565,1807
2566,1808
2567,1809
2568,1809
2569,1810
2570,1810
2571,1811
2572,1812
2573,1813
2574,1813
2575,1814
2576,1814
2577,1815
2578,1815
2579,1816
2580,1816
2581,1817
2582,1818
2583,1819
2584,1820
2585,1821
2586,1822
2587,1823
2588,1823
2589,1824
2590,1825
2591,1825
2592,1826
2593,1827
2594,1828
2595,1829
2596,1830
2597,1830
2598,1831
2599,1832
2600,1832
2601,1833
2602,1833
2603,1834
2604,1835
2605,1836
2606,1836
2607,1837
2608,1837
2609,1838
2610,1839
2611,1839
2612,1840
2613,1840
2614,1841
2615,1842
2616,1843
2617,1844
2618,1845
2619,1845
2620,1846
2621,1847
2622,1848
2623,1848
2624,1849
2625,1850
2626,1850
2627,1851
2628,1851
2629,1852
2630,1852
2631,1853
2632,1853
2633,1854
2634,1854
2635,1855
2636,1855
2637,1856
2638,1856
2639,1857
2640,1858
2641,1859
2642,1859
2643,1860
2644,1861
2645,1862
2646,1863
2647,1864
2648,1865
2649,1865
2650,1866
2651,1867
2652,1868
2653,1868
2654,1869
2655,1870
2656,1871
2657,1872
2658,1872
2659,1873
2660,1874
2661,1875
2662,1876
2663,1877
2664,1878
2665,1878
2666,1879
2667,1880
2668,1881
2669,1882
2670,1883
2671,1884
2672,1885
2673,1886
2674,1887
2675,1888
2676,1889
2677,1890
2678,1891
2679,1891
2680,1892
2681,1893
2682,1894
2683,1895
2684,1896
2685,1897
2686,1897
2687,1898
2688,1899
2689,1900
2690,1900
2691,1901
2692,1901
2693,1902
2694,1903
2695,1904
2696,1904
2697,1905
2698,1905
2699,1906
2700,1906
2701,1907
2702,1907
2703,1908
2704,1909
2705,1910
2706,1910
2707,1911
2708,1912
2709,1913
2710,1914
2711,1915
2712,1916
2713,1916
2714,1917
2715,1918
2716,1919
2717,1920
2718,1921
2719,1922
2720,1922
2721,1923
2722,1924
2723,1925
2724,1926
2725,1927
2726,1928
2727,1929
2728,1930
2729,1931
2730,1932
2731,1932
2732,1933
2733,1934
2734,1934
2735,1935
2736,1936
2737,1937
2738,1938
2739,1939
2740,1940
2741,1941
2742,1942
2743,1943
2744,1944
2745,1944
2746,1945
2747,1945
2748,1946
2749,1947
2750,1948
2751,1948
2752,1949
2753,1950
2754,1951
2755,1952
2756,1953
2757,1954
2758,1955
2759,1956
2760,1957
2761,1957
2762,1958
2763,1958
2764,1959
2765,1959
2766,1960
2767,1961
2768,1962
2769,1963
2770,1964
2771,1965
2772,1966
2773,1967
2774,1968
2775,1968
2776,1969
2777,1970
2778,1971
2779,1972
2780,1973
2781,1974
2782,1975
2783,1976
2784,1977
2785,1978
2786,1979
2787,1980
2788,1981
2789,1981
2790,1982
2791,1982
2792,1983
2793,1983
2794,1984
2795,1985
2796,1986
2797,1987
2798,1988
2799,1989
2800,1990
2801,1990
2802,1991
2803,1992
2804,1993
2805,1994
2806,1994
2807,1995
2808,1995
2809,1996
2810,1997
2811,1998
2812,1999
2813,2000
2814,2001
2815,2002
2816,2003
2817,2004
2818,2005
2819,2006
2820,2006
2821,2007
2822,2008
2823,2009
2824,2010
2825,2010
2826,2011
2827,2012
2828,2013
2829,2014
2830,2015
2831,2016
2832,2017
2833,2018
2834,2019
2835,2020
2836,2021
2837,2022
2838,2023
2839,2024
2840,2024
2841,2025
2842,2026
2843,2027
2844,2028
2845,2029
2846,2030
2847,2031
2848,2032
2849,2033
2850,2034
2851,2035
2852,2036
2853,2037
2854,2038
2855,2039
2856,2040
2857,2041
2858,2041
2859,2042
2860,2043
2861,2044
2862,2045
2863,2046
2864,2047
2865,2048
2866,2049
2867,2050
2868,2051
2869,2052
2870,2053
2871,2054
2872,2055
2873,2055
2874,2056
2875,2057
2876,2058
2877,2059
2878,2059
2879,2060
2880,2061
2881,2062
2882,2063
2883,2064
2884,2065
2885,2066
2886,2067
2887,2067
2888,2068
2889,2068
2890,2069
2891,2070
2892,2070
2893,2071
2894,2072
2895,2073
2896,2073
2897,2074
2898,2075
2899,2076
2900,2077
2901,2078
2902,2079
2903,2080
2904,2081
2905,2081
2906,2082
2907,2083
2908,2084
2909,2085
2910,2086
2911,2087
2912,2088
2913,2089
2914,2090
2915,2091
2916,2091
2917,2092
2918,2093
2919,2094
2920,2095
2921,2096
2922,2097
2923,2098
2924,2099
2925,2100
2926,2101
2927,2102
2928,2103
2929,2104
2930,2105
2931,2106
2932,2107
2933,2108
2934,2109
2935,2110
2936,2111
2937,2112
2938,2113
2939,2114
2940,2114
2941,2115
2942,2115
2943,2116
2944,2117
2945,2118
2946,2119
2947,2120
2948,2121
2949,2122
2950,2122
2951,2123
2952,2124
2953,2125
2954,2126
2955,2127
2956,2128
2957,2129
2958,2130
2959,2131
2960,2131
2961,2132
2962,2132
2963,2133
2964,2134
2965,2135
2966,2136
2967,2137
2968,2138
2969,2139
2970,2140
2971,2141
2972,2142
2973,2142
2974,2143
2975,2144
2976,2145
2977,2146
2978,2147
2979,2148
2980,2149
2981,2150
2982,2150
2983,2151
2984,2151
2985,2152
2986,2152
2987,2153
2988,2153
2989,2154
2990,2155
2991,2156
2992,2157
2993,2158
2994,2158
2995,2159
2996,2160
2997,2161
2998,2162
2999,2163
3000,2163
3001,2164
3002,2164
3003,2165
3004,2166
3005,2167
3006,2168
3007,2169
3008,2170
3009,2171
3010,2172
3011,2173
3012,2174
3013,2175
3014,2176
3015,2176
3016,2177
3017,2178
3018,2179
3019,2180
3020,2181
3021,2182
3022,2183
3023,2183
3024,2184
3025,2185
3026,2186
3027,2187
3028,2188
3029,2189
3030,2190
3031,2191
3032,2192
3033,2193
3034,2193
3035,2194
3036,2195
3037,2196
3038,2197
3039,2198
3040,2199
3041,2200
3042,2200
3043,2201
3044,2201
3045,2202
3046,2203
3047,2204
3048,2205
3049,2206
3050,2207
3051,2207
3052,2208
3053,2209
3054,2210
3055,2210
3056,2211
3057,2212
3058,2213
3059,2214
3060,2214
3061,2215
3062,2215
3063,2216
3064,2217
3065,2217
3066,2218
3067,2219
3068,2219
3069,2220
3070,2221
3071,2222
3072,2223
3073,2224
3074,2225
3075,2225
3076,2226
3077,2226
3078,2227
3079,2227
3080,2228
3081,2228
3082,2229
3083,2229
3084,2230
3085,2231
3086,2232
3087,2232
3088,2233
3089,2234
3090,2234
3091,2235
3092,2236
3093,2236
3094,2237
3095,2237
3096,2238
3097,2239
3098,2239
3099,2240
3100,2241
3101,2242
3102,2243
3103,2243
3104,2244
3105,2244
3106,2245
3107,2246
3108,2247
3109,2248
3110,2249
3111,2250
3112,2251
3113,2252
3114,2253
3115,2254
3116,2254
3117,2255
3118,2255
3119,2256
3120,2256
3121,2257
3122,2258
3123,2259
3124,2260
3125,2261
3126,2262
3127,2263
3128,2264
3129,2265
3130,2266
3131,2267
3132,2268
3133,2268
3134,2269
3135,2269
3136,2270
3137,2270
3138,2271
3139,2272
3140,2273
3141,2274
3142,2275
3143,2276
3144,2277
3145,2277
3146,2278
3147,2279
3148,2279
3149,2280
3150,2280
3151,2281
3152,2281
3153,2282
3154,2283
3155,2284
3156,2285
3157,2286
3158,2287
3159,2288
3160,2289
3161,2290
3162,2291
3163,2292
3164,2293
3165,2294
3166,2295
3167,2296
3168,2296
3169,2297
3170,2298
3171,2299
3172,2300
3173,2301
3174,2302
3175,2303
3176,2304
3177,2305
3178,2305
3179,2306
3180,2307
3181,2307
3182,2308
3183,2309
3184,2310
3185,2311
3186,2312
3187,2312
3188,2313
3189,2313
3190,2314
3191,2314
3192,2315
3193,2315
3194,2316
3195,2316
3196,2317
3197,2318
3198,2319
3199,2320
3200,2320
3201,2321
3202,2321
3203,2322
3204,2322
3205,2323
3206,2323
3207,2324
3208,2325
3209,2326
3210,2327
3211,2327
3212,2328
3213,2329
3214,2330
3215,2331
3216,2332
3217,2333
3218,2334
3219,2335
3220,2336
3221,2337
3222,2338
3223,2339
3224,2339
3225,2340
3226,2341
3227,2342
3228,2342
3229,2343
3230,2344
3231,2344
3232,2345
3233,2346
3234,2347
3235,2348
3236,2349
3237,2350
3238,2351
3239,2352
3240,2353
3241,2354
3242,2355
3243,2356
3244,2356
3245,2357
3246,2358
3247,2359
3248,2360
3249,2361
3250,2362
3251,2363
3252,2364
3253,2364
3254,2365
3255,2365
3256,2366
3257,2367
3258,2368
3259,2368
3260,2369
3261,2369
3262,2370
3263,2371
3264,2371
3265,2372
3266,2373
3267,2374
3268,2375
3269,2376
3270,2376
3271,2377
3272,2378
3273,2379
3274,2380
3275,2381
3276,2382
3277,2382
3278,2383
3279,2383
3280,2384
3281,2385
3282,2386
3283,2387
3284,2388
3285,2389
3286,2389
3287,2390
3288,2390
3289,2391
3290,2392
3291,2393
3292,2394
3293,2395
3294,2396
3295,2397
3296,2398
3297,2399
3298,2400
3299,2401
3300,2402
3301,2403
3302,2404
3303,2405
3304,2406
3305,2407
3306,2408
3307,2408
3308,2409
3309,2409
3310,2410
3311,2411
3312,2412
3313,2412
3314,2413
3315,2414
3316,2414
3317,2415
3318,2416
3319,2417
3320,2418
3321,2419
3322,2420
3323,2421
3324,2421
3325,2422
3326,2423
3327,2424
3328,2425
3329,2426
3330,2427
3331,2428
3332,2428
3333,2429
3334,2430
3335,2431
3336,2432
3337,2432
3338,2433
3339,2434
3340,2435
3341,2436
3342,2437
3343,2438
3344,2439
3345,2440
3346,2441
3347,2442
3348,2443
3349,2443
3350,2444
3351,2445
3352,2446
3353,2447
3354,2448
3355,2449
3356,2450
3357,2450
3358,2451
3359,2452
3360,2453
3361,2454
3362,2455
3363,2456
3364,2456
3365,2457
3366,2458
3367,2458
3368,2459
3369,2460
3370,2460
3371,2461
3372,2461
3373,2462
3374,2462
3375,2463
3376,2464
3377,2465
3378,2466
3379,2467
3380,2467
3381,2468
3382,2469
3383,2470
3384,2470
3385,2471
3386,2471
3387,2472
3388,2472
3389,2473
3390,2474
3391,2475
3392,2476
3393,2477
3394,2478
3395,2479
3396,2479
3397,2480
3398,2481
3399,2482
3400,2483
3401,2483
3402,2484
3403,2485
3404,2485
3405,2486
3406,2487
3407,2487
3408,2488
3409,2489
3410,2490
3411,2491
3412,2492
3413,2492
3414,2493
3415,2493
3416,2494
3417,2495
3418,2496
3419,2497
3420,2498
3421,2498
3422,2499
3423,2499
3424,2500
3425,2501
3426,2501
3427,2502
3428,2503
3429,2504
3430,2505
3431,2505
3432,2506
3433,2507
3434,2507
3435,2508
3436,2509
3437,2510
3438,2511
3439,2512
3440,2513
3441,2514
3442,2515
3443,2516
3444,2516
3445,2517
3446,2518
3447,2519
3448,2520
3449,2520
3450,2521
3451,2522
3452,2523
3453,2523
3454,2524
3455,2524
3456,2525
3457,2526
3458,2526
3459,2527
3460,2528
3461,2528
3462,2529
3463,2530
3464,2531
3465,2532
3466,2533
3467,2534
3468,2535
3469,2535
3470,2536
3471,2536
3472,2537
3473,2538
3474,2538
3475,2539
3476,2540
3477,2540
3478,2541
3479,2541
3480,2542
3481,2542
3482,2543
3483,2544
3484,2545
3485,2546
3486,2547
3487,2548
3488,2549
3489,2549
3490,2550
3491,2550
3492,2551
3493,2552
3494,2553
3495,2553
3496,2554
3497,2555
3498,2556
3499,2557
3500,2558
3501,2559
3502,2560
3503,2561
3504,2562
3505,2563
3506,2564
3507,2565
3508,2566
3509,2567
3510,2567
3511,2568
3512,2569
3513,2570
3514,2571
3515,2572
3516,2573
3517,2574
3518,2575
3519,2576
3520,2576
3521,2577
3522,2578
3523,2579
3524,2580
3525,2581
3526,2581
3527,2582
3528,2583
3529,2584
3530,2585
3531,2585
3532,2586
3533,2587
3534,2588
3535,2589
3536,2590
3537,2590
3538,2591
3539,2592
3540,2592
3541,2593
3542,2594
3543,2594
3544,2595
3545,2596
3546,2597
3547,2597
3548,2598
3549,2599
3550,2600
3551,2601
3552,2602
3553,2603
3554,2603
3555,2604
3556,2605
3557,2605
3558,2606
3559,2606
3560,2607
3561,2608
3562,2608
3563,2609
3564,2609
3565,2610
3566,2610
3567,2611
3568,2612
3569,2613
3570,2613
3571,2614
3572,2615
3573,2615
3574,2616
3575,2617
3576,2618
3577,2619
3578,2620
3579,2620
3580,2621
3581,2621
3582,2622
3583,2622
3584,2623
3585,2624
3586,2625
3587,2626
3588,2627
3589,2627
3590,2628
3591,2628
3592,2629
3593,2630
3594,2631
3595,2632
3596,2633
3597,2633
3598,2634
3599,2635
3600,2636
3601,2636
3602,2637
3603,2638
3604,2638
3605,2639
3606,2640
3607,2641
3608,2642
3609,2642
3610,2643
3611,2644
3612,2645
3613,2645
3614,2646
3615,2647
3616,2648
3617,2649
3618,2650
3619,2651
3620,2652
3621,2653
3622,2653
3623,2654
3624,2655
3625,2656
3626,2656
3627,2657
3628,2658
3629,2659
3630,2660
3631,2660
3632,2661
3633,2661
3634,2662
3635,2662
3636,2663
3637,2664
3638,2665
3639,2666
3640,2667
3641,2668
3642,2669
3643,2670
3644,2671
3645,2672
3646,2672
3647,2673
3648,2673
3649,2674
3650,2674
3651,2675
3652,2676
3653,2677
3654,2678
3655,2679
3656,2679
3657,2680
3658,2681
3659,2682
3660,2682
3661,2683
3662,2683
3663,2684
3664,2685
3665,2685
3666,2686
3667,2686
3668,2687
3669,2688
3670,2688
3671,2689
3672,2689
3673,2690
3674,2691
3675,2691
3676,2692
3677,2693
3678,2694
3679,2695
3680,2696
3681,2697
3682,2697
3683,2698
3684,2699
3685,2700
3686,2700
3687,2701
3688,2702
3689,2703
3690,2704
3691,2705
3692,2706
3693,2707
3694,2708
3695,2709
3696,2710
3697,2711
