,0
0,1
1,1445
2,8
3,9
4,45
5,828
6,1432
7,88
8,627
9,104
10,113
11,130
12,149
13,2336
14,209
15,214
16,224
17,276
18,849
19,1300
20,486
21,496
22,498
23,1706
24,558
25,564
26,1313
27,624
28,1312
29,681
30,1609
31,697
32,706
33,1409
34,730
35,1860
36,792
37,1736
38,820
39,841
40,842
41,843
42,852
43,854
44,857
45,2650
46,1548
47,1248
48,1024
49,1049
50,1100
51,1113
52,1119
53,2613
54,1272
55,1360
56,1475
57,1550
58,1568
59,1578
60,1647
61,1656
62,1699
63,1716
64,2612
65,1723
66,1727
67,1854
68,1878
69,1987
70,2752
71,157
72,750
73,164
74,2453
75,168
76,170
77,73
78,74
79,82
80,83
81,23
82,92
83,34
84,95
85,99
86,2520
87,2251
88,97
89,107
90,108
91,15
92,369
93,21
94,24
95,25
96,36
97,173
98,39
99,42
100,43
101,198
102,44
103,213
104,216
105,62
106,234
107,63
108,243
109,250
110,266
111,76
112,278
113,78
114,299
115,80
116,81
117,96
118,98
119,388
120,103
121,409
122,416
123,112
124,426
125,446
126,451
127,479
128,488
129,494
130,499
131,142
132,143
133,527
134,144
135,557
136,583
137,153
138,154
139,596
140,605
141,133
142,138
143,139
144,140
145,639
146,122
147,156
148,158
149,52
150,128
151,2536
152,57
153,167
154,178
155,279
156,180
157,181
158,285
159,294
160,189
161,1797
162,300
163,301
164,305
165,1380
166,2353
167,307
168,311
169,313
170,315
171,329
172,1408
173,1413
174,343
175,10
176,1505
177,12
178,344
179,346
180,13
181,349
182,350
183,192
184,356
185,194
186,197
187,200
188,206
189,221
190,237
191,2341
192,2308
193,240
194,246
195,257
196,262
197,277
198,782
199,614
200,910
201,931
202,992
203,1396
204,2188
205,375
206,115
207,412
208,511
209,512
210,517
211,523
212,540
213,588
214,593
215,604
216,631
217,641
218,673
219,679
220,696
221,724
222,733
223,765
224,802
225,810
226,812
227,818
228,850
229,861
230,866
231,874
232,879
233,885
234,995
235,1008
236,1018
237,1042
238,1062
239,1070
240,1107
241,1182
242,1220
243,1240
244,1245
245,1265
246,1290
247,1296
248,1388
249,1422
250,1427
251,1431
252,1438
253,1443
254,1457
255,1474
256,1481
257,1486
258,1492
259,1496
260,1527
261,1539
262,1572
263,1597
264,1598
265,1599
266,1603
267,1605
268,1621
269,1638
270,1687
271,1800
272,1816
273,1840
274,1847
275,1903
276,1923
277,1925
278,1942
279,1974
280,1978
281,1992
282,2142
283,2151
284,2158
285,2167
286,2168
287,2170
288,2222
289,2239
290,2254
291,2611
292,2620
293,2624
294,2625
295,2750
296,2753
297,29
298,32
299,51
300,66
301,75
302,102
303,115
304,118
305,119
306,124
307,126
308,132
309,137
310,150
311,152
312,159
313,160
314,161
315,166
316,169
317,171
318,225
319,226
320,227
321,228
322,229
323,230
324,233
325,281
326,297
327,357
328,367
329,370
330,375
331,476
332,477
333,480
334,591
335,602
336,607
337,608
338,610
339,611
340,616
341,621
342,633
343,671
344,710
345,717
346,727
347,740
348,745
349,749
350,751
351,762
352,772
353,778
354,789
355,894
356,906
357,907
358,908
359,918
360,919
361,923
362,924
363,934
364,941
365,961
366,1022
367,1029
368,1103
369,1104
370,1141
371,1143
372,1144
373,1152
374,1157
375,1195
376,1216
377,1233
378,1277
379,1334
380,1348
381,1381
382,1388
383,1389
384,1394
385,1395
386,1401
387,1406
388,1419
389,1421
390,1437
391,1449
392,1451
393,1452
394,1456
395,1458
396,1469
397,1508
398,1509
399,1785
400,1904
401,2000
402,2143
403,2146
404,2294
405,2326
406,2439
407,2449
408,2538
409,2570
410,2581
