,Reaction index
EX_mmet_e,0.0
EX_mmet_e_reverse,1.0
EX_mn2_e,2.0
EX_mn2_e_reverse,3.0
EX_mnl_e,4.0
EX_mnl_e_reverse,5.0
EX_mobd_e,6.0
EX_mobd_e_reverse,7.0
EX_mso3_e,8.0
EX_mso3_e_reverse,9.0
EX_n2o_e,10.0
EX_n2o_e_reverse,11.0
EX_na1_e,12.0
EX_na1_e_reverse,13.0
EX_nac_e,14.0
EX_nac_e_reverse,15.0
EX_nh4_e,16.0
EX_nh4_e_reverse,17.0
EX_ni2_e,18.0
EX_ni2_e_reverse,19.0
EX_nmn_e,20.0
EX_nmn_e_reverse,21.0
EX_no_e,22.0
EX_no_e_reverse,23.0
EX_no2_e,24.0
EX_no2_e_reverse,25.0
EX_no3_e,26.0
EX_no3_e_reverse,27.0
EX_doxrbcn_e,28.0
EX_doxrbcn_e_reverse,29.0
EX_ac_e,30.0
EX_ac_e_reverse,31.0
EX_acac_e,32.0
EX_acac_e_reverse,33.0
EX_acald_e,34.0
EX_acald_e_reverse,35.0
EX_acgal_e,36.0
EX_acgal_e_reverse,37.0
EX_dtmp_e,38.0
EX_dtmp_e_reverse,39.0
EX_dump_e,40.0
EX_dump_e_reverse,41.0
EX_acgal1p_e,42.0
EX_acgal1p_e_reverse,43.0
EX_duri_e,45.0
EX_duri_e_reverse,46.0
EX_acgam_e,47.0
EX_acgam_e_reverse,48.0
EX_acgam1p_e,49.0
EX_acgam1p_e_reverse,50.0
EX_eca4colipa_e,51.0
EX_eca4colipa_e_reverse,52.0
EX_acmana_e,53.0
EX_acmana_e_reverse,54.0
EX_acmum_e,55.0
EX_acmum_e_reverse,56.0
EX_enlipa_e,57.0
EX_enlipa_e_reverse,58.0
EX_acnam_e,59.0
EX_acnam_e_reverse,60.0
EX_acolipa_e,61.0
EX_acolipa_e_reverse,62.0
EX_enter_e,63.0
EX_enter_e_reverse,64.0
EX_acser_e,65.0
EX_acser_e_reverse,66.0
EX_etha_e,67.0
EX_etha_e_reverse,68.0
EX_ade_e,69.0
EX_ade_e_reverse,70.0
EX_adn_e,71.0
EX_adn_e_reverse,72.0
EX_adocbl_e,73.0
EX_adocbl_e_reverse,74.0
EX_ag_e,75.0
EX_ag_e_reverse,76.0
EX_agm_e,77.0
EX_agm_e_reverse,78.0
EX_akg_e,79.0
EX_akg_e_reverse,80.0
EX_ala_B_e,81.0
EX_ala_B_e_reverse,82.0
EX_ala__D_e,83.0
EX_ala__D_e_reverse,84.0
EX_ala__L_e,85.0
EX_ala__L_e_reverse,86.0
EX_alaala_e,87.0
EX_alaala_e_reverse,88.0
EX_12ppd__R_e,96.0
EX_12ppd__R_e_reverse,97.0
EX_all__D_e,98.0
EX_all__D_e_reverse,99.0
EX_ethso3_e,100.0
EX_ethso3_e_reverse,101.0
EX_alltn_e,102.0
EX_alltn_e_reverse,103.0
EX_12ppd__S_e,104.0
EX_12ppd__S_e_reverse,105.0
EX_14glucan_e,106.0
EX_14glucan_e_reverse,107.0
EX_amp_e,108.0
EX_amp_e_reverse,109.0
EX_15dap_e,110.0
EX_15dap_e_reverse,111.0
EX_etoh_e,112.0
EX_etoh_e_reverse,113.0
EX_23camp_e,114.0
EX_23camp_e_reverse,115.0
EX_anhgm_e,116.0
EX_anhgm_e_reverse,117.0
EX_arab__L_e,118.0
EX_arab__L_e_reverse,119.0
EX_f6p_e,120.0
EX_f6p_e_reverse,121.0
EX_arbt_e,122.0
EX_arbt_e_reverse,123.0
EX_arbtn_e,124.0
EX_arbtn_e_reverse,125.0
EX_23ccmp_e,126.0
EX_23ccmp_e_reverse,127.0
EX_23cgmp_e,128.0
EX_23cgmp_e_reverse,129.0
EX_23cump_e,130.0
EX_23cump_e_reverse,131.0
EX_23dappa_e,132.0
EX_23dappa_e_reverse,133.0
EX_26dap__M_e,134.0
EX_26dap__M_e_reverse,135.0
EX_2ddglcn_e,136.0
EX_2ddglcn_e_reverse,137.0
EX_34dhpac_e,138.0
EX_34dhpac_e_reverse,139.0
EX_3amp_e,140.0
EX_3amp_e_reverse,141.0
EX_arbtn_fe3_e,142.0
EX_arbtn_fe3_e_reverse,143.0
EX_arg__L_e,144.0
EX_arg__L_e_reverse,145.0
EX_ascb__L_e,146.0
EX_ascb__L_e_reverse,147.0
EX_asn__L_e,148.0
EX_asn__L_e_reverse,149.0
EX_aso3_e,150.0
EX_aso3_e_reverse,151.0
EX_asp__L_e,152.0
EX_asp__L_e_reverse,153.0
EX_btn_e,154.0
EX_btn_e_reverse,155.0
EX_3cmp_e,156.0
EX_3cmp_e_reverse,157.0
EX_3gmp_e,158.0
EX_3gmp_e_reverse,159.0
EX_but_e,160.0
EX_but_e_reverse,161.0
EX_3hcinnm_e,162.0
EX_3hcinnm_e_reverse,163.0
EX_butso3_e,164.0
EX_butso3_e_reverse,165.0
EX_fald_e,166.0
EX_fald_e_reverse,167.0
EX_ca2_e,168.0
EX_ca2_e_reverse,169.0
EX_cbi_e,170.0
EX_cbi_e_reverse,171.0
EX_3hpp_e,172.0
EX_3hpp_e_reverse,173.0
EX_3hpppn_e,174.0
EX_3hpppn_e_reverse,175.0
EX_3ump_e,176.0
EX_3ump_e_reverse,177.0
EX_cbl1_e,178.0
EX_cbl1_e_reverse,179.0
EX_cd2_e,180.0
EX_cd2_e_reverse,181.0
EX_4abut_e,182.0
EX_4abut_e_reverse,183.0
EX_cgly_e,184.0
EX_cgly_e_reverse,185.0
EX_fe2_e,186.0
EX_fe2_e_reverse,187.0
EX_chol_e,188.0
EX_chol_e_reverse,189.0
EX_4hoxpacd_e,190.0
EX_4hoxpacd_e_reverse,191.0
EX_5dglcn_e,192.0
EX_5dglcn_e_reverse,193.0
EX_chtbs_e,194.0
EX_chtbs_e_reverse,195.0
EX_fe3_e,196.0
EX_fe3_e_reverse,197.0
EX_cit_e,198.0
EX_cit_e_reverse,199.0
EX_cl_e,200.0
EX_cl_e_reverse,201.0
EX_5mtr_e,202.0
EX_5mtr_e_reverse,203.0
EX_LalaDglu_e,204.0
EX_LalaDglu_e_reverse,205.0
EX_LalaDgluMdap_e,206.0
EX_LalaDgluMdap_e_reverse,207.0
EX_LalaDgluMdapDala_e,208.0
EX_LalaDgluMdapDala_e_reverse,209.0
EX_LalaLglu_e,210.0
EX_LalaLglu_e_reverse,211.0
EX_cm_e,212.0
EX_cm_e_reverse,213.0
EX_cmp_e,214.0
EX_cmp_e_reverse,215.0
EX_co2_e,216.0
EX_co2_e_reverse,217.0
EX_cobalt2_e,218.0
EX_cobalt2_e_reverse,219.0
EX_fe3dcit_e,220.0
EX_fe3dcit_e_reverse,221.0
EX_colipa_e,222.0
EX_colipa_e_reverse,223.0
EX_colipap_e,224.0
EX_colipap_e_reverse,225.0
EX_fe3dhbzs_e,226.0
EX_fe3dhbzs_e_reverse,227.0
EX_cpgn_e,228.0
EX_cpgn_e_reverse,229.0
EX_cpgn_un_e,230.0
EX_cpgn_un_e_reverse,231.0
EX_crn_e,232.0
EX_crn_e_reverse,233.0
EX_hg2_e,234.0
EX_hg2_e_reverse,235.0
EX_his__L_e,236.0
EX_his__L_e_reverse,237.0
EX_crn__D_e,238.0
EX_crn__D_e_reverse,239.0
EX_fe3hox_e,240.0
EX_fe3hox_e_reverse,241.0
EX_csn_e,242.0
EX_csn_e_reverse,243.0
EX_cu_e,244.0
EX_cu_e_reverse,245.0
EX_hom__L_e,246.0
EX_hom__L_e_reverse,247.0
EX_hxa_e,248.0
EX_hxa_e_reverse,249.0
EX_hxan_e,250.0
EX_hxan_e_reverse,251.0
EX_cu2_e,252.0
EX_cu2_e_reverse,253.0
EX_idon__L_e,254.0
EX_idon__L_e_reverse,255.0
EX_fe3hox_un_e,256.0
EX_fe3hox_un_e_reverse,257.0
EX_ile__L_e,258.0
EX_ile__L_e_reverse,259.0
EX_cyan_e,260.0
EX_cyan_e_reverse,261.0
EX_cynt_e,262.0
EX_cynt_e_reverse,263.0
EX_imp_e,264.0
EX_imp_e_reverse,265.0
EX_fecrm_e,266.0
EX_fecrm_e_reverse,267.0
EX_indole_e,268.0
EX_indole_e_reverse,269.0
EX_inost_e,270.0
EX_inost_e_reverse,271.0
EX_ins_e,272.0
EX_ins_e_reverse,273.0
EX_cys__D_e,274.0
EX_cys__D_e_reverse,275.0
EX_cys__L_e,276.0
EX_cys__L_e_reverse,277.0
EX_cytd_e,278.0
EX_cytd_e_reverse,279.0
EX_dad_2_e,280.0
EX_dad_2_e_reverse,281.0
EX_damp_e,282.0
EX_damp_e_reverse,283.0
EX_dca_e,284.0
EX_dca_e_reverse,285.0
EX_dcmp_e,286.0
EX_dcmp_e_reverse,287.0
EX_isetac_e,288.0
EX_isetac_e_reverse,289.0
EX_k_e,290.0
EX_k_e_reverse,291.0
EX_kdo2lipid4_e,292.0
EX_kdo2lipid4_e_reverse,293.0
EX_lac__D_e,294.0
EX_lac__D_e_reverse,295.0
EX_lac__L_e,296.0
EX_lac__L_e_reverse,297.0
EX_dcyt_e,298.0
EX_dcyt_e_reverse,299.0
EX_ddca_e,300.0
EX_ddca_e_reverse,301.0
EX_dgmp_e,302.0
EX_dgmp_e_reverse,303.0
EX_lcts_e,304.0
EX_lcts_e_reverse,305.0
EX_dgsn_e,306.0
EX_dgsn_e_reverse,307.0
EX_leu__L_e,308.0
EX_leu__L_e_reverse,309.0
EX_fecrm_un_e,310.0
EX_fecrm_un_e_reverse,311.0
EX_lipa_e,312.0
EX_lipa_e_reverse,313.0
EX_lipa_cold_e,314.0
EX_lipa_cold_e_reverse,315.0
EX_dha_e,316.0
EX_dha_e_reverse,317.0
EX_dimp_e,318.0
EX_dimp_e_reverse,319.0
EX_din_e,320.0
EX_din_e_reverse,321.0
EX_lipoate_e,322.0
EX_lipoate_e_reverse,323.0
EX_feenter_e,324.0
EX_feenter_e_reverse,325.0
EX_lys__L_e,326.0
EX_lys__L_e_reverse,327.0
EX_dms_e,328.0
EX_dms_e_reverse,329.0
EX_feoxam_e,330.0
EX_feoxam_e_reverse,331.0
EX_dmso_e,332.0
EX_dmso_e_reverse,333.0
EX_feoxam_un_e,334.0
EX_feoxam_un_e_reverse,335.0
EX_dopa_e,336.0
EX_dopa_e_reverse,337.0
EX_for_e,338.0
EX_for_e_reverse,339.0
EX_lyx__L_e,340.0
EX_lyx__L_e_reverse,341.0
EX_fru_e,342.0
EX_fru_e_reverse,343.0
EX_mal__D_e,344.0
EX_mal__D_e_reverse,345.0
EX_frulys_e,346.0
EX_frulys_e_reverse,347.0
EX_mal__L_e,348.0
EX_mal__L_e_reverse,349.0
EX_fruur_e,350.0
EX_fruur_e_reverse,351.0
EX_malt_e,352.0
EX_malt_e_reverse,353.0
EX_malthx_e,354.0
EX_malthx_e_reverse,355.0
EX_maltpt_e,356.0
EX_maltpt_e_reverse,357.0
EX_malttr_e,358.0
EX_malttr_e_reverse,359.0
EX_maltttr_e,360.0
EX_maltttr_e_reverse,361.0
EX_fuc__L_e,362.0
EX_fuc__L_e_reverse,363.0
EX_man_e,364.0
EX_man_e_reverse,365.0
EX_man6p_e,366.0
EX_man6p_e_reverse,367.0
EX_manglyc_e,368.0
EX_manglyc_e_reverse,369.0
EX_melib_e,370.0
EX_melib_e_reverse,371.0
EX_novbcn_e,372.0
EX_novbcn_e_reverse,373.0
EX_o16a4colipa_e,374.0
EX_o16a4colipa_e_reverse,375.0
EX_o2_e,376.0
EX_o2_e_reverse,377.0
EX_o2s_e,378.0
EX_o2s_e_reverse,379.0
EX_ocdca_e,380.0
EX_ocdca_e_reverse,381.0
EX_meoh_e,382.0
EX_meoh_e_reverse,383.0
EX_met__D_e,384.0
EX_met__D_e_reverse,385.0
EX_ocdcea_e,386.0
EX_ocdcea_e_reverse,387.0
EX_fum_e,388.0
EX_fum_e_reverse,389.0
EX_octa_e,390.0
EX_octa_e_reverse,391.0
EX_orn_e,392.0
EX_orn_e_reverse,393.0
EX_met__L_e,394.0
EX_met__L_e_reverse,395.0
EX_metsox_R__L_e,396.0
EX_metsox_R__L_e_reverse,397.0
EX_metsox_S__L_e,398.0
EX_metsox_S__L_e_reverse,399.0
EX_orot_e,400.0
EX_orot_e_reverse,401.0
EX_fusa_e,402.0
EX_fusa_e_reverse,403.0
EX_pacald_e,404.0
EX_pacald_e_reverse,405.0
EX_peamn_e,406.0
EX_peamn_e_reverse,407.0
EX_phe__L_e,408.0
EX_phe__L_e_reverse,409.0
EX_mg2_e,410.0
EX_mg2_e_reverse,411.0
EX_mincyc_e,412.0
EX_mincyc_e_reverse,413.0
EX_minohp_e,414.0
EX_minohp_e_reverse,415.0
EX_pheme_e,416.0
EX_pheme_e_reverse,417.0
EX_g1p_e,418.0
EX_g1p_e_reverse,419.0
EX_pi_e,420.0
EX_pi_e_reverse,421.0
EX_pnto__R_e,422.0
EX_pnto__R_e_reverse,423.0
EX_g3pc_e,424.0
EX_g3pc_e_reverse,425.0
EX_ppa_e,426.0
EX_ppa_e_reverse,427.0
EX_ppal_e,428.0
EX_ppal_e_reverse,429.0
EX_pppn_e,430.0
EX_pppn_e_reverse,431.0
EX_ppt_e,432.0
EX_ppt_e_reverse,433.0
EX_pro__L_e,434.0
EX_pro__L_e_reverse,435.0
EX_progly_e,436.0
EX_progly_e_reverse,437.0
EX_xylu__L_e,438.0
EX_xylu__L_e_reverse,439.0
EX_zn2_e,440.0
EX_zn2_e_reverse,441.0
EX_psclys_e,449.0
EX_psclys_e_reverse,450.0
EX_pser__L_e,451.0
EX_pser__L_e_reverse,452.0
EX_g3pe_e,454.0
EX_g3pe_e_reverse,455.0
EX_ptrc_e,460.0
EX_ptrc_e_reverse,461.0
EX_pydam_e,462.0
EX_pydam_e_reverse,463.0
EX_pydx_e,464.0
EX_pydx_e_reverse,465.0
EX_pydxn_e,466.0
EX_pydxn_e_reverse,467.0
EX_g3pg_e,470.0
EX_g3pg_e_reverse,471.0
EX_pyr_e,474.0
EX_pyr_e_reverse,475.0
EX_quin_e,476.0
EX_quin_e_reverse,477.0
EX_r5p_e,478.0
EX_r5p_e_reverse,479.0
EX_g3pi_e,481.0
EX_g3pi_e_reverse,482.0
EX_rfamp_e,488.0
EX_rfamp_e_reverse,489.0
EX_rib__D_e,490.0
EX_rib__D_e_reverse,491.0
EX_rmn_e,492.0
EX_rmn_e_reverse,493.0
EX_sbt__D_e,494.0
EX_sbt__D_e_reverse,495.0
EX_sel_e,496.0
EX_sel_e_reverse,497.0
EX_ser__D_e,498.0
EX_ser__D_e_reverse,499.0
EX_ser__L_e,500.0
EX_ser__L_e_reverse,501.0
EX_skm_e,504.0
EX_skm_e_reverse,505.0
EX_g3ps_e,506.0
EX_g3ps_e_reverse,507.0
EX_slnt_e,508.0
EX_slnt_e_reverse,509.0
EX_so2_e,510.0
EX_so2_e_reverse,511.0
EX_so3_e,515.0
EX_so3_e_reverse,516.0
EX_g6p_e,518.0
EX_g6p_e_reverse,519.0
EX_so4_e,521.0
EX_so4_e_reverse,522.0
EX_spmd_e,523.0
EX_spmd_e_reverse,524.0
EX_gal_e,525.0
EX_gal_e_reverse,526.0
EX_succ_e,527.0
EX_succ_e_reverse,528.0
EX_sucr_e,529.0
EX_sucr_e_reverse,530.0
EX_gal_bD_e,532.0
EX_gal_bD_e_reverse,533.0
EX_sulfac_e,535.0
EX_sulfac_e_reverse,536.0
EX_tartr__D_e,537.0
EX_tartr__D_e_reverse,538.0
EX_tartr__L_e,539.0
EX_tartr__L_e_reverse,540.0
EX_taur_e,545.0
EX_taur_e_reverse,546.0
EX_tcynt_e,547.0
EX_tcynt_e_reverse,548.0
EX_thm_e,549.0
EX_thm_e_reverse,550.0
EX_thr__L_e,551.0
EX_thr__L_e_reverse,552.0
EX_thrp_e,553.0
EX_thrp_e_reverse,554.0
EX_thym_e,557.0
EX_thym_e_reverse,558.0
EX_gal1p_e,559.0
EX_gal1p_e_reverse,560.0
EX_thymd_e,561.0
EX_thymd_e_reverse,562.0
EX_tma_e,563.0
EX_tma_e_reverse,564.0
EX_tmao_e,568.0
EX_tmao_e_reverse,569.0
EX_galct__D_e,570.0
EX_galct__D_e_reverse,571.0
EX_tre_e,572.0
EX_tre_e_reverse,573.0
EX_trp__L_e,574.0
EX_trp__L_e_reverse,575.0
EX_tsul_e,578.0
EX_tsul_e_reverse,579.0
EX_ttdca_e,581.0
EX_ttdca_e_reverse,582.0
EX_galctn__D_e,583.0
EX_galctn__D_e_reverse,584.0
EX_ttdcea_e,585.0
EX_ttdcea_e_reverse,586.0
EX_ttrcyc_e,589.0
EX_ttrcyc_e_reverse,590.0
EX_galctn__L_e,591.0
EX_galctn__L_e_reverse,592.0
EX_tungs_e,593.0
EX_tungs_e_reverse,594.0
EX_tym_e,595.0
EX_tym_e_reverse,596.0
EX_tyr__L_e,604.0
EX_tyr__L_e_reverse,605.0
EX_tyrp_e,606.0
EX_tyrp_e_reverse,607.0
EX_uacgam_e,608.0
EX_uacgam_e_reverse,609.0
EX_udpacgal_e,610.0
EX_udpacgal_e_reverse,611.0
EX_udpg_e,612.0
EX_udpg_e_reverse,613.0
EX_galt_e,616.0
EX_galt_e_reverse,617.0
EX_udpgal_e,622.0
EX_udpgal_e_reverse,623.0
EX_udpglcur_e,624.0
EX_udpglcur_e_reverse,625.0
EX_ump_e,626.0
EX_ump_e_reverse,627.0
EX_ura_e,628.0
EX_ura_e_reverse,629.0
EX_urea_e,630.0
EX_urea_e_reverse,631.0
EX_uri_e,632.0
EX_uri_e_reverse,633.0
EX_galur_e,635.0
EX_galur_e_reverse,636.0
EX_val__L_e,637.0
EX_val__L_e_reverse,638.0
EX_xan_e,639.0
EX_xan_e_reverse,640.0
EX_gam_e,641.0
EX_gam_e_reverse,642.0
EX_xmp_e,643.0
EX_xmp_e_reverse,644.0
EX_xtsn_e,646.0
EX_xtsn_e_reverse,647.0
EX_gam6p_e,648.0
EX_gam6p_e_reverse,649.0
EX_xyl__D_e,650.0
EX_xyl__D_e_reverse,651.0
EX_gbbtn_e,653.0
EX_gbbtn_e_reverse,654.0
EX_gdp_e,656.0
EX_gdp_e_reverse,657.0
EX_glc__D_e,675.0
EX_glc__D_e_reverse,676.0
EX_glcn_e,693.0
EX_glcn_e_reverse,694.0
EX_glcr_e,700.0
EX_glcr_e_reverse,701.0
EX_glcur_e,718.0
EX_glcur_e_reverse,719.0
EX_glcur1p_e,728.0
EX_glcur1p_e_reverse,729.0
EX_gln__L_e,745.0
EX_gln__L_e_reverse,746.0
EX_glu__L_e,770.0
EX_glu__L_e_reverse,771.0
EX_gly_e,777.0
EX_gly_e_reverse,778.0
EX_glyald_e,790.0
EX_glyald_e_reverse,791.0
EX_glyb_e,811.0
EX_glyb_e_reverse,812.0
EX_glyc_e,820.0
EX_glyc_e_reverse,821.0
EX_glyc__R_e,824.0
EX_glyc__R_e_reverse,825.0
EX_glyc2p_e,831.0
EX_glyc2p_e_reverse,832.0
EX_glyc3p_e,839.0
EX_glyc3p_e_reverse,840.0
EX_glyclt_e,847.0
EX_glyclt_e_reverse,848.0
EX_gmp_e,869.0
EX_gmp_e_reverse,870.0
EX_gsn_e,886.0
EX_gsn_e_reverse,887.0
EX_gthox_e,914.0
EX_gthox_e_reverse,915.0
EX_gthrd_e,927.0
EX_gthrd_e_reverse,928.0
EX_gtp_e,935.0
EX_gtp_e_reverse,936.0
EX_gua_e,959.0
EX_gua_e_reverse,960.0
EX_h_e,969.0
EX_h_e_reverse,970.0
EX_h2_e,976.0
EX_h2_e_reverse,977.0
EX_h2o_e,983.0
EX_h2o_e_reverse,984.0
EX_h2o2_e,988.0
EX_h2o2_e_reverse,989.0
EX_h2s_e,997.0
EX_h2s_e_reverse,998.0
EX_hacolipa_e,1006.0
EX_hacolipa_e_reverse,1007.0
EX_halipa_e,1009.0
EX_halipa_e_reverse,1010.0
EX_hdca_e,1023.0
EX_hdca_e_reverse,1024.0
EX_hdcea_e,1030.0
EX_hdcea_e_reverse,1031.0
EX_3hoxpac_e,2597.0
EX_3hoxpac_e_reverse,2598.0
EX_3ntym_e,2630.0
EX_3ntym_e_reverse,2631.0
EX_4hoxpac_e,2634.0
EX_4hoxpac_e_reverse,2635.0
EX_6apa_e,2638.0
EX_6apa_e_reverse,2639.0
EX_cellb_e,2650.0
EX_cellb_e_reverse,2651.0
EX_galam_e,2659.0
EX_galam_e_reverse,2660.0
EX_lipidA_core_e,2666.0
EX_lipidA_core_e_reverse,2667.0
EX_arab__D_e,2669.0
EX_arab__D_e_reverse,2670.0
EX_o6a4colipa_e,2671.0
EX_o6a4colipa_e_reverse,2672.0
EX_peng_e,2675.0
EX_peng_e_reverse,2676.0
EX_raffin_e,2677.0
EX_raffin_e_reverse,2678.0
EX_salcn_e,2774.0
EX_salcn_e_reverse,2775.0
