,0
0,100.0
1,100.0
2,100.0
3,100.0
4,100.0
5,100.0
6,100.0
7,100.0
8,100.0
9,100.0
10,100.0
11,100.0
12,100.0
13,100.0
14,100.0
15,100.0
16,100.0
17,100.0
18,100.0
19,100.0
20,100.0
21,100.0
22,100.0
23,100.0
24,100.0
25,100.0
26,100.0
27,100.0
28,100.0
29,100.0
30,100.0
31,100.0
32,100.0
33,100.0
34,100.0
35,100.0
36,100.0
37,100.0
38,100.0
39,100.0
40,100.0
41,100.0
42,100.0
43,100.0
44,100.0
45,100.0
46,100.0
47,100.0
48,100.0
49,100.0
50,100.0
51,100.0
52,100.0
53,100.0
54,100.0
55,100.0
56,100.0
57,100.0
58,100.0
59,100.0
60,100.0
61,100.0
62,100.0
63,100.0
64,100.0
65,100.0
66,100.0
67,100.0
68,100.0
69,100.0
70,100.0
71,-0.0
72,100.0
73,-0.0
74,100.0
75,-0.0
76,100.0
77,100.0
78,100.0
79,-0.0
80,100.0
81,-0.0
82,100.0
83,-0.0
84,100.0
85,-0.0
86,100.0
87,10.0
88,100.0
89,-0.0
90,100.0
91,-0.0
92,100.0
93,100.0
94,100.0
95,100.0
96,100.0
97,-0.0
98,100.0
99,-0.0
100,100.0
101,100.0
102,100.0
103,100.0
104,100.0
105,100.0
106,100.0
107,-0.0
108,100.0
109,-0.0
110,100.0
111,100.0
112,100.0
113,100.0
114,100.0
115,100.0
116,100.0
117,100.0
118,100.0
119,100.0
120,100.0
121,100.0
122,100.0
123,100.0
124,100.0
125,100.0
126,100.0
127,100.0
128,100.0
129,100.0
130,100.0
131,100.0
132,100.0
133,100.0
134,100.0
135,100.0
136,100.0
137,100.0
138,100.0
139,100.0
140,100.0
141,100.0
142,100.0
143,100.0
144,100.0
145,100.0
146,100.0
147,100.0
148,100.0
149,100.0
150,100.0
151,100.0
152,100.0
153,100.0
