,0
0,4
1,7
2,8
3,10
4,500
5,60
6,40
7,41
8,44
9,409
10,51
11,57
12,212
13,78
14,1464
15,93
16,97
17,104
18,136
19,130
20,600
21,584
22,224
23,225
24,2667
25,617
26,256
27,262
28,2393
29,272
30,279
31,488
32,286
33,304
34,311
35,312
36,318
37,319
38,321
39,418
40,341
41,343
42,1600
43,364
44,369
45,401
46,421
47,428
48,436
49,443
50,516
51,512
52,529
53,528
54,532
55,537
56,541
57,551
58,644
59,586
60,621
61,624
62,633
63,700
64,840
65,846
66,859
67,2368
68,913
69,970
70,1111
71,1478
72,1287
73,2305
74,1571
75,1984
76,1902
77,1935
78,1937
79,2005
80,2099
81,2353
82,2463
83,45
84,1759
85,953
86,1545
87,1396
88,2467
89,1576
90,687
91,96
92,303
93,1704
94,1589
95,949
96,108
97,1032
98,1096
99,1531
100,691
101,186
102,219
103,632
104,1108
105,1444
106,757
107,109
108,203
109,143
110,206
111,1078
112,460
113,188
114,929
115,2485
116,113
117,106
118,98
119,979
120,1067
121,1273
122,209
123,2356
124,444
125,89
126,1310
127,164
128,49
129,854
130,117
131,218
132,468
133,1459
134,1009
135,631
136,613
137,205
138,1542
139,85
140,217
141,281
142,1859
143,99
144,681
145,574
146,1584
147,94
148,105
149,121
150,1048
151,2232
152,84
153,831
154,115
155,1435
156,625
157,412
158,1132
159,1203
160,2500
161,1060
162,838
163,116
164,525
165,761
166,2536
167,194
168,372
169,1968
170,952
171,1599
172,211
173,1582
174,1586
175,112
176,227
177,145
178,499
179,614
180,910
181,70
182,91
183,90
184,215
185,1266
186,981
187,1278
188,1154
189,125
190,991
191,966
192,141
193,722
194,1065
195,1519
196,911
197,330
198,382
199,909
200,1383
201,110
202,1179
203,288
204,1131
205,461
206,1080
207,719
208,1465
209,877
210,119
211,114
212,995
213,229
214,233
215,1181
216,216
217,1277
218,180
219,11
220,12
221,20
222,26
223,27
224,33
225,71
226,76
227,100
228,122
229,128
230,138
231,174
232,196
233,220
234,221
235,245
236,257
237,263
238,290
239,351
240,360
241,398
242,403
243,405
244,413
245,429
246,433
247,440
248,481
249,497
250,509
251,523
252,535
253,536
254,538
255,543
256,550
257,552
258,560
259,577
260,580
261,652
262,656
263,672
264,734
265,769
266,789
267,827
268,905
269,1224
270,1389
271,1438
272,1462
273,1497
274,1528
275,1569
276,1718
277,1719
278,1720
279,1741
280,1813
281,1814
282,1887
283,1892
284,1927
285,1945
286,2001
287,2003
288,2008
289,2012
290,2036
291,2037
292,2041
293,2060
294,2104
295,2167
296,2187
297,2225
298,2259
299,2288
300,2324
301,2392
302,2434
303,2629
304,2702
305,2708
306,81
307,86
308,92
309,180
310,208
311,285
312,317
313,527
314,641
315,699
316,717
317,724
318,734
319,753
320,788
321,790
322,806
323,824
324,860
325,897
326,898
327,899
328,900
329,901
330,982
331,1007
332,1029
333,1030
334,1036
335,1076
336,1102
337,1103
338,1115
339,1116
340,1124
341,1137
342,1140
343,1144
344,1163
345,1177
346,1178
347,1180
348,1201
349,1205
350,1207
351,1264
352,1265
353,1355
354,1362
355,1391
356,1402
357,1424
358,1434
359,1436
360,1463
361,1466
362,1633
363,1656
364,1798
365,1801
366,1802
367,1804
368,1838
369,1839
370,1844
371,1863
372,1883
373,1907
374,1913
375,1959
376,2085
377,2164
378,2188
379,2189
380,2203
381,2207
382,2210
383,2258
384,2304
385,2327
386,2329
387,2330
388,2459
389,2532
390,2533
391,2589
392,2595
393,2605
394,2607
395,2659
396,2660
397,2661
398,2662
399,2704
