%!PS-Adobe-3.0 EPSF-3.0
%%Title: case_urban/fig_schedule.eps
%%Creator: matplotlib version 3.3.2, http://matplotlib.org/
%%CreationDate: Fri Feb 26 14:40:00 2021
%%Orientation: portrait
%%BoundingBox: -18.774999999999977 189.87062499999996 630.775 602.129375
%%EndComments
%%BeginProlog
/mpldict 9 dict def
mpldict begin
/m { moveto } bind def
/l { lineto } bind def
/r { rlineto } bind def
/c { curveto } bind def
/cl { closepath } bind def
/box {
      m
      1 index 0 r
      0 exch r
      neg 0 r
      cl
    } bind def
/clipbox {
      box
      clip
      newpath
    } bind def
%!PS-Adobe-3.0 Resource-Font
%%Title: DejaVu Sans
%%Copyright: Copyright (c) 2003 by Bitstream, Inc. All Rights Reserved. Copyright (c) 2006 by Tavmjong Bah. All Rights Reserved. DejaVu changes are in public domain 
%%Creator: Converted from TrueType to type 3 by PPR
25 dict begin
/_d{bind def}bind def
/_m{moveto}_d
/_l{lineto}_d
/_cl{closepath eofill}_d
/_c{curveto}_d
/_sc{7 -1 roll{setcachedevice}{pop pop pop pop pop pop}ifelse}_d
/_e{exec}_d
/FontName /DejaVuSans def
/PaintType 0 def
/FontMatrix[.001 0 0 .001 0 0]def
/FontBBox[-1021 -463 1793 1232]def
/FontType 3 def
/Encoding [ /space /slash /zero /one /two /four /five /six /seven /eight /W /a /c /d /e /g /h /i /k /m /n /o /p /r /s /t /w /minus ] def
/FontInfo 10 dict dup begin
/FamilyName (DejaVu Sans) def
/FullName (DejaVu Sans) def
/Notice (Copyright (c) 2003 by Bitstream, Inc. All Rights Reserved. Copyright (c) 2006 by Tavmjong Bah. All Rights Reserved. DejaVu changes are in public domain ) def
/Weight (Book) def
/Version (Version 2.35) def
/ItalicAngle 0.0 def
/isFixedPitch false def
/UnderlinePosition -130 def
/UnderlineThickness 90 def
end readonly def
/CharStrings 29 dict dup begin
/.notdef 0 def
/space{318 0 0 0 0 0 _sc
}_d
/slash{337 0 0 -92 337 729 _sc
254 729 _m
337 729 _l
83 -92 _l
0 -92 _l
254 729 _l
_cl}_d
/zero{636 0 66 -13 570 742 _sc
318 664 _m
267 664 229 639 203 589 _c
177 539 165 464 165 364 _c
165 264 177 189 203 139 _c
229 89 267 64 318 64 _c
369 64 407 89 433 139 _c
458 189 471 264 471 364 _c
471 464 458 539 433 589 _c
407 639 369 664 318 664 _c
318 742 _m
399 742 461 709 505 645 _c
548 580 570 486 570 364 _c
570 241 548 147 505 83 _c
461 19 399 -13 318 -13 _c
236 -13 173 19 130 83 _c
87 147 66 241 66 364 _c
66 486 87 580 130 645 _c
173 709 236 742 318 742 _c
_cl}_d
/one{636 0 110 0 544 729 _sc
124 83 _m
285 83 _l
285 639 _l
110 604 _l
110 694 _l
284 729 _l
383 729 _l
383 83 _l
544 83 _l
544 0 _l
124 0 _l
124 83 _l
_cl}_d
/two{{636 0 73 0 536 742 _sc
192 83 _m
536 83 _l
536 0 _l
73 0 _l
73 83 _l
110 121 161 173 226 239 _c
290 304 331 346 348 365 _c
380 400 402 430 414 455 _c
426 479 433 504 433 528 _c
433 566 419 598 392 622 _c
365 646 330 659 286 659 _c
255 659 222 653 188 643 _c
154 632 117 616 78 594 _c
78 694 _l
118 710 155 722 189 730 _c
223 738 255 742 284 742 _c
}_e{359 742 419 723 464 685 _c
509 647 532 597 532 534 _c
532 504 526 475 515 449 _c
504 422 484 390 454 354 _c
446 344 420 317 376 272 _c
332 227 271 164 192 83 _c
_cl}_e}_d
/four{636 0 49 0 580 729 _sc
378 643 _m
129 254 _l
378 254 _l
378 643 _l
352 729 _m
476 729 _l
476 254 _l
580 254 _l
580 172 _l
476 172 _l
476 0 _l
378 0 _l
378 172 _l
49 172 _l
49 267 _l
352 729 _l
_cl}_d
/five{{636 0 77 -13 549 729 _sc
108 729 _m
495 729 _l
495 646 _l
198 646 _l
198 467 _l
212 472 227 476 241 478 _c
255 480 270 482 284 482 _c
365 482 429 459 477 415 _c
525 370 549 310 549 234 _c
549 155 524 94 475 51 _c
426 8 357 -13 269 -13 _c
238 -13 207 -10 175 -6 _c
143 -1 111 6 77 17 _c
77 116 _l
106 100 136 88 168 80 _c
199 72 232 69 267 69 _c
}_e{323 69 368 83 401 113 _c
433 143 450 183 450 234 _c
450 284 433 324 401 354 _c
368 384 323 399 267 399 _c
241 399 214 396 188 390 _c
162 384 135 375 108 363 _c
108 729 _l
_cl}_e}_d
/six{{636 0 70 -13 573 742 _sc
330 404 _m
286 404 251 388 225 358 _c
199 328 186 286 186 234 _c
186 181 199 139 225 109 _c
251 79 286 64 330 64 _c
374 64 409 79 435 109 _c
461 139 474 181 474 234 _c
474 286 461 328 435 358 _c
409 388 374 404 330 404 _c
526 713 _m
526 623 _l
501 635 476 644 451 650 _c
425 656 400 659 376 659 _c
310 659 260 637 226 593 _c
}_e{192 549 172 482 168 394 _c
187 422 211 444 240 459 _c
269 474 301 482 336 482 _c
409 482 467 459 509 415 _c
551 371 573 310 573 234 _c
573 159 550 99 506 54 _c
462 9 403 -13 330 -13 _c
246 -13 181 19 137 83 _c
92 147 70 241 70 364 _c
70 479 97 571 152 639 _c
206 707 280 742 372 742 _c
396 742 421 739 447 735 _c
472 730 498 723 526 713 _c
_cl}_e}_d
/seven{636 0 82 0 551 729 _sc
82 729 _m
551 729 _l
551 687 _l
286 0 _l
183 0 _l
432 646 _l
82 646 _l
82 729 _l
_cl}_d
/eight{{636 0 68 -13 568 742 _sc
318 346 _m
271 346 234 333 207 308 _c
180 283 167 249 167 205 _c
167 161 180 126 207 101 _c
234 76 271 64 318 64 _c
364 64 401 76 428 102 _c
455 127 469 161 469 205 _c
469 249 455 283 429 308 _c
402 333 365 346 318 346 _c
219 388 _m
177 398 144 418 120 447 _c
96 476 85 511 85 553 _c
85 611 105 657 147 691 _c
188 725 245 742 318 742 _c
}_e{390 742 447 725 489 691 _c
530 657 551 611 551 553 _c
551 511 539 476 515 447 _c
491 418 459 398 417 388 _c
464 377 501 355 528 323 _c
554 291 568 251 568 205 _c
568 134 546 80 503 43 _c
459 5 398 -13 318 -13 _c
237 -13 175 5 132 43 _c
89 80 68 134 68 205 _c
68 251 81 291 108 323 _c
134 355 171 377 219 388 _c
183 544 _m
183 506 194 476 218 455 _c
}_e{242 434 275 424 318 424 _c
360 424 393 434 417 455 _c
441 476 453 506 453 544 _c
453 582 441 611 417 632 _c
393 653 360 664 318 664 _c
275 664 242 653 218 632 _c
194 611 183 582 183 544 _c
_cl}_e}_d
/W{989 0 33 0 956 729 _sc
33 729 _m
133 729 _l
286 113 _l
439 729 _l
550 729 _l
703 113 _l
856 729 _l
956 729 _l
773 0 _l
649 0 _l
495 633 _l
340 0 _l
216 0 _l
33 729 _l
_cl}_d
/a{{613 0 60 -13 522 560 _sc
343 275 _m
270 275 220 266 192 250 _c
164 233 150 205 150 165 _c
150 133 160 107 181 89 _c
202 70 231 61 267 61 _c
317 61 357 78 387 114 _c
417 149 432 196 432 255 _c
432 275 _l
343 275 _l
522 312 _m
522 0 _l
432 0 _l
432 83 _l
411 49 385 25 355 10 _c
325 -5 287 -13 243 -13 _c
187 -13 142 2 109 33 _c
76 64 60 106 60 159 _c
}_e{60 220 80 266 122 298 _c
163 329 224 345 306 345 _c
432 345 _l
432 354 _l
432 395 418 427 391 450 _c
364 472 326 484 277 484 _c
245 484 215 480 185 472 _c
155 464 127 453 100 439 _c
100 522 _l
132 534 164 544 195 550 _c
226 556 256 560 286 560 _c
365 560 424 539 463 498 _c
502 457 522 395 522 312 _c
_cl}_e}_d
/c{{550 0 55 -13 488 560 _sc
488 526 _m
488 442 _l
462 456 437 466 411 473 _c
385 480 360 484 334 484 _c
276 484 230 465 198 428 _c
166 391 150 339 150 273 _c
150 206 166 154 198 117 _c
230 80 276 62 334 62 _c
360 62 385 65 411 72 _c
437 79 462 90 488 104 _c
488 21 _l
462 9 436 0 410 -5 _c
383 -10 354 -13 324 -13 _c
242 -13 176 12 128 64 _c
}_e{79 115 55 185 55 273 _c
55 362 79 432 128 483 _c
177 534 244 560 330 560 _c
358 560 385 557 411 551 _c
437 545 463 537 488 526 _c
_cl}_e}_d
/d{{635 0 55 -13 544 760 _sc
454 464 _m
454 760 _l
544 760 _l
544 0 _l
454 0 _l
454 82 _l
435 49 411 25 382 10 _c
353 -5 319 -13 279 -13 _c
213 -13 159 13 117 65 _c
75 117 55 187 55 273 _c
55 359 75 428 117 481 _c
159 533 213 560 279 560 _c
319 560 353 552 382 536 _c
411 520 435 496 454 464 _c
148 273 _m
148 207 161 155 188 117 _c
215 79 253 61 301 61 _c
}_e{348 61 385 79 413 117 _c
440 155 454 207 454 273 _c
454 339 440 390 413 428 _c
385 466 348 485 301 485 _c
253 485 215 466 188 428 _c
161 390 148 339 148 273 _c
_cl}_e}_d
/e{{615 0 55 -13 562 560 _sc
562 296 _m
562 252 _l
149 252 _l
153 190 171 142 205 110 _c
238 78 284 62 344 62 _c
378 62 412 66 444 74 _c
476 82 509 95 541 113 _c
541 28 _l
509 14 476 3 442 -3 _c
408 -9 373 -13 339 -13 _c
251 -13 182 12 131 62 _c
80 112 55 181 55 268 _c
55 357 79 428 127 481 _c
175 533 241 560 323 560 _c
397 560 455 536 498 489 _c
}_e{540 441 562 377 562 296 _c
472 322 _m
471 371 457 410 431 440 _c
404 469 368 484 324 484 _c
274 484 234 469 204 441 _c
174 413 156 373 152 322 _c
472 322 _l
_cl}_e}_d
/g{{635 0 55 -207 544 560 _sc
454 280 _m
454 344 440 395 414 431 _c
387 467 349 485 301 485 _c
253 485 215 467 188 431 _c
161 395 148 344 148 280 _c
148 215 161 165 188 129 _c
215 93 253 75 301 75 _c
349 75 387 93 414 129 _c
440 165 454 215 454 280 _c
544 68 _m
544 -24 523 -93 482 -139 _c
440 -184 377 -207 292 -207 _c
260 -207 231 -204 203 -200 _c
175 -195 147 -188 121 -178 _c
}_e{121 -91 _l
147 -105 173 -115 199 -122 _c
225 -129 251 -133 278 -133 _c
336 -133 380 -117 410 -87 _c
439 -56 454 -10 454 52 _c
454 96 _l
435 64 411 40 382 24 _c
353 8 319 0 279 0 _c
211 0 157 25 116 76 _c
75 127 55 195 55 280 _c
55 364 75 432 116 483 _c
157 534 211 560 279 560 _c
319 560 353 552 382 536 _c
411 520 435 496 454 464 _c
454 547 _l
544 547 _l
}_e{544 68 _l
_cl}_e}_d
/h{634 0 91 0 549 760 _sc
549 330 _m
549 0 _l
459 0 _l
459 327 _l
459 379 448 417 428 443 _c
408 469 378 482 338 482 _c
289 482 251 466 223 435 _c
195 404 181 362 181 309 _c
181 0 _l
91 0 _l
91 760 _l
181 760 _l
181 462 _l
202 494 227 519 257 535 _c
286 551 320 560 358 560 _c
420 560 468 540 500 501 _c
532 462 549 405 549 330 _c
_cl}_d
/i{278 0 94 0 184 760 _sc
94 547 _m
184 547 _l
184 0 _l
94 0 _l
94 547 _l
94 760 _m
184 760 _l
184 646 _l
94 646 _l
94 760 _l
_cl}_d
/k{579 0 91 0 576 760 _sc
91 760 _m
181 760 _l
181 311 _l
449 547 _l
564 547 _l
274 291 _l
576 0 _l
459 0 _l
181 267 _l
181 0 _l
91 0 _l
91 760 _l
_cl}_d
/m{{974 0 91 0 889 560 _sc
520 442 _m
542 482 569 511 600 531 _c
631 550 668 560 711 560 _c
767 560 811 540 842 500 _c
873 460 889 403 889 330 _c
889 0 _l
799 0 _l
799 327 _l
799 379 789 418 771 444 _c
752 469 724 482 686 482 _c
639 482 602 466 575 435 _c
548 404 535 362 535 309 _c
535 0 _l
445 0 _l
445 327 _l
445 379 435 418 417 444 _c
398 469 369 482 331 482 _c
}_e{285 482 248 466 221 435 _c
194 404 181 362 181 309 _c
181 0 _l
91 0 _l
91 547 _l
181 547 _l
181 462 _l
201 495 226 520 255 536 _c
283 552 317 560 357 560 _c
397 560 430 550 458 530 _c
486 510 506 480 520 442 _c
_cl}_e}_d
/n{634 0 91 0 549 560 _sc
549 330 _m
549 0 _l
459 0 _l
459 327 _l
459 379 448 417 428 443 _c
408 469 378 482 338 482 _c
289 482 251 466 223 435 _c
195 404 181 362 181 309 _c
181 0 _l
91 0 _l
91 547 _l
181 547 _l
181 462 _l
202 494 227 519 257 535 _c
286 551 320 560 358 560 _c
420 560 468 540 500 501 _c
532 462 549 405 549 330 _c
_cl}_d
/o{612 0 55 -13 557 560 _sc
306 484 _m
258 484 220 465 192 427 _c
164 389 150 338 150 273 _c
150 207 163 156 191 118 _c
219 80 257 62 306 62 _c
354 62 392 80 420 118 _c
448 156 462 207 462 273 _c
462 337 448 389 420 427 _c
392 465 354 484 306 484 _c
306 560 _m
384 560 445 534 490 484 _c
534 433 557 363 557 273 _c
557 183 534 113 490 63 _c
445 12 384 -13 306 -13 _c
227 -13 165 12 121 63 _c
77 113 55 183 55 273 _c
55 363 77 433 121 484 _c
165 534 227 560 306 560 _c
_cl}_d
/p{{635 0 91 -207 580 560 _sc
181 82 _m
181 -207 _l
91 -207 _l
91 547 _l
181 547 _l
181 464 _l
199 496 223 520 252 536 _c
281 552 316 560 356 560 _c
422 560 476 533 518 481 _c
559 428 580 359 580 273 _c
580 187 559 117 518 65 _c
476 13 422 -13 356 -13 _c
316 -13 281 -5 252 10 _c
223 25 199 49 181 82 _c
487 273 _m
487 339 473 390 446 428 _c
418 466 381 485 334 485 _c
}_e{286 485 249 466 222 428 _c
194 390 181 339 181 273 _c
181 207 194 155 222 117 _c
249 79 286 61 334 61 _c
381 61 418 79 446 117 _c
473 155 487 207 487 273 _c
_cl}_e}_d
/r{411 0 91 0 411 560 _sc
411 463 _m
401 469 390 473 378 476 _c
366 478 353 480 339 480 _c
288 480 249 463 222 430 _c
194 397 181 350 181 288 _c
181 0 _l
91 0 _l
91 547 _l
181 547 _l
181 462 _l
199 495 224 520 254 536 _c
284 552 321 560 365 560 _c
371 560 378 559 386 559 _c
393 558 401 557 411 555 _c
411 463 _l
_cl}_d
/s{{521 0 54 -13 472 560 _sc
443 531 _m
443 446 _l
417 458 391 468 364 475 _c
336 481 308 485 279 485 _c
234 485 200 478 178 464 _c
156 450 145 430 145 403 _c
145 382 153 366 169 354 _c
185 342 217 330 265 320 _c
296 313 _l
360 299 405 279 432 255 _c
458 230 472 195 472 151 _c
472 100 452 60 412 31 _c
372 1 316 -13 246 -13 _c
216 -13 186 -10 154 -5 _c
}_e{122 0 89 8 54 20 _c
54 113 _l
87 95 120 82 152 74 _c
184 65 216 61 248 61 _c
290 61 323 68 346 82 _c
368 96 380 117 380 144 _c
380 168 371 187 355 200 _c
339 213 303 226 247 238 _c
216 245 _l
160 257 119 275 95 299 _c
70 323 58 356 58 399 _c
58 450 76 490 112 518 _c
148 546 200 560 268 560 _c
301 560 332 557 362 552 _c
391 547 418 540 443 531 _c
}_e{_cl}_e}_d
/t{392 0 27 0 368 702 _sc
183 702 _m
183 547 _l
368 547 _l
368 477 _l
183 477 _l
183 180 _l
183 135 189 106 201 94 _c
213 81 238 75 276 75 _c
368 75 _l
368 0 _l
276 0 _l
206 0 158 13 132 39 _c
106 65 93 112 93 180 _c
93 477 _l
27 477 _l
27 547 _l
93 547 _l
93 702 _l
183 702 _l
_cl}_d
/w{818 0 42 0 776 547 _sc
42 547 _m
132 547 _l
244 120 _l
356 547 _l
462 547 _l
574 120 _l
686 547 _l
776 547 _l
633 0 _l
527 0 _l
409 448 _l
291 0 _l
185 0 _l
42 547 _l
_cl}_d
/minus{838 0 106 272 732 355 _sc
106 355 _m
732 355 _l
732 272 _l
106 272 _l
106 355 _l
_cl}_d
end readonly def

/BuildGlyph
 {exch begin
 CharStrings exch
 2 copy known not{pop /.notdef}if
 true 3 1 roll get exec
 end}_d

/BuildChar {
 1 index /Encoding get exch get
 1 index /BuildGlyph get exec
}_d

FontName currentdict end definefont pop
%!PS-Adobe-3.0 Resource-Font
%%Title: DejaVu Sans Oblique
%%Copyright: Copyright (c) 2003 by Bitstream, Inc. All Rights Reserved. Copyright (c) 2006 by Tavmjong Bah. All Rights Reserved. DejaVu changes are in public domain 
%%Creator: Converted from TrueType to type 3 by PPR
25 dict begin
/_d{bind def}bind def
/_m{moveto}_d
/_l{lineto}_d
/_cl{closepath eofill}_d
/_c{curveto}_d
/_sc{7 -1 roll{setcachedevice}{pop pop pop pop pop pop}ifelse}_d
/_e{exec}_d
/FontName /DejaVuSans-Oblique def
/PaintType 0 def
/FontMatrix[.001 0 0 .001 0 0]def
/FontBBox[-1016 -350 1659 1068]def
/FontType 3 def
/Encoding [ /P ] def
/FontInfo 10 dict dup begin
/FamilyName (DejaVu Sans) def
/FullName (DejaVu Sans Oblique) def
/Notice (Copyright (c) 2003 by Bitstream, Inc. All Rights Reserved. Copyright (c) 2006 by Tavmjong Bah. All Rights Reserved. DejaVu changes are in public domain ) def
/Weight (Oblique) def
/Version (Version 2.35) def
/ItalicAngle -11.0 def
/isFixedPitch false def
/UnderlinePosition -130 def
/UnderlineThickness 90 def
end readonly def
/CharStrings 2 dict dup begin
/.notdef 0 def
/P{603 0 27 0 601 729 _sc
169 729 _m
397 729 _l
463 729 514 713 549 682 _c
583 651 601 606 601 547 _c
601 467 575 404 524 360 _c
472 315 400 293 307 293 _c
183 293 _l
126 0 _l
27 0 _l
169 729 _l
252 648 _m
199 374 _l
323 374 _l
379 374 422 388 452 417 _c
482 445 497 486 497 540 _c
497 574 486 600 466 619 _c
446 638 417 648 381 648 _c
252 648 _l
_cl}_d
end readonly def

/BuildGlyph
 {exch begin
 CharStrings exch
 2 copy known not{pop /.notdef}if
 true 3 1 roll get exec
 end}_d

/BuildChar {
 1 index /Encoding get exch get
 1 index /BuildGlyph get exec
}_d

FontName currentdict end definefont pop
end
%%EndProlog
mpldict begin
-18.775 189.871 translate
649.55 412.259 0 0 clipbox
gsave
0 0 m
649.55 0 l
649.55 412.25875 l
0 412.25875 l
cl
grestore
gsave
98.746875 72.41875 m
545.146875 72.41875 l
545.146875 405.05875 l
98.746875 405.05875 l
cl
grestore
1.000 setlinewidth
0 setlinejoin
0 setlinecap
[] 0 setdash
0.690 0.769 0.871 setrgbcolor
gsave
446.4 332.6 98.75 72.42 clipbox
98.746875 72.41875 m
98.746875 405.05875 l
102.692841 392.38675 l
125.002723 348.03475 l
149.84207 319.52275 l
159.150501 303.68275 l
173.113149 291.01075 l
211.965733 265.66675 l
255.6243 208.64275 l
291.542705 148.45075 l
294.729831 123.10675 l
303.279423 116.77075 l
325.285769 100.93075 l
337.578969 97.76275 l
342.840257 72.41875 l
348.961562 75.58675 l
363.834817 88.25875 l
375.318589 113.60275 l
391.557754 154.78675 l
421.860746 161.12275 l
428.690302 148.45075 l
437.290483 157.95475 l
447.104808 157.95475 l
463.799278 186.46675 l
496.22702 275.17075 l
501.842433 272.00275 l
526.074708 230.81875 l
535.33255 221.31475 l
545.146875 205.47475 l
545.146875 72.41875 l
cl
gsave
fill
grestore
stroke
grestore
0.800 setlinewidth
1 setlinejoin
0.000 setgray
gsave
/o {
gsave
newpath
translate
0.8 setlinewidth
1 setlinejoin
0 setlinecap
0 0 m
0 -3.5 l

gsave
0.000 setgray
fill
grestore
stroke
grestore
} bind def
98.7469 72.4188 o
grestore
/DejaVuSans findfont
28.000 scalefont
setfont
gsave
89.840625 44.137500 translate
0.000000 rotate
0.000000 0 m /zero glyphshow
grestore
gsave
/o {
gsave
newpath
translate
0.8 setlinewidth
1 setlinejoin
0 setlinecap
0 0 m
0 -3.5 l

gsave
0.000 setgray
fill
grestore
stroke
grestore
} bind def
199.925 72.4188 o
grestore
gsave
191.019229 44.137500 translate
0.000000 rotate
0.000000 0 m /two glyphshow
grestore
gsave
/o {
gsave
newpath
translate
0.8 setlinewidth
1 setlinejoin
0 setlinecap
0 0 m
0 -3.5 l

gsave
0.000 setgray
fill
grestore
stroke
grestore
} bind def
301.104 72.4188 o
grestore
gsave
292.197833 44.137500 translate
0.000000 rotate
0.000000 0 m /four glyphshow
grestore
gsave
/o {
gsave
newpath
translate
0.8 setlinewidth
1 setlinejoin
0 setlinecap
0 0 m
0 -3.5 l

gsave
0.000 setgray
fill
grestore
stroke
grestore
} bind def
402.283 72.4188 o
grestore
gsave
393.376436 44.137500 translate
0.000000 rotate
0.000000 0 m /six glyphshow
grestore
gsave
/o {
gsave
newpath
translate
0.8 setlinewidth
1 setlinejoin
0 setlinecap
0 0 m
0 -3.5 l

gsave
0.000 setgray
fill
grestore
stroke
grestore
} bind def
503.461 72.4188 o
grestore
gsave
494.555040 44.137500 translate
0.000000 rotate
0.000000 0 m /eight glyphshow
grestore
gsave
227.235938 13.028125 translate
0.000000 rotate
0.000000 0 m /d glyphshow
17.773438 0 m /i glyphshow
25.552734 0 m /s glyphshow
40.140625 0 m /t glyphshow
51.119141 0 m /a glyphshow
68.277344 0 m /n glyphshow
86.023438 0 m /c glyphshow
101.417969 0 m /e glyphshow
118.644531 0 m /space glyphshow
127.544922 0 m /slash glyphshow
136.978516 0 m /space glyphshow
145.878906 0 m /k glyphshow
162.093750 0 m /m glyphshow
grestore
gsave
/o {
gsave
newpath
translate
0.8 setlinewidth
1 setlinejoin
0 setlinecap
-0 0 m
-3.5 0 l

gsave
0.000 setgray
fill
grestore
stroke
grestore
} bind def
98.7469 72.4188 o
grestore
0.690 0.769 0.871 setrgbcolor
gsave
73.934375 61.778125 translate
0.000000 rotate
0.000000 0 m /zero glyphshow
grestore
0.000 setgray
gsave
/o {
gsave
newpath
translate
0.8 setlinewidth
1 setlinejoin
0 setlinecap
-0 0 m
-3.5 0 l

gsave
0.000 setgray
fill
grestore
stroke
grestore
} bind def
98.7469 151.619 o
grestore
0.690 0.769 0.871 setrgbcolor
gsave
56.121875 140.978125 translate
0.000000 rotate
0.000000 0 m /two glyphshow
17.814453 0 m /five glyphshow
grestore
0.000 setgray
gsave
/o {
gsave
newpath
translate
0.8 setlinewidth
1 setlinejoin
0 setlinecap
-0 0 m
-3.5 0 l

gsave
0.000 setgray
fill
grestore
stroke
grestore
} bind def
98.7469 230.819 o
grestore
0.690 0.769 0.871 setrgbcolor
gsave
56.121875 220.178125 translate
0.000000 rotate
0.000000 0 m /five glyphshow
17.814453 0 m /zero glyphshow
grestore
0.000 setgray
gsave
/o {
gsave
newpath
translate
0.8 setlinewidth
1 setlinejoin
0 setlinecap
-0 0 m
-3.5 0 l

gsave
0.000 setgray
fill
grestore
stroke
grestore
} bind def
98.7469 310.019 o
grestore
0.690 0.769 0.871 setrgbcolor
gsave
56.121875 299.378125 translate
0.000000 rotate
0.000000 0 m /seven glyphshow
17.814453 0 m /five glyphshow
grestore
0.000 setgray
gsave
/o {
gsave
newpath
translate
0.8 setlinewidth
1 setlinejoin
0 setlinecap
-0 0 m
-3.5 0 l

gsave
0.000 setgray
fill
grestore
stroke
grestore
} bind def
98.7469 389.219 o
grestore
0.690 0.769 0.871 setrgbcolor
gsave
38.309375 378.578125 translate
0.000000 rotate
0.000000 0 m /one glyphshow
17.814453 0 m /zero glyphshow
35.628906 0 m /zero glyphshow
grestore
gsave
28.481250 166.832500 translate
90.000000 rotate
0.000000 0 m /h glyphshow
17.746094 0 m /e glyphshow
34.972656 0 m /i glyphshow
42.751953 0 m /g glyphshow
60.525391 0 m /h glyphshow
78.271484 0 m /t glyphshow
89.250000 0 m /space glyphshow
98.150391 0 m /slash glyphshow
107.583984 0 m /space glyphshow
116.484375 0 m /m glyphshow
grestore
0 setlinejoin
2 setlinecap
0.000 setgray
gsave
98.746875 72.41875 m
98.746875 405.05875 l
stroke
grestore
gsave
545.146875 72.41875 m
545.146875 405.05875 l
stroke
grestore
gsave
98.746875 72.41875 m
545.146875 72.41875 l
stroke
grestore
gsave
98.746875 405.05875 m
545.146875 405.05875 l
stroke
grestore
1 setlinejoin
0 setlinecap
gsave
/o {
gsave
newpath
translate
0.8 setlinewidth
1 setlinejoin
0 setlinecap
0 0 m
3.5 0 l

gsave
0.000 setgray
fill
grestore
stroke
grestore
} bind def
545.147 134.325 o
grestore
gsave
552.146875 123.684282 translate
0.000000 rotate
0.000000 0 m /minus glyphshow
23.460938 0 m /two glyphshow
41.275391 0 m /zero glyphshow
grestore
gsave
/o {
gsave
newpath
translate
0.8 setlinewidth
1 setlinejoin
0 setlinecap
0 0 m
3.5 0 l

gsave
0.000 setgray
fill
grestore
stroke
grestore
} bind def
545.147 213.605 o
grestore
gsave
552.146875 202.964192 translate
0.000000 rotate
0.000000 0 m /minus glyphshow
23.460938 0 m /one glyphshow
41.275391 0 m /zero glyphshow
grestore
gsave
/o {
gsave
newpath
translate
0.8 setlinewidth
1 setlinejoin
0 setlinecap
0 0 m
3.5 0 l

gsave
0.000 setgray
fill
grestore
stroke
grestore
} bind def
545.147 292.885 o
grestore
gsave
552.146875 282.244101 translate
0.000000 rotate
0.000000 0 m /zero glyphshow
grestore
gsave
/o {
gsave
newpath
translate
0.8 setlinewidth
1 setlinejoin
0 setlinecap
0 0 m
3.5 0 l

gsave
0.000 setgray
fill
grestore
stroke
grestore
} bind def
545.147 372.165 o
grestore
gsave
552.146875 361.524010 translate
0.000000 rotate
0.000000 0 m /one glyphshow
17.814453 0 m /zero glyphshow
grestore
gsave
636.521875 159.879375 translate
90.000000 rotate
0.000000 0 m /p glyphshow
17.773438 0 m /o glyphshow
34.904297 0 m /w glyphshow
57.804688 0 m /e glyphshow
75.031250 0 m /r glyphshow
86.542969 0 m /space glyphshow
95.443359 0 m /slash glyphshow
104.876953 0 m /space glyphshow
113.777344 0 m /k glyphshow
129.992188 0 m /W glyphshow
grestore
3.000 setlinewidth
2 setlinecap
gsave
446.4 332.6 98.75 72.42 clipbox
98.746875 292.884726 m
98.746875 292.884726 l
102.692841 292.884726 l
102.692841 292.884726 l
125.002723 292.884726 l
125.002723 292.884726 l
149.84207 292.884726 l
149.84207 292.884726 l
159.150501 292.884726 l
159.150501 292.884726 l
173.113149 292.884726 l
173.113149 297.555634 l
211.965733 297.555634 l
211.965733 292.884726 l
255.6243 292.884726 l
255.6243 292.884726 l
291.542705 292.884726 l
291.542705 292.884726 l
294.729831 292.884726 l
294.729831 294.990048 l
303.279423 294.990048 l
303.279423 295.606669 l
325.285769 295.606669 l
325.285769 309.007176 l
337.578969 309.007176 l
337.578969 292.884726 l
342.840257 292.884726 l
342.840257 331.480828 l
348.961562 331.480828 l
348.961562 341.170595 l
363.834817 341.170595 l
363.834817 380.41415 l
375.318589 380.41415 l
375.318589 389.93875 l
391.557754 389.93875 l
391.557754 322.539816 l
421.860746 322.539816 l
421.860746 292.884726 l
428.690302 292.884726 l
428.690302 348.514997 l
437.290483 348.514997 l
437.290483 311.901537 l
447.104808 311.901537 l
447.104808 292.884726 l
463.799278 292.884726 l
463.799278 292.884726 l
496.22702 292.884726 l
496.22702 292.884726 l
501.842433 292.884726 l
501.842433 292.884726 l
526.074708 292.884726 l
526.074708 292.884726 l
535.33255 292.884726 l
535.33255 292.884726 l
545.146875 292.884726 l
stroke
grestore
0 setlinecap
[11.1 4.8] 0 setdash
1.000 0.000 0.000 setrgbcolor
gsave
446.4 332.6 98.75 72.42 clipbox
98.746875 223.382672 m
98.746875 223.382672 l
102.692841 223.382672 l
102.692841 258.772343 l
125.002723 258.772343 l
125.002723 283.117881 l
149.84207 283.117881 l
149.84207 267.0637 l
159.150501 267.0637 l
159.150501 290.076896 l
173.113149 290.076896 l
173.113149 292.805446 l
211.965733 292.805446 l
211.965733 278.526253 l
255.6243 278.526253 l
255.6243 267.812454 l
291.542705 267.812454 l
291.542705 87.53875 l
294.729831 87.53875 l
294.729831 292.805446 l
303.279423 292.805446 l
303.279423 292.805446 l
325.285769 292.805446 l
325.285769 292.805446 l
337.578969 292.805446 l
337.578969 177.092014 l
342.840257 177.092014 l
342.840257 292.805446 l
348.961562 292.805446 l
348.961562 292.805446 l
363.834817 292.805446 l
363.834817 292.805446 l
375.318589 292.805446 l
375.318589 292.805446 l
391.557754 292.805446 l
391.557754 292.805446 l
421.860746 292.805446 l
421.860746 262.615216 l
428.690302 262.615216 l
428.690302 292.805446 l
437.290483 292.805446 l
437.290483 297.376609 l
447.104808 297.376609 l
447.104808 365.888309 l
463.799278 365.888309 l
463.799278 351.076179 l
496.22702 351.076179 l
496.22702 300.04194 l
501.842433 300.04194 l
501.842433 273.983074 l
526.074708 273.983074 l
526.074708 286.630422 l
535.33255 286.630422 l
535.33255 269.607264 l
545.146875 269.607264 l
stroke
grestore
0.500 setlinewidth
2 setlinecap
[] 0 setdash
0.000 setgray
gsave
446.4 332.6 98.75 72.42 clipbox
98.746875 292.884726 m
545.146875 292.884726 l
stroke
grestore
0.800 setlinewidth
0 setlinejoin
gsave
98.746875 72.41875 m
98.746875 405.05875 l
stroke
grestore
gsave
545.146875 72.41875 m
545.146875 405.05875 l
stroke
grestore
gsave
98.746875 72.41875 m
545.146875 72.41875 l
stroke
grestore
gsave
98.746875 405.05875 m
545.146875 405.05875 l
stroke
grestore
1.000 setlinewidth
0 setlinecap
0.800 setgray
gsave
350.946875 86.41875 m
525.546875 86.41875 l
529.280208 86.41875 531.146875 88.285417 531.146875 92.01875 c
531.146875 174.609375 l
531.146875 178.342708 529.280208 180.209375 525.546875 180.209375 c
350.946875 180.209375 l
347.213542 180.209375 345.346875 178.342708 345.346875 174.609375 c
345.346875 92.01875 l
345.346875 88.285417 347.213542 86.41875 350.946875 86.41875 c
cl
gsave
1.000 setgray
fill
grestore
stroke
grestore
3.000 setlinewidth
1 setlinejoin
2 setlinecap
0.000 setgray
gsave
356.546875 157.528125 m
412.546875 157.528125 l
stroke
grestore
gsave
434.946875 147.728125 translate
0.000000 rotate
/DejaVuSans-Oblique findfont
28.0 scalefont
setfont
0.000000 0.593750 moveto
/P glyphshow
/DejaVuSans findfont
19.599999999999998 scalefont
setfont
16.884766 -4.000000 moveto
/e glyphshow
28.943359 -4.000000 moveto
/n glyphshow
41.365625 -4.000000 moveto
/g glyphshow
53.807031 -4.000000 moveto
/i glyphshow
59.252539 -4.000000 moveto
/n glyphshow
71.674805 -4.000000 moveto
/e glyphshow

grestore
0 setlinecap
[11.1 4.8] 0 setdash
1.000 0.000 0.000 setrgbcolor
gsave
356.546875 113.246875 m
412.546875 113.246875 l
stroke
grestore
0.000 setgray
gsave
434.946875 103.446875 translate
0.000000 rotate
/DejaVuSans-Oblique findfont
28.0 scalefont
setfont
0.000000 0.593750 moveto
/P glyphshow
/DejaVuSans findfont
19.599999999999998 scalefont
setfont
16.884766 -4.000000 moveto
/m glyphshow
35.977539 -4.000000 moveto
/o glyphshow
47.969141 -4.000000 moveto
/t glyphshow
55.654102 -4.000000 moveto
/o glyphshow
67.645703 -4.000000 moveto
/r glyphshow

grestore

end
showpage
