%!PS-Adobe-3.0 EPSF-3.0
%%Title: case_illustration/fig_map.eps
%%Creator: matplotlib version 3.3.2, http://matplotlib.org/
%%CreationDate: Fri Feb 26 21:03:09 2021
%%Orientation: portrait
%%BoundingBox: 10.800000000000026 172.8 601.2 619.2
%%EndComments
%%BeginProlog
/mpldict 8 dict def
mpldict begin
/m { moveto } bind def
/l { lineto } bind def
/r { rlineto } bind def
/c { curveto } bind def
/cl { closepath } bind def
/box {
      m
      1 index 0 r
      0 exch r
      neg 0 r
      cl
    } bind def
/clipbox {
      box
      clip
      newpath
    } bind def
%!PS-Adobe-3.0 Resource-Font
%%Title: DejaVu Sans
%%Copyright: Copyright (c) 2003 by Bitstream, Inc. All Rights Reserved. Copyright (c) 2006 by Tavmjong Bah. All Rights Reserved. DejaVu changes are in public domain 
%%Creator: Converted from TrueType to type 3 by PPR
25 dict begin
/_d{bind def}bind def
/_m{moveto}_d
/_l{lineto}_d
/_cl{closepath eofill}_d
/_c{curveto}_d
/_sc{7 -1 roll{setcachedevice}{pop pop pop pop pop pop}ifelse}_d
/_e{exec}_d
/FontName /DejaVuSans def
/PaintType 0 def
/FontMatrix[.001 0 0 .001 0 0]def
/FontBBox[-1021 -463 1793 1232]def
/FontType 3 def
/Encoding [ /E /S ] def
/FontInfo 10 dict dup begin
/FamilyName (DejaVu Sans) def
/FullName (DejaVu Sans) def
/Notice (Copyright (c) 2003 by Bitstream, Inc. All Rights Reserved. Copyright (c) 2006 by Tavmjong Bah. All Rights Reserved. DejaVu changes are in public domain ) def
/Weight (Book) def
/Version (Version 2.35) def
/ItalicAngle 0.0 def
/isFixedPitch false def
/UnderlinePosition -130 def
/UnderlineThickness 90 def
end readonly def
/CharStrings 3 dict dup begin
/.notdef 0 def
/E{632 0 98 0 568 729 _sc
98 729 _m
559 729 _l
559 646 _l
197 646 _l
197 430 _l
544 430 _l
544 347 _l
197 347 _l
197 83 _l
568 83 _l
568 0 _l
98 0 _l
98 729 _l
_cl}_d
/S{{635 0 66 -13 579 742 _sc
535 705 _m
535 609 _l
497 627 462 640 429 649 _c
395 657 363 662 333 662 _c
279 662 237 651 208 631 _c
179 610 165 580 165 542 _c
165 510 174 485 194 469 _c
213 452 250 439 304 429 _c
364 417 _l
437 403 491 378 526 343 _c
561 307 579 260 579 201 _c
579 130 555 77 508 41 _c
460 5 391 -13 300 -13 _c
265 -13 228 -9 189 -2 _c
}_e{150 5 110 16 69 32 _c
69 134 _l
109 111 148 94 186 83 _c
224 71 262 66 300 66 _c
356 66 399 77 430 99 _c
460 121 476 152 476 194 _c
476 230 465 258 443 278 _c
421 298 385 313 335 323 _c
275 335 _l
201 349 148 372 115 404 _c
82 435 66 478 66 534 _c
66 598 88 649 134 686 _c
179 723 242 742 322 742 _c
356 742 390 739 426 733 _c
461 727 497 717 535 705 _c
}_e{_cl}_e}_d
end readonly def

/BuildGlyph
 {exch begin
 CharStrings exch
 2 copy known not{pop /.notdef}if
 true 3 1 roll get exec
 end}_d

/BuildChar {
 1 index /Encoding get exch get
 1 index /BuildGlyph get exec
}_d

FontName currentdict end definefont pop
end
%%EndProlog
mpldict begin
10.8 172.8 translate
590.4 446.4 0 0 clipbox
gsave
0 0 m
590.4 0 l
590.4 446.4 l
0 446.4 l
cl
grestore
1.000 setlinewidth
1 setlinejoin
0 setlinecap
[] 0 setdash
0.000 setgray
gsave
576 432 7.2 7.2 clipbox
33.381818 157.745455 m
138.109091 288.654545 l
stroke
grestore
gsave
576 432 7.2 7.2 clipbox
33.381818 157.745455 m
138.109091 157.745455 l
stroke
grestore
gsave
576 432 7.2 7.2 clipbox
33.381818 157.745455 m
138.109091 26.836364 l
stroke
grestore
gsave
576 432 7.2 7.2 clipbox
138.109091 288.654545 m
138.109091 157.745455 l
stroke
grestore
gsave
576 432 7.2 7.2 clipbox
138.109091 288.654545 m
242.836364 157.745455 l
stroke
grestore
gsave
576 432 7.2 7.2 clipbox
138.109091 288.654545 m
221.890909 288.654545 l
stroke
grestore
gsave
576 432 7.2 7.2 clipbox
138.109091 157.745455 m
138.109091 26.836364 l
stroke
grestore
gsave
576 432 7.2 7.2 clipbox
138.109091 157.745455 m
242.836364 157.745455 l
stroke
grestore
gsave
576 432 7.2 7.2 clipbox
138.109091 26.836364 m
242.836364 157.745455 l
stroke
grestore
gsave
576 432 7.2 7.2 clipbox
242.836364 157.745455 m
295.2 236.290909 l
stroke
grestore
gsave
576 432 7.2 7.2 clipbox
242.836364 157.745455 m
399.927273 223.2 l
stroke
grestore
gsave
576 432 7.2 7.2 clipbox
221.890909 288.654545 m
347.563636 419.563636 l
stroke
grestore
gsave
576 432 7.2 7.2 clipbox
221.890909 288.654545 m
347.563636 314.836364 l
stroke
grestore
gsave
576 432 7.2 7.2 clipbox
221.890909 288.654545 m
295.2 236.290909 l
stroke
grestore
gsave
576 432 7.2 7.2 clipbox
295.2 236.290909 m
347.563636 314.836364 l
stroke
grestore
gsave
576 432 7.2 7.2 clipbox
295.2 236.290909 m
399.927273 223.2 l
stroke
grestore
gsave
576 432 7.2 7.2 clipbox
347.563636 314.836364 m
399.927273 223.2 l
stroke
grestore
gsave
576 432 7.2 7.2 clipbox
347.563636 314.836364 m
452.290909 393.381818 l
stroke
grestore
gsave
576 432 7.2 7.2 clipbox
399.927273 223.2 m
452.290909 393.381818 l
stroke
grestore
gsave
576 432 7.2 7.2 clipbox
399.927273 223.2 m
557.018182 367.2 l
stroke
grestore
gsave
576 432 7.2 7.2 clipbox
347.563636 419.563636 m
452.290909 393.381818 l
stroke
grestore
gsave
576 432 7.2 7.2 clipbox
347.563636 419.563636 m
504.654545 419.563636 l
stroke
grestore
gsave
576 432 7.2 7.2 clipbox
452.290909 393.381818 m
504.654545 419.563636 l
stroke
grestore
gsave
576 432 7.2 7.2 clipbox
557.018182 367.2 m
504.654545 419.563636 l
stroke
grestore
5.000 setlinewidth
0.000 0.500 0.000 setrgbcolor
gsave
576 432 7.2 7.2 clipbox
33.381818 157.745455 m
138.109091 157.745455 l
stroke
grestore
gsave
576 432 7.2 7.2 clipbox
138.109091 157.745455 m
138.109091 157.745455 l
stroke
grestore
gsave
576 432 7.2 7.2 clipbox
138.109091 157.745455 m
242.836364 157.745455 l
stroke
grestore
gsave
576 432 7.2 7.2 clipbox
242.836364 157.745455 m
242.836364 157.745455 l
stroke
grestore
gsave
576 432 7.2 7.2 clipbox
242.836364 157.745455 m
399.927273 223.2 l
stroke
grestore
gsave
576 432 7.2 7.2 clipbox
399.927273 223.2 m
399.927273 223.2 l
stroke
grestore
gsave
576 432 7.2 7.2 clipbox
399.927273 223.2 m
452.290909 393.381818 l
stroke
grestore
gsave
576 432 7.2 7.2 clipbox
452.290909 393.381818 m
452.290909 393.381818 l
stroke
grestore
gsave
576 432 7.2 7.2 clipbox
452.290909 393.381818 m
504.654545 419.563636 l
stroke
grestore
gsave
576 432 7.2 7.2 clipbox
504.654545 419.563636 m
504.654545 419.563636 l
stroke
grestore
1.000 setlinewidth
0.000 setgray
gsave
576 432 7.2 7.2 clipbox
/o {
gsave
newpath
translate
1.0 setlinewidth
1 setlinejoin
0 setlinecap
0 -1.581139 m
0.419323 -1.581139 0.821528 -1.41454 1.118034 -1.118034 c
1.41454 -0.821528 1.581139 -0.419323 1.581139 0 c
1.581139 0.419323 1.41454 0.821528 1.118034 1.118034 c
0.821528 1.41454 0.419323 1.581139 0 1.581139 c
-0.419323 1.581139 -0.821528 1.41454 -1.118034 1.118034 c
-1.41454 0.821528 -1.581139 0.419323 -1.581139 0 c
-1.581139 -0.419323 -1.41454 -0.821528 -1.118034 -1.118034 c
-0.821528 -1.41454 -0.419323 -1.581139 0 -1.581139 c
cl

gsave
0.000 setgray
fill
grestore
stroke
grestore
} bind def
33.3818 157.745 o
138.109 288.655 o
138.109 157.745 o
138.109 26.8364 o
242.836 157.745 o
221.891 288.655 o
295.2 236.291 o
347.564 314.836 o
399.927 223.2 o
347.564 419.564 o
452.291 393.382 o
557.018 367.2 o
504.655 419.564 o
grestore
gsave
576 432 7.2 7.2 clipbox
/o {
gsave
newpath
translate
1.0 setlinewidth
1 setlinejoin
0 setlinecap
0 10 m
-8.660254 5 l
-8.660254 -5 l
-0 -10 l
8.660254 -5 l
8.660254 5 l
cl

gsave
0.000 setgray
fill
grestore
stroke
grestore
} bind def
33.3818 157.745 o
grestore
gsave
576 432 7.2 7.2 clipbox
/o {
gsave
newpath
translate
1.0 setlinewidth
1 setlinejoin
0 setlinecap
0 10 m
-8.660254 5 l
-8.660254 -5 l
-0 -10 l
8.660254 -5 l
8.660254 5 l
cl

gsave
0.000 setgray
fill
grestore
stroke
grestore
} bind def
504.655 419.564 o
grestore
1.000 setgray
/DejaVuSans findfont
14.000 scalefont
setfont
gsave
28.936506 153.878267 translate
0.000000 rotate
0.000000 0 m /S glyphshow
grestore
gsave
500.232670 415.696449 translate
0.000000 rotate
0.000000 0 m /E glyphshow
grestore

end
showpage
