%!PS-Adobe-3.0 EPSF-3.0
%%Title: case_longDistance/fig_schedule.eps
%%Creator: matplotlib version 3.3.2, http://matplotlib.org/
%%CreationDate: Fri Feb 26 19:42:42 2021
%%Orientation: portrait
%%BoundingBox: -18.774999999999977 189.62419931097284 630.775 602.3758006890272
%%EndComments
%%BeginProlog
/mpldict 9 dict def
mpldict begin
/m { moveto } bind def
/l { lineto } bind def
/r { rlineto } bind def
/c { curveto } bind def
/cl { closepath } bind def
/box {
      m
      1 index 0 r
      0 exch r
      neg 0 r
      cl
    } bind def
/clipbox {
      box
      clip
      newpath
    } bind def
%!PS-Adobe-3.0 Resource-Font
%%Title: DejaVu Sans
%%Copyright: Copyright (c) 2003 by Bitstream, Inc. All Rights Reserved. Copyright (c) 2006 by Tavmjong Bah. All Rights Reserved. DejaVu changes are in public domain 
%%Creator: Converted from TrueType to type 3 by PPR
25 dict begin
/_d{bind def}bind def
/_m{moveto}_d
/_l{lineto}_d
/_cl{closepath eofill}_d
/_c{curveto}_d
/_sc{7 -1 roll{setcachedevice}{pop pop pop pop pop pop}ifelse}_d
/_e{exec}_d
/FontName /DejaVuSans def
/PaintType 0 def
/FontMatrix[.001 0 0 .001 0 0]def
/FontBBox[-1021 -463 1793 1232]def
/FontType 3 def
/Encoding [ /space /slash /zero /one /two /four /five /W /a /c /d /e /g /h /i /k /m /n /o /p /r /s /t /w /minus ] def
/FontInfo 10 dict dup begin
/FamilyName (DejaVu Sans) def
/FullName (DejaVu Sans) def
/Notice (Copyright (c) 2003 by Bitstream, Inc. All Rights Reserved. Copyright (c) 2006 by Tavmjong Bah. All Rights Reserved. DejaVu changes are in public domain ) def
/Weight (Book) def
/Version (Version 2.35) def
/ItalicAngle 0.0 def
/isFixedPitch false def
/UnderlinePosition -130 def
/UnderlineThickness 90 def
end readonly def
/CharStrings 26 dict dup begin
/.notdef 0 def
/space{318 0 0 0 0 0 _sc
}_d
/slash{337 0 0 -92 337 729 _sc
254 729 _m
337 729 _l
83 -92 _l
0 -92 _l
254 729 _l
_cl}_d
/zero{636 0 66 -13 570 742 _sc
318 664 _m
267 664 229 639 203 589 _c
177 539 165 464 165 364 _c
165 264 177 189 203 139 _c
229 89 267 64 318 64 _c
369 64 407 89 433 139 _c
458 189 471 264 471 364 _c
471 464 458 539 433 589 _c
407 639 369 664 318 664 _c
318 742 _m
399 742 461 709 505 645 _c
548 580 570 486 570 364 _c
570 241 548 147 505 83 _c
461 19 399 -13 318 -13 _c
236 -13 173 19 130 83 _c
87 147 66 241 66 364 _c
66 486 87 580 130 645 _c
173 709 236 742 318 742 _c
_cl}_d
/one{636 0 110 0 544 729 _sc
124 83 _m
285 83 _l
285 639 _l
110 604 _l
110 694 _l
284 729 _l
383 729 _l
383 83 _l
544 83 _l
544 0 _l
124 0 _l
124 83 _l
_cl}_d
/two{{636 0 73 0 536 742 _sc
192 83 _m
536 83 _l
536 0 _l
73 0 _l
73 83 _l
110 121 161 173 226 239 _c
290 304 331 346 348 365 _c
380 400 402 430 414 455 _c
426 479 433 504 433 528 _c
433 566 419 598 392 622 _c
365 646 330 659 286 659 _c
255 659 222 653 188 643 _c
154 632 117 616 78 594 _c
78 694 _l
118 710 155 722 189 730 _c
223 738 255 742 284 742 _c
}_e{359 742 419 723 464 685 _c
509 647 532 597 532 534 _c
532 504 526 475 515 449 _c
504 422 484 390 454 354 _c
446 344 420 317 376 272 _c
332 227 271 164 192 83 _c
_cl}_e}_d
/four{636 0 49 0 580 729 _sc
378 643 _m
129 254 _l
378 254 _l
378 643 _l
352 729 _m
476 729 _l
476 254 _l
580 254 _l
580 172 _l
476 172 _l
476 0 _l
378 0 _l
378 172 _l
49 172 _l
49 267 _l
352 729 _l
_cl}_d
/five{{636 0 77 -13 549 729 _sc
108 729 _m
495 729 _l
495 646 _l
198 646 _l
198 467 _l
212 472 227 476 241 478 _c
255 480 270 482 284 482 _c
365 482 429 459 477 415 _c
525 370 549 310 549 234 _c
549 155 524 94 475 51 _c
426 8 357 -13 269 -13 _c
238 -13 207 -10 175 -6 _c
143 -1 111 6 77 17 _c
77 116 _l
106 100 136 88 168 80 _c
199 72 232 69 267 69 _c
}_e{323 69 368 83 401 113 _c
433 143 450 183 450 234 _c
450 284 433 324 401 354 _c
368 384 323 399 267 399 _c
241 399 214 396 188 390 _c
162 384 135 375 108 363 _c
108 729 _l
_cl}_e}_d
/W{989 0 33 0 956 729 _sc
33 729 _m
133 729 _l
286 113 _l
439 729 _l
550 729 _l
703 113 _l
856 729 _l
956 729 _l
773 0 _l
649 0 _l
495 633 _l
340 0 _l
216 0 _l
33 729 _l
_cl}_d
/a{{613 0 60 -13 522 560 _sc
343 275 _m
270 275 220 266 192 250 _c
164 233 150 205 150 165 _c
150 133 160 107 181 89 _c
202 70 231 61 267 61 _c
317 61 357 78 387 114 _c
417 149 432 196 432 255 _c
432 275 _l
343 275 _l
522 312 _m
522 0 _l
432 0 _l
432 83 _l
411 49 385 25 355 10 _c
325 -5 287 -13 243 -13 _c
187 -13 142 2 109 33 _c
76 64 60 106 60 159 _c
}_e{60 220 80 266 122 298 _c
163 329 224 345 306 345 _c
432 345 _l
432 354 _l
432 395 418 427 391 450 _c
364 472 326 484 277 484 _c
245 484 215 480 185 472 _c
155 464 127 453 100 439 _c
100 522 _l
132 534 164 544 195 550 _c
226 556 256 560 286 560 _c
365 560 424 539 463 498 _c
502 457 522 395 522 312 _c
_cl}_e}_d
/c{{550 0 55 -13 488 560 _sc
488 526 _m
488 442 _l
462 456 437 466 411 473 _c
385 480 360 484 334 484 _c
276 484 230 465 198 428 _c
166 391 150 339 150 273 _c
150 206 166 154 198 117 _c
230 80 276 62 334 62 _c
360 62 385 65 411 72 _c
437 79 462 90 488 104 _c
488 21 _l
462 9 436 0 410 -5 _c
383 -10 354 -13 324 -13 _c
242 -13 176 12 128 64 _c
}_e{79 115 55 185 55 273 _c
55 362 79 432 128 483 _c
177 534 244 560 330 560 _c
358 560 385 557 411 551 _c
437 545 463 537 488 526 _c
_cl}_e}_d
/d{{635 0 55 -13 544 760 _sc
454 464 _m
454 760 _l
544 760 _l
544 0 _l
454 0 _l
454 82 _l
435 49 411 25 382 10 _c
353 -5 319 -13 279 -13 _c
213 -13 159 13 117 65 _c
75 117 55 187 55 273 _c
55 359 75 428 117 481 _c
159 533 213 560 279 560 _c
319 560 353 552 382 536 _c
411 520 435 496 454 464 _c
148 273 _m
148 207 161 155 188 117 _c
215 79 253 61 301 61 _c
}_e{348 61 385 79 413 117 _c
440 155 454 207 454 273 _c
454 339 440 390 413 428 _c
385 466 348 485 301 485 _c
253 485 215 466 188 428 _c
161 390 148 339 148 273 _c
_cl}_e}_d
/e{{615 0 55 -13 562 560 _sc
562 296 _m
562 252 _l
149 252 _l
153 190 171 142 205 110 _c
238 78 284 62 344 62 _c
378 62 412 66 444 74 _c
476 82 509 95 541 113 _c
541 28 _l
509 14 476 3 442 -3 _c
408 -9 373 -13 339 -13 _c
251 -13 182 12 131 62 _c
80 112 55 181 55 268 _c
55 357 79 428 127 481 _c
175 533 241 560 323 560 _c
397 560 455 536 498 489 _c
}_e{540 441 562 377 562 296 _c
472 322 _m
471 371 457 410 431 440 _c
404 469 368 484 324 484 _c
274 484 234 469 204 441 _c
174 413 156 373 152 322 _c
472 322 _l
_cl}_e}_d
/g{{635 0 55 -207 544 560 _sc
454 280 _m
454 344 440 395 414 431 _c
387 467 349 485 301 485 _c
253 485 215 467 188 431 _c
161 395 148 344 148 280 _c
148 215 161 165 188 129 _c
215 93 253 75 301 75 _c
349 75 387 93 414 129 _c
440 165 454 215 454 280 _c
544 68 _m
544 -24 523 -93 482 -139 _c
440 -184 377 -207 292 -207 _c
260 -207 231 -204 203 -200 _c
175 -195 147 -188 121 -178 _c
}_e{121 -91 _l
147 -105 173 -115 199 -122 _c
225 -129 251 -133 278 -133 _c
336 -133 380 -117 410 -87 _c
439 -56 454 -10 454 52 _c
454 96 _l
435 64 411 40 382 24 _c
353 8 319 0 279 0 _c
211 0 157 25 116 76 _c
75 127 55 195 55 280 _c
55 364 75 432 116 483 _c
157 534 211 560 279 560 _c
319 560 353 552 382 536 _c
411 520 435 496 454 464 _c
454 547 _l
544 547 _l
}_e{544 68 _l
_cl}_e}_d
/h{634 0 91 0 549 760 _sc
549 330 _m
549 0 _l
459 0 _l
459 327 _l
459 379 448 417 428 443 _c
408 469 378 482 338 482 _c
289 482 251 466 223 435 _c
195 404 181 362 181 309 _c
181 0 _l
91 0 _l
91 760 _l
181 760 _l
181 462 _l
202 494 227 519 257 535 _c
286 551 320 560 358 560 _c
420 560 468 540 500 501 _c
532 462 549 405 549 330 _c
_cl}_d
/i{278 0 94 0 184 760 _sc
94 547 _m
184 547 _l
184 0 _l
94 0 _l
94 547 _l
94 760 _m
184 760 _l
184 646 _l
94 646 _l
94 760 _l
_cl}_d
/k{579 0 91 0 576 760 _sc
91 760 _m
181 760 _l
181 311 _l
449 547 _l
564 547 _l
274 291 _l
576 0 _l
459 0 _l
181 267 _l
181 0 _l
91 0 _l
91 760 _l
_cl}_d
/m{{974 0 91 0 889 560 _sc
520 442 _m
542 482 569 511 600 531 _c
631 550 668 560 711 560 _c
767 560 811 540 842 500 _c
873 460 889 403 889 330 _c
889 0 _l
799 0 _l
799 327 _l
799 379 789 418 771 444 _c
752 469 724 482 686 482 _c
639 482 602 466 575 435 _c
548 404 535 362 535 309 _c
535 0 _l
445 0 _l
445 327 _l
445 379 435 418 417 444 _c
398 469 369 482 331 482 _c
}_e{285 482 248 466 221 435 _c
194 404 181 362 181 309 _c
181 0 _l
91 0 _l
91 547 _l
181 547 _l
181 462 _l
201 495 226 520 255 536 _c
283 552 317 560 357 560 _c
397 560 430 550 458 530 _c
486 510 506 480 520 442 _c
_cl}_e}_d
/n{634 0 91 0 549 560 _sc
549 330 _m
549 0 _l
459 0 _l
459 327 _l
459 379 448 417 428 443 _c
408 469 378 482 338 482 _c
289 482 251 466 223 435 _c
195 404 181 362 181 309 _c
181 0 _l
91 0 _l
91 547 _l
181 547 _l
181 462 _l
202 494 227 519 257 535 _c
286 551 320 560 358 560 _c
420 560 468 540 500 501 _c
532 462 549 405 549 330 _c
_cl}_d
/o{612 0 55 -13 557 560 _sc
306 484 _m
258 484 220 465 192 427 _c
164 389 150 338 150 273 _c
150 207 163 156 191 118 _c
219 80 257 62 306 62 _c
354 62 392 80 420 118 _c
448 156 462 207 462 273 _c
462 337 448 389 420 427 _c
392 465 354 484 306 484 _c
306 560 _m
384 560 445 534 490 484 _c
534 433 557 363 557 273 _c
557 183 534 113 490 63 _c
445 12 384 -13 306 -13 _c
227 -13 165 12 121 63 _c
77 113 55 183 55 273 _c
55 363 77 433 121 484 _c
165 534 227 560 306 560 _c
_cl}_d
/p{{635 0 91 -207 580 560 _sc
181 82 _m
181 -207 _l
91 -207 _l
91 547 _l
181 547 _l
181 464 _l
199 496 223 520 252 536 _c
281 552 316 560 356 560 _c
422 560 476 533 518 481 _c
559 428 580 359 580 273 _c
580 187 559 117 518 65 _c
476 13 422 -13 356 -13 _c
316 -13 281 -5 252 10 _c
223 25 199 49 181 82 _c
487 273 _m
487 339 473 390 446 428 _c
418 466 381 485 334 485 _c
}_e{286 485 249 466 222 428 _c
194 390 181 339 181 273 _c
181 207 194 155 222 117 _c
249 79 286 61 334 61 _c
381 61 418 79 446 117 _c
473 155 487 207 487 273 _c
_cl}_e}_d
/r{411 0 91 0 411 560 _sc
411 463 _m
401 469 390 473 378 476 _c
366 478 353 480 339 480 _c
288 480 249 463 222 430 _c
194 397 181 350 181 288 _c
181 0 _l
91 0 _l
91 547 _l
181 547 _l
181 462 _l
199 495 224 520 254 536 _c
284 552 321 560 365 560 _c
371 560 378 559 386 559 _c
393 558 401 557 411 555 _c
411 463 _l
_cl}_d
/s{{521 0 54 -13 472 560 _sc
443 531 _m
443 446 _l
417 458 391 468 364 475 _c
336 481 308 485 279 485 _c
234 485 200 478 178 464 _c
156 450 145 430 145 403 _c
145 382 153 366 169 354 _c
185 342 217 330 265 320 _c
296 313 _l
360 299 405 279 432 255 _c
458 230 472 195 472 151 _c
472 100 452 60 412 31 _c
372 1 316 -13 246 -13 _c
216 -13 186 -10 154 -5 _c
}_e{122 0 89 8 54 20 _c
54 113 _l
87 95 120 82 152 74 _c
184 65 216 61 248 61 _c
290 61 323 68 346 82 _c
368 96 380 117 380 144 _c
380 168 371 187 355 200 _c
339 213 303 226 247 238 _c
216 245 _l
160 257 119 275 95 299 _c
70 323 58 356 58 399 _c
58 450 76 490 112 518 _c
148 546 200 560 268 560 _c
301 560 332 557 362 552 _c
391 547 418 540 443 531 _c
}_e{_cl}_e}_d
/t{392 0 27 0 368 702 _sc
183 702 _m
183 547 _l
368 547 _l
368 477 _l
183 477 _l
183 180 _l
183 135 189 106 201 94 _c
213 81 238 75 276 75 _c
368 75 _l
368 0 _l
276 0 _l
206 0 158 13 132 39 _c
106 65 93 112 93 180 _c
93 477 _l
27 477 _l
27 547 _l
93 547 _l
93 702 _l
183 702 _l
_cl}_d
/w{818 0 42 0 776 547 _sc
42 547 _m
132 547 _l
244 120 _l
356 547 _l
462 547 _l
574 120 _l
686 547 _l
776 547 _l
633 0 _l
527 0 _l
409 448 _l
291 0 _l
185 0 _l
42 547 _l
_cl}_d
/minus{838 0 106 272 732 355 _sc
106 355 _m
732 355 _l
732 272 _l
106 272 _l
106 355 _l
_cl}_d
end readonly def

/BuildGlyph
 {exch begin
 CharStrings exch
 2 copy known not{pop /.notdef}if
 true 3 1 roll get exec
 end}_d

/BuildChar {
 1 index /Encoding get exch get
 1 index /BuildGlyph get exec
}_d

FontName currentdict end definefont pop
%!PS-Adobe-3.0 Resource-Font
%%Title: DejaVu Sans Oblique
%%Copyright: Copyright (c) 2003 by Bitstream, Inc. All Rights Reserved. Copyright (c) 2006 by Tavmjong Bah. All Rights Reserved. DejaVu changes are in public domain 
%%Creator: Converted from TrueType to type 3 by PPR
25 dict begin
/_d{bind def}bind def
/_m{moveto}_d
/_l{lineto}_d
/_cl{closepath eofill}_d
/_c{curveto}_d
/_sc{7 -1 roll{setcachedevice}{pop pop pop pop pop pop}ifelse}_d
/_e{exec}_d
/FontName /DejaVuSans-Oblique def
/PaintType 0 def
/FontMatrix[.001 0 0 .001 0 0]def
/FontBBox[-1016 -350 1659 1068]def
/FontType 3 def
/Encoding [ /P ] def
/FontInfo 10 dict dup begin
/FamilyName (DejaVu Sans) def
/FullName (DejaVu Sans Oblique) def
/Notice (Copyright (c) 2003 by Bitstream, Inc. All Rights Reserved. Copyright (c) 2006 by Tavmjong Bah. All Rights Reserved. DejaVu changes are in public domain ) def
/Weight (Oblique) def
/Version (Version 2.35) def
/ItalicAngle -11.0 def
/isFixedPitch false def
/UnderlinePosition -130 def
/UnderlineThickness 90 def
end readonly def
/CharStrings 2 dict dup begin
/.notdef 0 def
/P{603 0 27 0 601 729 _sc
169 729 _m
397 729 _l
463 729 514 713 549 682 _c
583 651 601 606 601 547 _c
601 467 575 404 524 360 _c
472 315 400 293 307 293 _c
183 293 _l
126 0 _l
27 0 _l
169 729 _l
252 648 _m
199 374 _l
323 374 _l
379 374 422 388 452 417 _c
482 445 497 486 497 540 _c
497 574 486 600 466 619 _c
446 638 417 648 381 648 _c
252 648 _l
_cl}_d
end readonly def

/BuildGlyph
 {exch begin
 CharStrings exch
 2 copy known not{pop /.notdef}if
 true 3 1 roll get exec
 end}_d

/BuildChar {
 1 index /Encoding get exch get
 1 index /BuildGlyph get exec
}_d

FontName currentdict end definefont pop
end
%%EndProlog
mpldict begin
-18.775 189.624 translate
649.55 412.752 0 0 clipbox
gsave
0 0 m
649.55 0 l
649.55 412.751601 l
0 412.751601 l
cl
grestore
gsave
98.746875 72.41875 m
545.146875 72.41875 l
545.146875 405.05875 l
98.746875 405.05875 l
cl
grestore
1.000 setlinewidth
0 setlinejoin
0 setlinecap
[] 0 setdash
0.690 0.769 0.871 setrgbcolor
gsave
446.4 332.6 98.75 72.42 clipbox
98.746875 72.41875 m
98.746875 73.001307 l
98.836903 72.41875 l
102.888142 73.583864 l
104.399984 78.826876 l
107.414354 77.079205 l
109.252157 75.914092 l
114.427189 79.99199 l
120.313127 79.99199 l
124.532004 75.914092 l
129.387282 77.079205 l
133.78311 82.322218 l
139.510724 85.817559 l
151.956255 92.225685 l
159.552717 132.422113 l
164.58805 128.344214 l
169.834482 116.693076 l
173.5877 119.023303 l
200.381758 141.743023 l
200.918819 144.655808 l
209.592506 167.958085 l
236.66596 245.438155 l
251.896136 328.743794 l
274.04912 365.44488 l
277.06349 360.784424 l
279.15275 377.096018 l
290.359626 349.133286 l
307.306535 381.173916 l
313.561896 350.880957 l
318.143988 355.541412 l
323.15759 332.239135 l
326.134708 320.587997 l
335.466528 382.33903 l
337.453342 395.737839 l
348.570191 405.05875 l
363.073938 336.317034 l
383.24942 340.394932 l
384.571894 356.123969 l
389.265743 353.211184 l
401.369791 342.142603 l
433.016023 328.743794 l
449.73631 282.13924 l
456.438705 278.061342 l
466.885004 262.914862 l
472.181107 239.612585 l
474.853993 231.456789 l
477.051907 239.612585 l
478.299875 245.438155 l
480.311525 251.263724 l
487.516832 264.662533 l
491.254528 248.933496 l
493.064391 255.924179 l
508.983744 262.914862 l
515.875507 259.419521 l
523.962464 265.24509 l
531.028073 260.584634 l
533.586097 260.584634 l
537.18099 257.67185 l
538.217859 254.759065 l
539.493766 213.980081 l
543.097972 166.792971 l
544.91715 123.683759 l
545.146875 124.266316 l
545.146875 72.41875 l
cl
gsave
fill
grestore
stroke
grestore
0.800 setlinewidth
1 setlinejoin
0.000 setgray
gsave
/o {
gsave
newpath
translate
0.8 setlinewidth
1 setlinejoin
0 setlinecap
0 0 m
0 -3.5 l

gsave
0.000 setgray
fill
grestore
stroke
grestore
} bind def
98.7469 72.4188 o
grestore
/DejaVuSans findfont
28.000 scalefont
setfont
gsave
89.840625 44.137500 translate
0.000000 rotate
0.000000 0 m /zero glyphshow
grestore
gsave
/o {
gsave
newpath
translate
0.8 setlinewidth
1 setlinejoin
0 setlinecap
0 0 m
0 -3.5 l

gsave
0.000 setgray
fill
grestore
stroke
grestore
} bind def
253.967 72.4188 o
grestore
gsave
236.154270 44.137500 translate
0.000000 rotate
0.000000 0 m /five glyphshow
17.814453 0 m /zero glyphshow
grestore
gsave
/o {
gsave
newpath
translate
0.8 setlinewidth
1 setlinejoin
0 setlinecap
0 0 m
0 -3.5 l

gsave
0.000 setgray
fill
grestore
stroke
grestore
} bind def
409.187 72.4188 o
grestore
gsave
382.467915 44.137500 translate
0.000000 rotate
0.000000 0 m /one glyphshow
17.814453 0 m /zero glyphshow
35.628906 0 m /zero glyphshow
grestore
gsave
227.235938 13.028125 translate
0.000000 rotate
0.000000 0 m /d glyphshow
17.773438 0 m /i glyphshow
25.552734 0 m /s glyphshow
40.140625 0 m /t glyphshow
51.119141 0 m /a glyphshow
68.277344 0 m /n glyphshow
86.023438 0 m /c glyphshow
101.417969 0 m /e glyphshow
118.644531 0 m /space glyphshow
127.544922 0 m /slash glyphshow
136.978516 0 m /space glyphshow
145.878906 0 m /k glyphshow
162.093750 0 m /m glyphshow
grestore
gsave
/o {
gsave
newpath
translate
0.8 setlinewidth
1 setlinejoin
0 setlinecap
-0 0 m
-3.5 0 l

gsave
0.000 setgray
fill
grestore
stroke
grestore
} bind def
98.7469 72.4188 o
grestore
0.690 0.769 0.871 setrgbcolor
gsave
73.934375 61.778125 translate
0.000000 rotate
0.000000 0 m /zero glyphshow
grestore
0.000 setgray
gsave
/o {
gsave
newpath
translate
0.8 setlinewidth
1 setlinejoin
0 setlinecap
-0 0 m
-3.5 0 l

gsave
0.000 setgray
fill
grestore
stroke
grestore
} bind def
98.7469 188.93 o
grestore
0.690 0.769 0.871 setrgbcolor
gsave
38.309375 178.289509 translate
0.000000 rotate
0.000000 0 m /two glyphshow
17.814453 0 m /zero glyphshow
35.628906 0 m /zero glyphshow
grestore
0.000 setgray
gsave
/o {
gsave
newpath
translate
0.8 setlinewidth
1 setlinejoin
0 setlinecap
-0 0 m
-3.5 0 l

gsave
0.000 setgray
fill
grestore
stroke
grestore
} bind def
98.7469 305.442 o
grestore
0.690 0.769 0.871 setrgbcolor
gsave
38.309375 294.800892 translate
0.000000 rotate
0.000000 0 m /four glyphshow
17.814453 0 m /zero glyphshow
35.628906 0 m /zero glyphshow
grestore
gsave
28.481250 166.832500 translate
90.000000 rotate
0.000000 0 m /h glyphshow
17.746094 0 m /e glyphshow
34.972656 0 m /i glyphshow
42.751953 0 m /g glyphshow
60.525391 0 m /h glyphshow
78.271484 0 m /t glyphshow
89.250000 0 m /space glyphshow
98.150391 0 m /slash glyphshow
107.583984 0 m /space glyphshow
116.484375 0 m /m glyphshow
grestore
0 setlinejoin
2 setlinecap
0.000 setgray
gsave
98.746875 72.41875 m
98.746875 405.05875 l
stroke
grestore
gsave
545.146875 72.41875 m
545.146875 405.05875 l
stroke
grestore
gsave
98.746875 72.41875 m
545.146875 72.41875 l
stroke
grestore
gsave
98.746875 405.05875 m
545.146875 405.05875 l
stroke
grestore
1 setlinejoin
0 setlinecap
gsave
/o {
gsave
newpath
translate
0.8 setlinewidth
1 setlinejoin
0 setlinecap
0 0 m
3.5 0 l

gsave
0.000 setgray
fill
grestore
stroke
grestore
} bind def
545.147 116.112 o
grestore
gsave
552.146875 105.471169 translate
0.000000 rotate
0.000000 0 m /minus glyphshow
23.460938 0 m /four glyphshow
41.275391 0 m /zero glyphshow
grestore
gsave
/o {
gsave
newpath
translate
0.8 setlinewidth
1 setlinejoin
0 setlinecap
0 0 m
3.5 0 l

gsave
0.000 setgray
fill
grestore
stroke
grestore
} bind def
545.147 185.812 o
grestore
gsave
552.146875 175.170965 translate
0.000000 rotate
0.000000 0 m /minus glyphshow
23.460938 0 m /two glyphshow
41.275391 0 m /zero glyphshow
grestore
gsave
/o {
gsave
newpath
translate
0.8 setlinewidth
1 setlinejoin
0 setlinecap
0 0 m
3.5 0 l

gsave
0.000 setgray
fill
grestore
stroke
grestore
} bind def
545.147 255.511 o
grestore
gsave
552.146875 244.870760 translate
0.000000 rotate
0.000000 0 m /zero glyphshow
grestore
gsave
/o {
gsave
newpath
translate
0.8 setlinewidth
1 setlinejoin
0 setlinecap
0 0 m
3.5 0 l

gsave
0.000 setgray
fill
grestore
stroke
grestore
} bind def
545.147 325.211 o
grestore
gsave
552.146875 314.570556 translate
0.000000 rotate
0.000000 0 m /two glyphshow
17.814453 0 m /zero glyphshow
grestore
gsave
/o {
gsave
newpath
translate
0.8 setlinewidth
1 setlinejoin
0 setlinecap
0 0 m
3.5 0 l

gsave
0.000 setgray
fill
grestore
stroke
grestore
} bind def
545.147 394.911 o
grestore
gsave
552.146875 384.270351 translate
0.000000 rotate
0.000000 0 m /four glyphshow
17.814453 0 m /zero glyphshow
grestore
gsave
636.521875 159.879375 translate
90.000000 rotate
0.000000 0 m /p glyphshow
17.773438 0 m /o glyphshow
34.904297 0 m /w glyphshow
57.804688 0 m /e glyphshow
75.031250 0 m /r glyphshow
86.542969 0 m /space glyphshow
95.443359 0 m /slash glyphshow
104.876953 0 m /space glyphshow
113.777344 0 m /k glyphshow
129.992188 0 m /W glyphshow
grestore
3.000 setlinewidth
2 setlinecap
gsave
446.4 332.6 98.75 72.42 clipbox
98.746875 255.511385 m
98.746875 255.511385 l
98.836903 255.511385 l
98.836903 267.104785 l
102.888142 267.104785 l
102.888142 280.628481 l
104.399984 280.628481 l
104.399984 263.416504 l
107.414354 263.416504 l
107.414354 263.184171 l
109.252157 263.184171 l
109.252157 280.015704 l
114.427189 280.015704 l
114.427189 341.562559 l
120.313127 341.562559 l
120.313127 330.878161 l
124.532004 330.878161 l
124.532004 301.954682 l
129.387282 301.954682 l
129.387282 270.952794 l
133.78311 270.952794 l
133.78311 348.307951 l
139.510724 348.307951 l
139.510724 347.250837 l
151.956255 347.250837 l
151.956255 389.93875 l
159.552717 389.93875 l
159.552717 332.602263 l
164.58805 332.602263 l
164.58805 317.009838 l
169.834482 317.009838 l
169.834482 348.433797 l
173.5877 348.433797 l
173.5877 350.93815 l
200.381758 350.93815 l
200.381758 288.939214 l
200.918819 288.939214 l
200.918819 371.262417 l
209.592506 371.262417 l
209.592506 373.200458 l
236.66596 373.200458 l
236.66596 389.93875 l
251.896136 389.93875 l
251.896136 359.885861 l
274.04912 359.885861 l
274.04912 286.756255 l
277.06349 286.756255 l
277.06349 298.185011 l
279.15275 298.185011 l
279.15275 255.511385 l
290.359626 255.511385 l
290.359626 286.582005 l
307.306535 286.582005 l
307.306535 255.511385 l
313.561896 255.511385 l
313.561896 308.566482 l
318.143988 308.566482 l
318.143988 260.386499 l
323.15759 260.386499 l
323.15759 266.620758 l
326.134708 266.620758 l
326.134708 356.165634 l
335.466528 356.165634 l
335.466528 357.240173 l
337.453342 357.240173 l
337.453342 280.313864 l
348.570191 280.313864 l
348.570191 259.602376 l
363.073938 259.602376 l
363.073938 276.525874 l
383.24942 276.525874 l
383.24942 345.990432 l
384.571894 345.990432 l
384.571894 255.511385 l
389.265743 255.511385 l
389.265743 269.878256 l
401.369791 269.878256 l
401.369791 336.881056 l
433.016023 336.881056 l
433.016023 310.742665 l
449.73631 310.742665 l
449.73631 334.829753 l
456.438705 334.829753 l
456.438705 287.579099 l
466.885004 287.579099 l
466.885004 262.487173 l
472.181107 262.487173 l
472.181107 257.152235 l
474.853993 257.152235 l
474.853993 297.410643 l
477.051907 297.410643 l
477.051907 303.109569 l
478.299875 303.109569 l
478.299875 292.565539 l
480.311525 292.565539 l
480.311525 315.730072 l
487.516832 315.730072 l
487.516832 264.123182 l
491.254528 264.123182 l
491.254528 332.75812 l
493.064391 332.75812 l
493.064391 277.935358 l
508.983744 277.935358 l
508.983744 295.594576 l
515.875507 295.594576 l
515.875507 255.511385 l
523.962464 255.511385 l
523.962464 255.511385 l
531.028073 255.511385 l
531.028073 255.511385 l
533.586097 255.511385 l
533.586097 255.511385 l
537.18099 255.511385 l
537.18099 255.511385 l
538.217859 255.511385 l
538.217859 255.511385 l
539.493766 255.511385 l
539.493766 255.511385 l
543.097972 255.511385 l
543.097972 255.511385 l
544.91715 255.511385 l
544.91715 255.511385 l
545.146875 255.511385 l
stroke
grestore
0 setlinecap
[11.1 4.8] 0 setdash
1.000 0.000 0.000 setrgbcolor
gsave
446.4 332.6 98.75 72.42 clipbox
98.746875 238.33329 m
98.746875 238.33329 l
98.836903 238.33329 l
98.836903 255.476535 l
102.888142 255.476535 l
102.888142 255.476535 l
104.399984 255.476535 l
104.399984 255.476535 l
107.414354 255.476535 l
107.414354 255.476535 l
109.252157 255.476535 l
109.252157 255.476535 l
114.427189 255.476535 l
114.427189 255.476535 l
120.313127 255.476535 l
120.313127 255.476535 l
124.532004 255.476535 l
124.532004 255.476535 l
129.387282 255.476535 l
129.387282 255.476535 l
133.78311 255.476535 l
133.78311 255.476535 l
139.510724 255.476535 l
139.510724 255.476535 l
151.956255 255.476535 l
151.956255 265.593962 l
159.552717 265.593962 l
159.552717 255.476535 l
164.58805 255.476535 l
164.58805 255.476535 l
169.834482 255.476535 l
169.834482 255.476535 l
173.5877 255.476535 l
173.5877 255.476535 l
200.381758 255.476535 l
200.381758 255.476535 l
200.918819 255.476535 l
200.918819 255.476535 l
209.592506 255.476535 l
209.592506 255.476535 l
236.66596 255.476535 l
236.66596 267.557173 l
251.896136 267.557173 l
251.896136 255.476535 l
274.04912 255.476535 l
274.04912 255.476535 l
277.06349 255.476535 l
277.06349 256.346889 l
279.15275 256.346889 l
279.15275 255.23549 l
290.359626 255.23549 l
290.359626 255.476535 l
307.306535 255.476535 l
307.306535 246.458156 l
313.561896 246.458156 l
313.561896 255.476535 l
318.143988 255.476535 l
318.143988 255.476535 l
323.15759 255.476535 l
323.15759 255.476535 l
326.134708 255.476535 l
326.134708 255.476535 l
335.466528 255.476535 l
335.466528 255.476535 l
337.453342 255.476535 l
337.453342 255.476535 l
348.570191 255.476535 l
348.570191 255.476535 l
363.073938 255.476535 l
363.073938 255.476535 l
383.24942 255.476535 l
383.24942 255.476535 l
384.571894 255.476535 l
384.571894 263.207404 l
389.265743 263.207404 l
389.265743 255.476535 l
401.369791 255.476535 l
401.369791 255.476535 l
433.016023 255.476535 l
433.016023 255.476535 l
449.73631 255.476535 l
449.73631 255.476535 l
456.438705 255.476535 l
456.438705 255.476535 l
466.885004 255.476535 l
466.885004 255.476535 l
472.181107 255.476535 l
472.181107 255.476535 l
474.853993 255.476535 l
474.853993 255.476535 l
477.051907 255.476535 l
477.051907 255.476535 l
478.299875 255.476535 l
478.299875 255.476535 l
480.311525 255.476535 l
480.311525 255.476535 l
487.516832 255.476535 l
487.516832 255.476535 l
491.254528 255.476535 l
491.254528 255.476535 l
493.064391 255.476535 l
493.064391 255.476535 l
508.983744 255.476535 l
508.983744 255.476535 l
515.875507 255.476535 l
515.875507 268.909235 l
523.962464 268.909235 l
523.962464 271.361312 l
531.028073 271.361312 l
531.028073 275.28483 l
533.586097 275.28483 l
533.586097 270.460055 l
537.18099 270.460055 l
537.18099 258.560751 l
538.217859 258.560751 l
538.217859 87.53875 l
539.493766 87.53875 l
539.493766 210.279122 l
543.097972 210.279122 l
543.097972 165.7971 l
544.91715 165.7971 l
544.91715 276.629455 l
545.146875 276.629455 l
stroke
grestore
0.500 setlinewidth
2 setlinecap
[] 0 setdash
0.000 setgray
gsave
446.4 332.6 98.75 72.42 clipbox
98.746875 255.511385 m
545.146875 255.511385 l
stroke
grestore
0.800 setlinewidth
0 setlinejoin
gsave
98.746875 72.41875 m
98.746875 405.05875 l
stroke
grestore
gsave
545.146875 72.41875 m
545.146875 405.05875 l
stroke
grestore
gsave
98.746875 72.41875 m
545.146875 72.41875 l
stroke
grestore
gsave
98.746875 405.05875 m
545.146875 405.05875 l
stroke
grestore
1.000 setlinewidth
0 setlinecap
0.800 setgray
gsave
118.346875 86.41875 m
292.946875 86.41875 l
296.680208 86.41875 298.546875 88.285417 298.546875 92.01875 c
298.546875 174.609375 l
298.546875 178.342708 296.680208 180.209375 292.946875 180.209375 c
118.346875 180.209375 l
114.613542 180.209375 112.746875 178.342708 112.746875 174.609375 c
112.746875 92.01875 l
112.746875 88.285417 114.613542 86.41875 118.346875 86.41875 c
cl
gsave
1.000 setgray
fill
grestore
stroke
grestore
3.000 setlinewidth
1 setlinejoin
2 setlinecap
0.000 setgray
gsave
123.946875 157.528125 m
179.946875 157.528125 l
stroke
grestore
gsave
202.346875 147.728125 translate
0.000000 rotate
/DejaVuSans-Oblique findfont
28.0 scalefont
setfont
0.000000 0.593750 moveto
/P glyphshow
/DejaVuSans findfont
19.599999999999998 scalefont
setfont
16.884766 -4.000000 moveto
/e glyphshow
28.943359 -4.000000 moveto
/n glyphshow
41.365625 -4.000000 moveto
/g glyphshow
53.807031 -4.000000 moveto
/i glyphshow
59.252539 -4.000000 moveto
/n glyphshow
71.674805 -4.000000 moveto
/e glyphshow

grestore
0 setlinecap
[11.1 4.8] 0 setdash
1.000 0.000 0.000 setrgbcolor
gsave
123.946875 113.246875 m
179.946875 113.246875 l
stroke
grestore
0.000 setgray
gsave
202.346875 103.446875 translate
0.000000 rotate
/DejaVuSans-Oblique findfont
28.0 scalefont
setfont
0.000000 0.593750 moveto
/P glyphshow
/DejaVuSans findfont
19.599999999999998 scalefont
setfont
16.884766 -4.000000 moveto
/m glyphshow
35.977539 -4.000000 moveto
/o glyphshow
47.969141 -4.000000 moveto
/t glyphshow
55.654102 -4.000000 moveto
/o glyphshow
67.645703 -4.000000 moveto
/r glyphshow

grestore

end
showpage
