{"nX":40,"nY":40,"DX":2,"DY":1,"matern":3,"meanfunction":0,"meanOfOutput":0.24068469444009341,"stdOfOutput":1.7508869147936275,"sf2":1.0610645490982653,"ell":[0.14102195729842812,0.1149409957030684],"inputLowerBound":[-2.9975311290199222,-2.9016533545656054],"inputUpperBound":[2.8815018919860353,2.9484600814759556],"problemLowerBound":[-3,-3],"problemUpperBound":[3,3],"X":[[0.33669125578689457,0.78439689989935246],[0.56747873811044736,0.80030571130400219],[0.98025031533100593,0.16938995463467935],[0.45100726516042161,0.6145386069382216],[0.80270408222903133,0.12394571404925607],[0.4167153311463922,0.096617201580156145],[0.12703975157506461,0.86071628333751582],[0.59273052077833421,0.016391107572399106],[0.2344116834042976,0.74543392998140712],[0.12099933483845644,0.67343176078630307],[0.93599304712875708,0.048475114534756246],[0.082039044421262419,0.57458772446857487],[0.43655626906525474,0.23456431339766484],[0.70968556598473465,0.34093989639779965],[0.16932664382828908,0.71925526592968614],[0.53682088309682974,0.31773616703457819],[0.49693024057560908,0.522964081111625],[0.507295780246674,0.0668013151601925],[0.90496433451743064,0.38951704905191703],[0.18315265318606269,0.5911079021281741],[0.69512914204457721,0.54946464991512656],[0.76953540085642691,0.942535133848625],[0.29499742688159675,0.45886215276057857],[0.95035590492312261,0.83989092173418312],[0.60304762055321059,0.96265284023919262],[0.3550613841748449,0.18206176608182392],[0.063078388288083209,0.25666165556417941],[0.043885877430995958,0.87886918786982238],[0.86011288492602966,0.64334737410980147],[0.25750483615257791,0.28157330633553762],[0.82580456438692151,0.9914100135793259],[0.66827081200730287,0.76452943834550735],[0.39177072458224549,0.35933390956490907],[0.63204681766991411,0.13045030049696274],[0.20950105725791487,0.90774344746868108],[0.88453104895265788,0.4476736340366842],[0.30172528584300629,0.40790978750754164],[0.79603051085979393,0.49759178468181259],[0.00041147849667962549,0.67692092569486906],[0.73712680784700391,0.21641886037961008]],"Y":[1.4856014124905337,3.4410911124953576,-0.13709710269026321,0.55294688828363969,-0.19734976829926759,-0.79472909265757663,-0.12487685694254921,-0.32084473249890649,0.014027434820543371,-0.25931092791813254,-0.13771593575398108,-0.28108018705600646,-2.1576706966978936,0.3327723318871072,-0.2174704210374527,-1.7964685526158464,0.29894150976905332,-0.80362099534371245,0.0089750418159385576,-0.89978021796288332,1.6865860419946097,-0.088235396678772809,-1.1556775188292312,-0.13418597392289497,0.15193078674468238,-0.72260733411252709,-0.13718891630725646,-0.13677588997736473,0.12226299691396832,0.14225860799330309,-0.13264267356553083,1.6711404673606485,1.7124507259804407,-1.3179504612360764,-0.080788245664000655,0.16974358052794089,-0.17006938830072316,1.1571643408201449,-0.14434884306793164,-0.5994071507611306],"K":[[1.0610706933106511,0.23723149345404967,7.1735799495767323E-5,0.2244303986318498,0.00013674828868931755,0.00036454555358202324,0.24157665789348748,8.5321122006084873E-5,0.632872785312267,0.19118201184620595,2.5168775437828403E-5,0.067685593911150407,0.0022919600321909977,0.00292564586265798,0.35648665920035538,0.0052162206890784728,0.070129443103698452,0.00020982682438396686,0.0011216473646147877,0.14760363271362828,0.024835709212787837,0.021367004235079055,0.045388639847309557,0.0046343340399113151,0.080566113671024731,0.0012190911481772648,0.0018201067025419072,0.10797205848264935,0.0094539744404264579,0.0044110265903628525,0.0094702741051610525,0.0908793048533162,0.012592543298802073,0.00033574849425833649,0.32085993760131409,0.0021885669657247756,0.023999670517642895,0.0070491308989063094,0.068287736995878909,0.00059560518559712721],[0.23723149345404967,1.0610706933106511,0.00026143421723998604,0.18960476884210792,0.00030845741613537084,0.00026387762033799395,0.02853177312207604,0.00010034711419649657,0.084527199603231309,0.021706213925256675,7.0455386864882552E-5,0.0087157724232490921,0.0017526332523360257,0.0068521339050429762,0.041476282033918295,0.006046387594271189,0.078300632403323828,0.00019799915682952877,0.0052140154595539563,0.024273107696930148,0.090247083620548091,0.17100433204970578,0.016355631013863694,0.053212638829541345,0.30809669751265328,0.00071188189898194339,0.0004140978778945273,0.01156752932107946,0.076144386277136239,0.0017228231465850989,0.07725038303403059,0.64632742185647107,0.00783130751433388,0.00047286526718061367,0.055677967138606219,0.011085854577813182,0.0095941778535300216,0.031827130979342456,0.0064464032869044436,0.0012609081448161283],[7.1735799495767323E-5,0.00026143421723998604,1.0610706933106511,0.00096305899741765133,0.35458420896034715,0.0076882251029573752,6.4039302298249949E-6,0.033689459647443187,4.7766246959115982E-5,3.3498461763786872E-5,0.45980631066206695,4.82563799712716E-5,0.0096321340193810147,0.082059603394232461,3.497953760488983E-5,0.020277402162111959,0.0032708126792052161,0.018236784794299535,0.15064301312083236,0.00011470953154880412,0.00994263689538233,9.0029616078565836E-5,0.00084946708951029828,0.00047923675845380889,3.9678956809726042E-5,0.0042509347101217163,0.00015546213484219159,2.6857986191863692E-6,0.0059865468229558828,0.0012672554295185224,5.1849301482312081E-5,0.00066344308238037108,0.0039153722889270536,0.075274420140591214,7.4941001619515763E-6,0.072962047475532366,0.0012230848728452016,0.029685879183741791,1.039030447564452E-5,0.2006196714895748],[0.2244303986318498,0.18960476884210792,0.00096305899741765133,1.0610706933106511,0.0019398621919023713,0.0037721788305778475,0.0296515645459148,0.0011133902993274542,0.16677291844790437,0.086198433229595056,0.00036677304581155429,0.061140033563228322,0.023214933392429454,0.036138975538330051,0.11371008204303604,0.059971532707368921,0.59517490869893064,0.0024903155067620528,0.011700687829013508,0.16715964904586578,0.18803551239207605,0.014180235781472865,0.206758625260074,0.0076701282322821709,0.026603894805146275,0.010755968801442342,0.006517930138805356,0.013126710827746255,0.041371282370969174,0.026974808807124058,0.0058949688995064871,0.14451882219100878,0.10408318743849097,0.004462518171364986,0.0327649798222276,0.020255178753227354,0.13196976162084928,0.06024730957825028,0.025600208299945033,0.0080671214468765861],[0.00013674828868931755,0.00030845741613537084,0.35458420896034715,0.0019398621919023713,1.0610706933106511,0.052410482373788578,1.5065552482768252E-5,0.20414138283344022,0.00011382643186096109,0.00010423826193829873,0.43271531764068488,0.0001842812314096674,0.05081216947652243,0.14830650584128263,9.5205770211463585E-5,0.071450778465115286,0.0071582440200542372,0.12050812332083224,0.083115817380993023,0.00037960332356667986,0.011487837073420949,6.1782625015141217E-5,0.0031410196855980936,0.00022468761270005792,3.7735544127687152E-5,0.026624045179295983,0.00099762184979311562,6.8387287863782149E-6,0.0036321782614193543,0.0070603419288792872,3.1319574450532291E-5,0.00063939370121942338,0.015924810525094132,0.40325284520291427,1.4837371925314137E-5,0.043590956053471588,0.0050115594114231235,0.025221862427983178,3.6678816189603029E-5,0.5537333853088966],[0.00036454555358202324,0.00026387762033799395,0.0076882251029573752,0.0037721788305778475,0.052410482373788578,1.0610706933106511,8.082526837731809E-5,0.3099041429270486,0.00051556119618851887,0.00089621756516394964,0.012834052378055343,0.0024677690125914325,0.4047187814740571,0.037905122812287209,0.00060051912116380066,0.12884553794720546,0.0119670321484896,0.70315878491752326,0.0052319578911634319,0.0032476438302416937,0.004436161848061157,2.1819715586390421E-5,0.024616275289645422,3.4295491968942651E-5,2.6629749866072067E-5,0.59411571210854075,0.044052739958529034,4.6630711442480739E-5,0.00059313382034236666,0.15524831684833085,9.1986838514261148E-6,0.00032742134549458769,0.099471127397515707,0.26511361868892969,5.4126180045947033E-5,0.0037914723193924181,0.046661083305845494,0.0044479760310102761,0.00047089649438297959,0.074489167587386371],[0.24157665789348748,0.02853177312207604,6.4039302298249949E-6,0.0296515645459148,1.5065552482768252E-5,8.082526837731809E-5,1.0610706933106511,1.3870784109599115E-5,0.38114946029684965,0.24103335323198569,2.5327303926381E-6,0.073449106710842552,0.00045291640647092732,0.00030405885897849674,0.37776549315515567,0.000757494214368367,0.0090406973517787141,3.8850201991963326E-5,9.2595384807873436E-5,0.088195320674013325,0.0022283258004427054,0.0032408863905431648,0.013077025354437175,0.000476422526515939,0.01771654094937895,0.0003057751003677163,0.0011581170724216181,0.75833047612477011,0.00077497399718775423,0.0014678739069324154,0.0015598158276102054,0.0091885753361455273,0.0026213482175329057,4.7235754602347152E-5,0.68928734107954048,0.00017805075414012453,0.006771046062983929,0.00059527770340718,0.18494565876371827,6.6395379783566619E-5],[8.5321122006084873E-5,0.00010034711419649657,0.033689459647443187,0.0011133902993274542,0.20414138283344022,0.3099041429270486,1.3870784109599115E-5,1.0610706933106511,9.87161008129883E-5,0.00013791184392769796,0.07987106370944462,0.00033826565812841605,0.11336855613300274,0.039552600594458358,0.00010199250461139746,0.06009128927631497,0.0040933086611089006,0.66682172837249054,0.009170429040331848,0.00052251119871095635,0.0028516892264374,1.1787399204916951E-5,0.0045483482851893329,2.8837744831198226E-5,1.0383155497249031E-5,0.11029081336408815,0.00523640125959076,7.2702041934091158E-6,0.000528870793699134,0.023037091552291646,5.34706246235271E-6,0.00015973289878911046,0.0232466995374492,0.49575311798891519,1.0650039987562106E-5,0.0053448371952254459,0.0084624203491969457,0.0042960134268294906,6.2549588873119118E-5,0.14449344297624062],[0.632872785312267,0.084527199603231309,4.7766246959115982E-5,0.16677291844790437,0.00011382643186096109,0.00051556119618851887,0.38114946029684965,9.87161008129883E-5,1.0610706933106511,0.5020258427258979,1.9486503312594743E-5,0.18404707341731541,0.0029603196443106711,0.0021646824092744267,0.82298230309369491,0.0052656368664858117,0.057260228887933466,0.0002645560424911806,0.00061937785969620306,0.32514300814684322,0.013241677017444437,0.0064254153477127486,0.071384699499545928,0.0014227165329037627,0.026184814343931807,0.0018456125726753923,0.0043305749825461176,0.19817190085079639,0.0037010479770590294,0.0077697849582568,0.0027916454030323841,0.032358318669079851,0.016455823168744076,0.00034365523142486967,0.31256231420216968,0.001134529661179806,0.0377517932145,0.0036793177391380538,0.20292908334154092,0.00049125106210183155],[0.19118201184620595,0.021706213925256675,3.3498461763786872E-5,0.086198433229595056,0.00010423826193829873,0.00089621756516394964,0.24103335323198569,0.00013791184392769796,0.5020258427258979,1.0610706933106511,1.681025098011005E-5,0.56924697911961186,0.0043104456556988932,0.0015721109056470953,0.8155492290581341,0.0054309783247785438,0.038037251878185623,0.00040353289754443858,0.00032500111888708171,0.60741105721828492,0.0059767083563349067,0.0013842998274345032,0.10728923093094538,0.000338911719008629,0.0056846304006415516,0.0033700707122964195,0.013974245224886994,0.17654716606619555,0.0012083894677532281,0.016349115820014845,0.00058337266320000747,0.0087447907617585474,0.022131500356727056,0.00039871819392502822,0.12384257994539422,0.00054168349950445922,0.060934846437734655,0.0017084788062009331,0.59829686397697457,0.00042907022350701285],[2.5168775437828403E-5,7.0455386864882552E-5,0.45980631066206695,0.00036677304581155429,0.43271531764068488,0.012834052378055343,2.5327303926381E-6,0.07987106370944462,1.9486503312594743E-5,1.681025098011005E-5,1.0610706933106511,2.9274725981505256E-5,0.0096728071653366717,0.035974110332116081,1.5735949546546285E-5,0.013459506460575444,0.0013627250276586355,0.034146383972201835,0.037740273489281981,6.1706007161559725E-5,0.0029091315102210908,1.8742159859109549E-5,0.00052451793888403763,9.0643309935970652E-5,9.3678275630613257E-6,0.005383111012908063,0.00018181797128595582,1.1186491288132267E-6,0.0012948401937248864,0.0012593680229292302,1.0251940611701614E-5,0.00016445145122170491,0.002772916218346399,0.10257859902103005,2.6290765717178992E-6,0.017658375747192347,0.00084299259143810171,0.0078587919990673345,5.7551615352765769E-6,0.14227186631247643],[0.067685593911150407,0.0087157724232490921,4.82563799712716E-5,0.061140033563228322,0.0001842812314096674,0.0024677690125914325,0.073449106710842552,0.00033826565812841605,0.18404707341731541,0.56924697911961186,2.9274725981505256E-5,1.0610706933106511,0.0098484348652782012,0.0020977072471260027,0.32055258913845613,0.0092530081589594585,0.037692887899318718,0.001031696991230836,0.00034064700851068209,0.67770423546791614,0.0048170983035391111,0.00048311747857158289,0.18961098859502834,0.00014873080912809457,0.0017634973466868654,0.0092228371737676715,0.050794279346324155,0.059282089258751017,0.00075324631796876477,0.046105150067252659,0.00019651898736507944,0.00400544354970572,0.042921156547048124,0.00082697060689222832,0.03454443688324528,0.000510901236545507,0.12463161765980277,0.0015042681661580251,0.47879588063739376,0.00070308181506713763],[0.0022919600321909977,0.0017526332523360257,0.0096321340193810147,0.023214933392429454,0.05081216947652243,0.4047187814740571,0.00045291640647092732,0.11336855613300274,0.0029603196443106711,0.0043104456556988932,0.0096728071653366717,0.0098484348652782012,1.0610706933106511,0.12156794112983166,0.0031825283714506897,0.5047801624947692,0.0698481712901635,0.269055844548722,0.01538649761933485,0.015382726788942541,0.023586881794843757,0.0001438923253065781,0.1138540693767249,0.0001954872521940844,0.00018354288728618219,0.674201856977847,0.059768055381855076,0.00024602333617049536,0.0030296669437823542,0.34851810826470525,6.040638734302465E-5,0.0020917268750321369,0.44270300107907046,0.23313877717164255,0.00032977315338300747,0.013381124668910541,0.19704285890414075,0.019494479005163354,0.0019584756183332612,0.12312551967437677],[0.00292564586265798,0.0068521339050429762,0.082059603394232461,0.036138975538330051,0.14830650584128263,0.037905122812287209,0.00030405885897849674,0.039552600594458358,0.0021646824092744267,0.0015721109056470953,0.035974110332116081,0.0020977072471260027,0.12156794112983166,1.0610706933106511,0.0016407049429872696,0.38886714319845872,0.11498844088323279,0.0497646738816056,0.30317719916862018,0.0050525035522364986,0.18907565077247157,0.0012018614965793057,0.030818083078615867,0.0029864275270677842,0.00086487763606052977,0.043975266887250883,0.0030843969023455512,0.00013260250706726386,0.045953118469757769,0.02534532419603246,0.00057757962960797214,0.013008887785654649,0.10403411414570549,0.1667244514064137,0.00032961055496739662,0.26713412337843589,0.039091987159447963,0.28620762762245266,0.00049460186741717889,0.45829632053191444],[0.35648665920035538,0.041476282033918295,3.497953760488983E-5,0.11371008204303604,9.5205770211463585E-5,0.00060051912116380066,0.37776549315515567,0.00010199250461139746,0.82298230309369491,0.8155492290581341,1.5735949546546285E-5,0.32055258913845613,0.0031825283714506897,0.0016407049429872696,1.0610706933106511,0.004778827662730023,0.043114285686230831,0.00028708668080959678,0.00039910585159830671,0.44872959403436874,0.0081123552725394146,0.0029220801659122419,0.0816402814796267,0.00065688108219273428,0.012305101169154089,0.0022223122716998702,0.0071417631447585313,0.23518859337348272,0.0019418459428843353,0.010199747830854594,0.0012563286680526793,0.0159651835059108,0.017294192798164524,0.00032490523239855261,0.23060978174627905,0.00070161621084876018,0.044146887970867715,0.0022613866138678465,0.38391220305908891,0.00040399789524143227],[0.0052162206890784728,0.006046387594271189,0.020277402162111959,0.059971532707368921,0.071450778465115286,0.12884553794720546,0.000757494214368367,0.06009128927631497,0.0052656368664858117,0.0054309783247785438,0.013459506460575444,0.0092530081589594585,0.5047801624947692,0.38886714319845872,0.004778827662730023,1.0610706933106511,0.19141202668273502,0.11405443461259789,0.057361200486692229,0.018624656977851928,0.097422455205849384,0.00061311989353858565,0.12794132668056463,0.00094196190886996752,0.00066357436248438561,0.20704870631567746,0.020212980291379218,0.00036821262819953425,0.014076602272629756,0.14717384314199583,0.00026634123192840721,0.008275177464985576,0.46368645498031391,0.202755853551515,0.00066042015824462476,0.0550952191260052,0.18287331135561211,0.0840149978454505,0.0020029398927049534,0.22847012415091114],[0.070129443103698452,0.078300632403323828,0.0032708126792052161,0.59517490869893064,0.0071582440200542372,0.0119670321484896,0.0090406973517787141,0.0040933086611089006,0.057260228887933466,0.038037251878185623,0.0013627250276586355,0.037692887899318718,0.0698481712901635,0.11498844088323279,0.043114285686230831,0.19141202668273502,1.0610706933106511,0.00863324628499441,0.030673103907342437,0.098082540774847418,0.31213293413766724,0.00676140454240412,0.27132132739859816,0.0057620254850549784,0.0096061226195488271,0.030042471417069797,0.010316693304915903,0.00407703183997036,0.050004805259203013,0.056038219513499646,0.0028460191679853218,0.082426120652476537,0.24817791575650225,0.016280788775078027,0.0093116041414947,0.046854669665330057,0.21794026216253237,0.12393528149478231,0.011710885200097604,0.028642337946920966],[0.00020982682438396686,0.00019799915682952877,0.018236784794299535,0.0024903155067620528,0.12050812332083224,0.70315878491752326,3.8850201991963326E-5,0.66682172837249054,0.0002645560424911806,0.00040353289754443858,0.034146383972201835,0.001031696991230836,0.269055844548722,0.0497646738816056,0.00028708668080959678,0.11405443461259789,0.00863324628499441,1.0610706933106511,0.0085042757384463565,0.0015023739245231273,0.0044456837451876379,1.9508582486175213E-5,0.012409821594606817,3.8307245829160391E-5,2.0119143356372581E-5,0.29369368031486925,0.016039346599879142,2.1172026207249966E-5,0.00069029822993765138,0.0670152608298221,8.5169949010905478E-6,0.00028029984103849213,0.058229115543596117,0.48868916236854176,2.8157420091734411E-5,0.0055637303301261124,0.023250460378923477,0.00546203577789991,0.00019341298843249735,0.13204654788565562],[0.0011216473646147877,0.0052140154595539563,0.15064301312083236,0.011700687829013508,0.083115817380993023,0.0052319578911634319,9.2595384807873436E-5,0.009170429040331848,0.00061937785969620306,0.00032500111888708171,0.037740273489281981,0.00034064700851068209,0.01538649761933485,0.30317719916862018,0.00039910585159830671,0.057361200486692229,0.030673103907342437,0.0085042757384463565,1.0610706933106511,0.0009367631917919318,0.14100507066766244,0.0020549610480623667,0.0047133491090635658,0.0091414009795517948,0.00091367346385074649,0.0052483137456886021,0.00032627550726349374,3.70877320616154E-5,0.10826001850594108,0.0028872667170874292,0.0011732977230068918,0.013563946918094575,0.013986154380446288,0.03798671679047317,0.00012557524481236938,0.815150797010596,0.0053801062877564644,0.40070132072722159,9.0897644958179766E-5,0.16512678945615425],[0.14760363271362828,0.024273107696930148,0.00011470953154880412,0.16715964904586578,0.00037960332356667986,0.0032476438302416937,0.088195320674013325,0.00052251119871095635,0.32514300814684322,0.60741105721828492,6.1706007161559725E-5,0.67770423546791614,0.015382726788942541,0.0050525035522364986,0.44872959403436874,0.018624656977851928,0.098082540774847418,0.0015023739245231273,0.0009367631917919318,1.0610706933106511,0.013987406047909738,0.0013827957917820967,0.3225903815756378,0.00046599251670399988,0.00451823182912825,0.011804377923550866,0.034766686728101452,0.056783902086147031,0.002341722412964123,0.05265681886627252,0.00056253980119938237,0.011900332234595589,0.0743661474451737,0.0014787974086066802,0.051392014555429057,0.0014568014663464612,0.19286109208827046,0.0043375836985303593,0.28570334063399405,0.0015099069840136612],[0.024835709212787837,0.090247083620548091,0.00994263689538233,0.18803551239207605,0.011487837073420949,0.004436161848061157,0.0022283258004427054,0.0028516892264374,0.013241677017444437,0.0059767083563349067,0.0029091315102210908,0.0048170983035391111,0.023586881794843757,0.18907565077247157,0.0081123552725394146,0.097422455205849384,0.31213293413766724,0.0044456837451876379,0.14100507066766244,0.013987406047909738,1.0610706933106511,0.018517155758139451,0.039441559299784254,0.031106653076589372,0.013881140811274157,0.0081917486360894142,0.0013955372842790275,0.00090162226575253145,0.31113444830835196,0.0098652940704671583,0.0088217974211521038,0.17384420286092397,0.055004117720660536,0.013487845103035542,0.003077510610077377,0.24764730363494225,0.033883742811677782,0.60431461033104616,0.0016450771306790017,0.04131226768261953],[0.021367004235079055,0.17100433204970578,9.0029616078565836E-5,0.014180235781472865,6.1782625015141217E-5,2.1819715586390421E-5,0.0032408863905431648,1.1787399204916951E-5,0.0064254153477127486,0.0013842998274345032,1.8742159859109549E-5,0.00048311747857158289,0.0001438923253065781,0.0012018614965793057,0.0029220801659122419,0.00061311989353858565,0.00676140454240412,1.9508582486175213E-5,0.0020549610480623667,0.0013827957917820967,0.018517155758139451,1.0610706933106511,0.00097045808701883311,0.26261276945075246,0.411829597439958,5.1468458331077568E-5,2.1195960159832649E-5,0.0013525537737657312,0.057619872357142173,0.00010388642480916048,0.77679286869084219,0.21827213652805286,0.000560675962216607,6.1144803912590817E-5,0.0084597114786985859,0.0046085890785402322,0.000582781942376664,0.0099457136869242554,0.00041843991400540033,0.00022281133674364065],[0.045388639847309557,0.016355631013863694,0.00084946708951029828,0.206758625260074,0.0031410196855980936,0.024616275289645422,0.013077025354437175,0.0045483482851893329,0.071384699499545928,0.10728923093094538,0.00052451793888403763,0.18961098859502834,0.1138540693767249,0.030818083078615867,0.0816402814796267,0.12794132668056463,0.27132132739859816,0.012409821594606817,0.0047133491090635658,0.3225903815756378,0.039441559299784254,0.00097045808701883311,1.0610706933106511,0.000587072622726449,0.002083872050726378,0.080375223440479662,0.084694052737490935,0.0074704068822863566,0.0050911421464944137,0.261740061544273,0.00038902736652717251,0.01197648684815817,0.4561284537835617,0.0124724383445645,0.0088613633913630172,0.0062567489035574532,0.86873099041731294,0.015754857062338767,0.047101286765714123,0.01150780441341605],[0.0046343340399113151,0.053212638829541345,0.00047923675845380889,0.0076701282322821709,0.00022468761270005792,3.4295491968942651E-5,0.000476422526515939,2.8837744831198226E-5,0.0014227165329037627,0.000338911719008629,9.0643309935970652E-5,0.00014873080912809457,0.0001954872521940844,0.0029864275270677842,0.00065688108219273428,0.00094196190886996752,0.0057620254850549784,3.8307245829160391E-5,0.0091414009795517948,0.00046599251670399988,0.031106653076589372,0.26261276945075246,0.000587072622726449,1.0610706933106511,0.05734357612150242,6.3199478924229934E-5,1.3234397821102524E-5,0.00018551738294310367,0.18693786061535431,8.7408549808841481E-5,0.25467819287774029,0.12864446849186464,0.00054189446809592477,0.00014961916761775058,0.0011372351899209346,0.018965129439651125,0.00040774323341078258,0.028297142233467982,9.0993838066234914E-5,0.00066294022463255474],[0.080566113671024731,0.30809669751265328,3.9678956809726042E-5,0.026603894805146275,3.7735544127687152E-5,2.6629749866072067E-5,0.01771654094937895,1.0383155497249031E-5,0.026184814343931807,0.0056846304006415516,9.3678275630613257E-6,0.0017634973466868654,0.00018354288728618219,0.00086487763606052977,0.012305101169154089,0.00066357436248438561,0.0096061226195488271,2.0119143356372581E-5,0.00091367346385074649,0.00451823182912825,0.013881140811274157,0.411829597439958,0.002083872050726378,0.05734357612150242,1.0610706933106511,7.37411590378983E-5,5.1609105095700744E-5,0.0078579721137520143,0.022698192819284767,0.0001929447786011933,0.25065458441831079,0.19729794308007728,0.0008689612296070529,5.1176924752677828E-5,0.046466851993283605,0.0020592349323695922,0.0011522055241871615,0.0054576488419690716,0.0019386615108991324,0.00015212118540919658],[0.0012190911481772648,0.00071188189898194339,0.0042509347101217163,0.010755968801442342,0.026624045179295983,0.59411571210854075,0.0003057751003677163,0.11029081336408815,0.0018456125726753923,0.0033700707122964195,0.005383111012908063,0.0092228371737676715,0.674201856977847,0.043975266887250883,0.0022223122716998702,0.20704870631567746,0.030042471417069797,0.29369368031486925,0.0052483137456886021,0.011804377923550866,0.0081917486360894142,5.1468458331077568E-5,0.080375223440479662,6.3199478924229934E-5,7.37411590378983E-5,1.0610706933106511,0.11776211676161273,0.00018126334937044482,0.00098441180013861783,0.45439533529002135,2.1148624172226042E-5,0.0007734225016481918,0.26209700303905381,0.14534092683876038,0.0001975260666521757,0.00442343245367814,0.14807027601654224,0.0064559655857219971,0.0018157523053306652,0.054061789512526215],[0.0018201067025419072,0.0004140978778945273,0.00015546213484219159,0.006517930138805356,0.00099762184979311562,0.044052739958529034,0.0011581170724216181,0.00523640125959076,0.0043305749825461176,0.013974245224886994,0.00018181797128595582,0.050794279346324155,0.059768055381855076,0.0030843969023455512,0.0071417631447585313,0.020212980291379218,0.010316693304915903,0.016039346599879142,0.00032627550726349374,0.034766686728101452,0.0013955372842790275,2.1195960159832649E-5,0.084694052737490935,1.3234397821102524E-5,5.1609105095700744E-5,0.11776211676161273,1.0610706933106511,0.00093032719579059641,0.00014835151107246805,0.32329973976076604,8.26915006139166E-6,0.00028802414683761645,0.074871278749061812,0.0062587441634227555,0.00054225220733030951,0.00033854693073043088,0.12204652146719386,0.00069152816413945144,0.013279593732592226,0.0024502945797226037],[0.10797205848264935,0.01156752932107946,2.6857986191863692E-6,0.013126710827746255,6.8387287863782149E-6,4.6630711442480739E-5,0.75833047612477011,7.2702041934091158E-6,0.19817190085079639,0.17654716606619555,1.1186491288132267E-6,0.059282089258751017,0.00024602333617049536,0.00013260250706726386,0.23518859337348272,0.00036821262819953425,0.00407703183997036,2.1172026207249966E-5,3.70877320616154E-5,0.056783902086147031,0.00090162226575253145,0.0013525537737657312,0.0074704068822863566,0.00018551738294310367,0.0078579721137520143,0.00018126334937044482,0.00093032719579059641,1.0610706933106511,0.0002971015960323633,0.00093348447025390412,0.00066359859612786392,0.0036277578642269783,0.0014084604757795903,2.3298287478027578E-5,0.40824769564828406,7.04992874233084E-5,0.0039240107701538343,0.00023761667930773946,0.1975185396459605,3.0022485959726119E-5],[0.0094539744404264579,0.076144386277136239,0.0059865468229558828,0.041371282370969174,0.0036321782614193543,0.00059313382034236666,0.00077497399718775423,0.000528870793699134,0.0037010479770590294,0.0012083894677532281,0.0012948401937248864,0.00075324631796876477,0.0030296669437823542,0.045953118469757769,0.0019418459428843353,0.014076602272629756,0.050004805259203013,0.00069029822993765138,0.10826001850594108,0.002341722412964123,0.31113444830835196,0.057619872357142173,0.0050911421464944137,0.18693786061535431,0.022698192819284767,0.00098441180013861783,0.00014835151107246805,0.0002971015960323633,1.0610706933106511,0.0011011079444679438,0.034454392508569368,0.21433694378023319,0.00667074303007911,0.0026318251358610103,0.001395736465839455,0.21711119952757862,0.0041013015413207234,0.343019907227825,0.00031488569588590656,0.010890789187230415],[0.0044110265903628525,0.0017228231465850989,0.0012672554295185224,0.026974808807124058,0.0070603419288792872,0.15524831684833085,0.0014678739069324154,0.023037091552291646,0.0077697849582568,0.016349115820014845,0.0012593680229292302,0.046105150067252659,0.34851810826470525,0.02534532419603246,0.010199747830854594,0.14717384314199583,0.056038219513499646,0.0670152608298221,0.0028872667170874292,0.05265681886627252,0.0098652940704671583,0.00010388642480916048,0.261740061544273,8.7408549808841481E-5,0.0001929447786011933,0.45439533529002135,0.32329973976076604,0.00093348447025390412,0.0011011079444679438,1.0610706933106511,4.1470778314706393E-5,0.0014913381397803375,0.42423275770252111,0.038386971812812608,0.00086922231973720092,0.0029367347003363175,0.436650178319671,0.0055847093394788905,0.00969065005702761,0.0188572018022846],[0.0094702741051610525,0.07725038303403059,5.1849301482312081E-5,0.0058949688995064871,3.1319574450532291E-5,9.1986838514261148E-6,0.0015598158276102054,5.34706246235271E-6,0.0027916454030323841,0.00058337266320000747,1.0251940611701614E-5,0.00019651898736507944,6.040638734302465E-5,0.00057757962960797214,0.0012563286680526793,0.00026634123192840721,0.0028460191679853218,8.5169949010905478E-6,0.0011732977230068918,0.00056253980119938237,0.0088217974211521038,0.77679286869084219,0.00038902736652717251,0.25467819287774029,0.25065458441831079,2.1148624172226042E-5,8.26915006139166E-6,0.00066359859612786392,0.034454392508569368,4.1470778314706393E-5,1.0610706933106511,0.10288798126013755,0.00022986290970781938,2.8136036977835297E-5,0.0042782037604252327,0.0026213816039944433,0.00023369644882965251,0.0052116027454721181,0.00017854791839474,0.00010881147804886822],[0.0908793048533162,0.64632742185647107,0.00066344308238037108,0.14451882219100878,0.00063939370121942338,0.00032742134549458769,0.0091885753361455273,0.00015973289878911046,0.032358318669079851,0.0087447907617585474,0.00016445145122170491,0.00400544354970572,0.0020917268750321369,0.013008887785654649,0.0159651835059108,0.008275177464985576,0.082426120652476537,0.00028029984103849213,0.013563946918094575,0.011900332234595589,0.17384420286092397,0.21827213652805286,0.01197648684815817,0.12864446849186464,0.19729794308007728,0.0007734225016481918,0.00028802414683761645,0.0036277578642269783,0.21433694378023319,0.0014913381397803375,0.10288798126013755,1.0610706933106511,0.0078306105739629466,0.00078606675179420879,0.017884644004728553,0.029062745795886913,0.0076699516952029971,0.0752149396536444,0.0024342471350467312,0.0024464697926975913],[0.012592543298802073,0.00783130751433388,0.0039153722889270536,0.10408318743849097,0.015924810525094132,0.099471127397515707,0.0026213482175329057,0.0232466995374492,0.016455823168744076,0.022131500356727056,0.002772916218346399,0.042921156547048124,0.44270300107907046,0.10403411414570549,0.017294192798164524,0.46368645498031391,0.24817791575650225,0.058229115543596117,0.013986154380446288,0.0743661474451737,0.055004117720660536,0.000560675962216607,0.4561284537835617,0.00054189446809592477,0.0008689612296070529,0.26209700303905381,0.074871278749061812,0.0014084604757795903,0.00667074303007911,0.42423275770252111,0.00022986290970781938,0.0078306105739629466,1.0610706933106511,0.06277881227951447,0.0019405123557733577,0.01554666949843591,0.65526233152678726,0.031073167583873573,0.0093562881124568537,0.052475999300795849],[0.00033574849425833649,0.00047286526718061367,0.075274420140591214,0.004462518171364986,0.40325284520291427,0.26511361868892969,4.7235754602347152E-5,0.49575311798891519,0.00034365523142486967,0.00039871819392502822,0.10257859902103005,0.00082697060689222832,0.23313877717164255,0.1667244514064137,0.00032490523239855261,0.202755853551515,0.016280788775078027,0.48868916236854176,0.03798671679047317,0.0014787974086066802,0.013487845103035542,6.1144803912590817E-5,0.0124724383445645,0.00014961916761775058,5.1176924752677828E-5,0.14534092683876038,0.0062587441634227555,2.3298287478027578E-5,0.0026318251358610103,0.038386971812812608,2.8136036977835297E-5,0.00078606675179420879,0.06277881227951447,1.0610706933106511,4.0003474928630145E-5,0.023827259372055008,0.021367494539408317,0.020268885503450761,0.00015948704073375208,0.48211835426343735],[0.32085993760131409,0.055677967138606219,7.4941001619515763E-6,0.0327649798222276,1.4837371925314137E-5,5.4126180045947033E-5,0.68928734107954048,1.0650039987562106E-5,0.31256231420216968,0.12384257994539422,2.6290765717178992E-6,0.03454443688324528,0.00032977315338300747,0.00032961055496739662,0.23060978174627905,0.00066042015824462476,0.0093116041414947,2.8157420091734411E-5,0.00012557524481236938,0.051392014555429057,0.003077510610077377,0.0084597114786985859,0.0088613633913630172,0.0011372351899209346,0.046466851993283605,0.0001975260666521757,0.00054225220733030951,0.40824769564828406,0.001395736465839455,0.00086922231973720092,0.0042782037604252327,0.017884644004728553,0.0019405123557733577,4.0003474928630145E-5,1.0610706933106511,0.00025367288962838889,0.0044997448888394048,0.00084011961631104989,0.0748579662844443,6.6119824438462427E-5],[0.0021885669657247756,0.011085854577813182,0.072962047475532366,0.020255178753227354,0.043590956053471588,0.0037914723193924181,0.00017805075414012453,0.0053448371952254459,0.001134529661179806,0.00054168349950445922,0.017658375747192347,0.000510901236545507,0.013381124668910541,0.26713412337843589,0.00070161621084876018,0.0550952191260052,0.046854669665330057,0.0055637303301261124,0.815150797010596,0.0014568014663464612,0.24764730363494225,0.0046085890785402322,0.0062567489035574532,0.018965129439651125,0.0020592349323695922,0.00442343245367814,0.00033854693073043088,7.04992874233084E-5,0.21711119952757862,0.0029367347003363175,0.0026213816039944433,0.029062745795886913,0.01554666949843591,0.023827259372055008,0.00025367288962838889,1.0610706933106511,0.0065927337356707517,0.65689815188850953,0.00014796197935322986,0.10300188324372297],[0.023999670517642895,0.0095941778535300216,0.0012230848728452016,0.13196976162084928,0.0050115594114231235,0.046661083305845494,0.006771046062983929,0.0084624203491969457,0.0377517932145,0.060934846437734655,0.00084299259143810171,0.12463161765980277,0.19704285890414075,0.039091987159447963,0.044146887970867715,0.18287331135561211,0.21794026216253237,0.023250460378923477,0.0053801062877564644,0.19286109208827046,0.033883742811677782,0.000582781942376664,0.86873099041731294,0.00040774323341078258,0.0011522055241871615,0.14807027601654224,0.12204652146719386,0.0039240107701538343,0.0041013015413207234,0.436650178319671,0.00023369644882965251,0.0076699516952029971,0.65526233152678726,0.021367494539408317,0.0044997448888394048,0.0065927337356707517,1.0610706933106511,0.015243090483508644,0.02845089092115646,0.017241025102728694],[0.0070491308989063094,0.031827130979342456,0.029685879183741791,0.06024730957825028,0.025221862427983178,0.0044479760310102761,0.00059527770340718,0.0042960134268294906,0.0036793177391380538,0.0017084788062009331,0.0078587919990673345,0.0015042681661580251,0.019494479005163354,0.28620762762245266,0.0022613866138678465,0.0840149978454505,0.12393528149478231,0.00546203577789991,0.40070132072722159,0.0043375836985303593,0.60431461033104616,0.0099457136869242554,0.015754857062338767,0.028297142233467982,0.0054576488419690716,0.0064559655857219971,0.00069152816413945144,0.00023761667930773946,0.343019907227825,0.0055847093394788905,0.0052116027454721181,0.0752149396536444,0.031073167583873573,0.020268885503450761,0.00084011961631104989,0.65689815188850953,0.015243090483508644,1.0610706933106511,0.00046709780135775856,0.076408274991333847],[0.068287736995878909,0.0064464032869044436,1.039030447564452E-5,0.025600208299945033,3.6678816189603029E-5,0.00047089649438297959,0.18494565876371827,6.2549588873119118E-5,0.20292908334154092,0.59829686397697457,5.7551615352765769E-6,0.47879588063739376,0.0019584756183332612,0.00049460186741717889,0.38391220305908891,0.0020029398927049534,0.011710885200097604,0.00019341298843249735,9.0897644958179766E-5,0.28570334063399405,0.0016450771306790017,0.00041843991400540033,0.047101286765714123,9.0993838066234914E-5,0.0019386615108991324,0.0018157523053306652,0.013279593732592226,0.1975185396459605,0.00031488569588590656,0.00969065005702761,0.00017854791839474,0.0024342471350467312,0.0093562881124568537,0.00015948704073375208,0.0748579662844443,0.00014796197935322986,0.02845089092115646,0.00046709780135775856,1.0610706933106511,0.00014689522234172985],[0.00059560518559712721,0.0012609081448161283,0.2006196714895748,0.0080671214468765861,0.5537333853088966,0.074489167587386371,6.6395379783566619E-5,0.14449344297624062,0.00049125106210183155,0.00042907022350701285,0.14227186631247643,0.00070308181506713763,0.12312551967437677,0.45829632053191444,0.00040399789524143227,0.22847012415091114,0.028642337946920966,0.13204654788565562,0.16512678945615425,0.0015099069840136612,0.04131226768261953,0.00022281133674364065,0.01150780441341605,0.00066294022463255474,0.00015212118540919658,0.054061789512526215,0.0024502945797226037,3.0022485959726119E-5,0.010890789187230415,0.0188572018022846,0.00010881147804886822,0.0024464697926975913,0.052475999300795849,0.48211835426343735,6.6119824438462427E-5,0.10300188324372297,0.017241025102728694,0.076408274991333847,0.00014689522234172985,1.0610706933106511]],"invK":[[1.7306210479878952,-0.31817790254886219,1.2129362940088651E-5,-0.20029213797765905,-0.00015491042101324748,-4.7396015729505038E-5,0.093754705482590989,-2.6733881441750762E-5,-1.3569161197693032,-0.1254939125870316,1.645758307653767E-5,0.011081774181578061,0.0013382847909863876,-0.0013165114114489747,0.61514520896178382,-0.0032072801520892109,0.065975028626660784,-7.3001109882576194E-6,-0.00018045650487200283,0.017154115507661473,0.000830894232762891,0.019288163510392985,0.0064078546888923227,-0.0029796745751522486,-0.022450431439666043,-0.00024839868346848113,-0.0003291946222498861,0.010217293699576522,-0.0053663418948111273,0.00041651511161400141,-0.00571859212891875,0.10677594598854728,-0.002542950283086153,0.0001161698769712926,-0.286964376489227,0.00086216398858442915,-0.0028889774137555967,-0.00076914965448318922,-0.0056469542064565524,0.000596552776052978],[-0.31817790254886219,1.6844724211548523,-8.7090265057203475E-5,-0.14394447461610549,-0.00010422400415348144,-1.1011832307649078E-5,0.0076167180435670785,-2.1297043757173665E-5,0.13933328712386261,0.0077625187367283159,3.3489191990910743E-5,-0.0043657300451273124,0.00069027543155506833,-0.000624342409180745,-0.04791699581953069,-0.0022178737439821658,0.03755449975969815,1.2716068095108405E-6,0.0026215214241914254,0.0086286353711416026,0.021287469958236674,0.029405721459576786,0.014270077811772447,0.025451575270337062,-0.30510982624751354,-0.00015489718439370707,-0.00013296145277225916,-0.0035115348445574324,0.07702631351075076,0.00028456047665803048,0.015275186292538309,-0.95805516979255134,-0.00021139806708297975,7.8032185097663353E-5,0.0054459217787984947,-0.0055072326457123282,-0.0073150187855053053,-0.011004807735662417,0.00045855574532205438,0.00040593230523860031],[1.2129362940088243E-5,-8.7090265057203611E-5,1.2362483330491696,-0.00010323844527695691,-0.21072846761572289,0.0043004950661684315,-1.3551163881913055E-6,0.027232193208626736,2.1526346428928329E-6,-1.1045682904956709E-6,-0.44195661222242072,-8.076550049466419E-6,-0.0035878183605748352,0.0060153622250371172,-3.90691566040334E-7,0.0062530919086821232,-6.2200808623518209E-5,-0.025673931848747285,-0.21180036320285794,1.4965099657455976E-5,0.0021315603722520272,3.2047902838452965E-5,-0.00011102708570539662,0.00017821951285711563,1.0506793719408691E-6,-5.2130499209555838E-5,-5.8905860568697452E-5,4.498727658046891E-7,-0.002940836193961027,0.00042203369691116142,-2.9108001528400876E-5,0.00019349160343467171,-0.000905138174562714,0.072869823136512191,-5.154032371238564E-7,0.10303806531643389,0.00025875815239541388,-0.0081459295430362389,1.1484516378807943E-6,-0.078432472339207582],[-0.20029213797765891,-0.14394447461610549,-0.0001032384452769587,1.4991149533242485,0.0025744368916168743,0.0007630592901207027,0.018153032447605171,0.00039524120586690561,-0.054573715094391816,0.019051024630891075,-0.0002965867626388968,0.058257362105201251,-0.024094011431596934,0.021652285549400407,0.013180749442038914,0.051564786368073885,-0.80051947237174936,0.00018010595649963165,0.00013965104375828079,-0.147799