<?xml version="1.0" encoding="UTF-8" standalone="no"?>
<!-- Created with Inkscape (http://www.inkscape.org/) -->

<svg
   width="512.0px"
   height="512.0px"
   viewBox="0 0 512.0 512.0"
   version="1.1"
   id="SVGRoot"
   sodipodi:docname="DIPS_3.svg"
   xml:space="preserve"
   inkscape:version="1.2.2 (b0a8486541, 2022-12-01)"
   xmlns:inkscape="http://www.inkscape.org/namespaces/inkscape"
   xmlns:sodipodi="http://sodipodi.sourceforge.net/DTD/sodipodi-0.dtd"
   xmlns:xlink="http://www.w3.org/1999/xlink"
   xmlns="http://www.w3.org/2000/svg"
   xmlns:svg="http://www.w3.org/2000/svg"><sodipodi:namedview
     id="namedview181"
     pagecolor="#ffffff"
     bordercolor="#ffffff"
     borderopacity="1"
     inkscape:showpageshadow="0"
     inkscape:pageopacity="0"
     inkscape:pagecheckerboard="false"
     inkscape:deskcolor="#646464"
     inkscape:document-units="px"
     showgrid="true"
     inkscape:zoom="1.4142136"
     inkscape:cx="333.04729"
     inkscape:cy="328.4511"
     inkscape:window-width="2560"
     inkscape:window-height="1348"
     inkscape:window-x="0"
     inkscape:window-y="0"
     inkscape:window-maximized="1"
     inkscape:current-layer="g3577"
     showguides="false"
     showborder="true"><inkscape:grid
       type="xygrid"
       id="grid187"
       enabled="false" /></sodipodi:namedview><defs
     id="defs176"><linearGradient
   inkscape:collect="always"
   id="linearGradient1574"><stop
     style="stop-color:#725835;stop-opacity:1;"
     offset="1"
     id="stop1570" /><stop
     style="stop-color:#4a3622;stop-opacity:1;"
     offset="1"
     id="stop1572" /></linearGradient><clipPath
   id="clipPath1099">
      <path
   d="M 0,0 H 6 V 4.289062 H 0 Z m 0,0"
   id="path32" />
    </clipPath>
  <clipPath
   id="clipPath3941">
      <path
   d="M 0,0 H 14 V 10.671875 H 0 Z m 0,0"
   id="path1289" />
    </clipPath>
  <clipPath
   id="clipPath8189">
      <path
   d="M 0,0 H 13 V 10.671875 H 0 Z m 0,0"
   id="path4034" />
    </clipPath>
  <clipPath
   id="clipPath1986">
      <path
   d="M 0,0 H 12 V 15.492188 H 0 Z m 0,0"
   id="path5339" />
    </clipPath>
  <clipPath
   id="clipPath6578">
      <path
   d="M 1,0 H 11 V 15.976562 H 1 Z m 0,0"
   id="path1424" />
    </clipPath>
  <clipPath
   id="clipPath4606">
      <path
   d="M 1,0 H 12 V 10.671875 H 1 Z m 0,0"
   id="path6334" />
    </clipPath>
  <clipPath
   id="clipPath2078">
      <path
   d="m 36,0 h 6 v 24.742188 h -6 z m 0,0"
   id="path1846" />
    </clipPath>
    <clipPath
   id="clipPath142">
      <path
   d="m 51,0 h 6 v 24.742188 h -6 z m 0,0"
   id="path7624" />
    </clipPath>
  <clipPath
   id="clipPath525">
      <path
   d="M 1,0 H 30 V 29.886719 H 1 Z m 0,0"
   id="path7869" />
    </clipPath>
  <clipPath
   id="clipPath5584">
      <path
   d="M 1,0 H 27 V 29.886719 H 1 Z m 0,0"
   id="path8031" />
    </clipPath>
  <clipPath
   id="clipPath8327">
      <path
   d="M 2,0 H 18 V 19.132812 H 2 Z m 0,0"
   id="path5266" />
    </clipPath>
  <clipPath
   id="clipPath1664">
      <path
   d="M 0,0 H 12 V 11.015625 H 0 Z m 0,0"
   id="path1124" />
    </clipPath>
  <clipPath
   id="clipPath2844">
      <path
   d="M 2,0 H 22 V 24.742188 H 2 Z m 0,0"
   id="path4801" />
    </clipPath>
  <filter
   style="color-interpolation-filters:sRGB;"
   inkscape:label="Drop Shadow"
   id="filter2106588"
   x="-0.026891193"
   y="-0.021551041"
   width="1.0823863"
   height="1.0430713"><feFlood
     flood-opacity="0.498039"
     flood-color="rgb(0,0,0)"
     result="flood"
     id="feFlood2106578" /><feComposite
     in="flood"
     in2="SourceGraphic"
     operator="in"
     result="composite1"
     id="feComposite2106580" /><feGaussianBlur
     in="composite1"
     stdDeviation="3"
     result="blur"
     id="feGaussianBlur2106582" /><feOffset
     dx="8"
     dy="1.94289e-16"
     result="offset"
     id="feOffset2106584" /><feComposite
     in="SourceGraphic"
     in2="offset"
     operator="over"
     result="composite2"
     id="feComposite2106586" /></filter><filter
   style="color-interpolation-filters:sRGB;"
   inkscape:label="Drop Shadow"
   id="filter820"
   x="-0.096133362"
   y="-0.09664971"
   width="1.294535"
   height="1.193288"><feFlood
     flood-opacity="0.498039"
     flood-color="rgb(0,0,0)"
     result="flood"
     id="feFlood810" /><feComposite
     in="flood"
     in2="SourceGraphic"
     operator="in"
     result="composite1"
     id="feComposite812" /><feGaussianBlur
     in="composite1"
     stdDeviation="3"
     result="blur"
     id="feGaussianBlur814" /><feOffset
     dx="8"
     dy="0"
     result="offset"
     id="feOffset816" /><feComposite
     in="SourceGraphic"
     in2="offset"
     operator="over"
     result="composite2"
     id="feComposite818" /></filter><filter
   style="color-interpolation-filters:sRGB;"
   inkscape:label="Drop Shadow"
   id="filter832"
   x="-0.096133354"
   y="-0.096649715"
   width="1.294535"
   height="1.193288"><feFlood
     flood-opacity="0.498039"
     flood-color="rgb(0,0,0)"
     result="flood"
     id="feFlood822" /><feComposite
     in="flood"
     in2="SourceGraphic"
     operator="in"
     result="composite1"
     id="feComposite824" /><feGaussianBlur
     in="composite1"
     stdDeviation="3"
     result="blur"
     id="feGaussianBlur826" /><feOffset
     dx="8"
     dy="0"
     result="offset"
     id="feOffset828" /><feComposite
     in="SourceGraphic"
     in2="offset"
     operator="over"
     result="composite2"
     id="feComposite830" /></filter><filter
   style="color-interpolation-filters:sRGB;"
   inkscape:label="Drop Shadow"
   id="filter844"
   x="-0.096133354"
   y="-0.096649711"
   width="1.294535"
   height="1.193288"><feFlood
     flood-opacity="0.498039"
     flood-color="rgb(0,0,0)"
     result="flood"
     id="feFlood834" /><feComposite
     in="flood"
     in2="SourceGraphic"
     operator="in"
     result="composite1"
     id="feComposite836" /><feGaussianBlur
     in="composite1"
     stdDeviation="3"
     result="blur"
     id="feGaussianBlur838" /><feOffset
     dx="8"
     dy="0"
     result="offset"
     id="feOffset840" /><feComposite
     in="SourceGraphic"
     in2="offset"
     operator="over"
     result="composite2"
     id="feComposite842" /></filter><filter
   style="color-interpolation-filters:sRGB;"
   inkscape:label="Drop Shadow"
   id="filter856"
   x="-0.096133348"
   y="-0.096649711"
   width="1.294535"
   height="1.193288"><feFlood
     flood-opacity="0.498039"
     flood-color="rgb(0,0,0)"
     result="flood"
     id="feFlood846" /><feComposite
     in="flood"
     in2="SourceGraphic"
     operator="in"
     result="composite1"
     id="feComposite848" /><feGaussianBlur
     in="composite1"
     stdDeviation="3"
     result="blur"
     id="feGaussianBlur850" /><feOffset
     dx="8"
     dy="0"
     result="offset"
     id="feOffset852" /><feComposite
     in="SourceGraphic"
     in2="offset"
     operator="over"
     result="composite2"
     id="feComposite854" /></filter><filter
   style="color-interpolation-filters:sRGB;"
   inkscape:label="Drop Shadow"
   id="filter868"
   x="-0.096133356"
   y="-0.096649709"
   width="1.294535"
   height="1.193288"><feFlood
     flood-opacity="0.498039"
     flood-color="rgb(0,0,0)"
     result="flood"
     id="feFlood858" /><feComposite
     in="flood"
     in2="SourceGraphic"
     operator="in"
     result="composite1"
     id="feComposite860" /><feGaussianBlur
     in="composite1"
     stdDeviation="3"
     result="blur"
     id="feGaussianBlur862" /><feOffset
     dx="8"
     dy="0"
     result="offset"
     id="feOffset864" /><feComposite
     in="SourceGraphic"
     in2="offset"
     operator="over"
     result="composite2"
     id="feComposite866" /></filter>
	
	
<linearGradient
   inkscape:collect="always"
   xlink:href="#linearGradient1574"
   id="linearGradient6686"
   gradientUnits="userSpaceOnUse"
   gradientTransform="translate(0.77152252)"
   x1="103.92697"
   y1="294.47557"
   x2="405.65631"
   y2="294.47557" /><linearGradient
   inkscape:collect="always"
   xlink:href="#linearGradient1574"
   id="linearGradient3527"
   gradientUnits="userSpaceOnUse"
   gradientTransform="translate(0.77152252)"
   x1="103.92697"
   y1="294.47557"
   x2="405.65631"
   y2="294.47557" /><linearGradient
   inkscape:collect="always"
   xlink:href="#linearGradient1574"
   id="linearGradient3555"
   gradientUnits="userSpaceOnUse"
   gradientTransform="translate(0.77152252)"
   x1="103.92697"
   y1="294.47557"
   x2="405.65631"
   y2="294.47557" /><linearGradient
   inkscape:collect="always"
   xlink:href="#linearGradient1574"
   id="linearGradient3583"
   gradientUnits="userSpaceOnUse"
   gradientTransform="translate(0.77152252)"
   x1="103.92697"
   y1="294.47557"
   x2="405.65631"
   y2="294.47557" /><linearGradient
   inkscape:collect="always"
   xlink:href="#linearGradient1574"
   id="linearGradient4517"
   gradientUnits="userSpaceOnUse"
   gradientTransform="translate(0.77152252)"
   x1="103.92697"
   y1="294.47557"
   x2="405.65631"
   y2="294.47557" /></defs><g
     inkscape:label="Ebene 1"
     inkscape:groupmode="layer"
     id="layer1" /><g
     inkscape:groupmode="layer"
     id="layer2"
     inkscape:label="Ebene 2"><g
       id="g8809"
       transform="matrix(1.2440833,0,0,1.1708065,-68.606242,-68.737786)"
       style="stroke-width:0.828459;stroke-dasharray:none"><g
         id="g6565-70"
         transform="matrix(-0.30847827,-0.26548328,0.42221473,-0.49059236,267.38196,474.36604)"
         style="stroke-width:1.61413;stroke-dasharray:none"><path
           style="fill:#3465a4;stroke:#000000;stroke-width:1.61413;stroke-dasharray:none;stroke-opacity:1"
           d="m 112.38531,299.68259 c 5.69065,-1.65491 12.38913,-5.19502 15.44445,-8.16233 1.14969,-1.11656 2.29781,-2.0301 2.5514,-2.0301 0.63969,0 7.06578,-9.74623 7.66194,-11.62061 0.26748,-0.84096 0.41628,-2.01066 0.33067,-2.59934 -0.0857,-0.58868 0.0779,-1.07032 0.36334,-1.07032 0.28545,0 0.56881,-0.48165 0.6297,-1.07032 0.23,-2.22369 0.52911,-3.56088 0.9482,-4.23899 1.10834,-1.79332 1.18004,-9.89486 0.12947,-14.62859 -2.76432,-12.45568 -9.94251,-21.14075 -22.33263,-27.02075 -6.72952,-3.19366 -15.67676,-4.03504 -24.650512,-2.31807 -7.43602,1.42274 -17.4093,7.13349 -20.96012,12.00186 -0.98405,1.3492 -2.30967,3.06334 -2.945812,3.80919 -1.771225,2.07671 -5.043677,9.52241 -5.8378,13.28252 -0.892278,4.22489 -0.909874,12.92389 -0.03413,16.87272 2.494441,11.2477 13.230872,23.74104 23.981662,27.906 3.26868,1.26632 4.32839,1.52003 8.72888,2.08985 1.34243,0.17384 2.58094,0.46299 2.75225,0.64258 0.62011,0.65009 8.375192,-0.43083 13.239042,-1.8453 z"
           id="path456-9" /><path
           style="fill:#3465a4;stroke:#000000;stroke-width:1.61413;stroke-dasharray:none;stroke-opacity:1"
           d="m 87.793518,151.89418 c 5.69065,-1.6549 12.389122,-5.19502 15.444452,-8.16232 1.14969,-1.11657 2.29781,-2.03011 2.5514,-2.03011 0.63969,0 7.06577,-9.74623 7.66193,-11.6206 0.26748,-0.84096 0.41628,-2.01067 0.33068,-2.59934 -0.0857,-0.58868 0.0779,-1.07032 0.36333,-1.07032 0.28545,0 0.56882,-0.48165 0.6297,-1.07032 0.23,-2.2237 0.52911,-3.56088 0.94821,-4.23899 1.10834,-1.79332 1.18004,-9.89487 0.12947,-14.62859 -2.76432,-12.455684 -9.94252,-21.140759 -22.332642,-27.02076 -6.72951,-3.193656 -15.67676,-4.035033 -24.650509,-2.318062 -7.43602,1.422733 -17.409298,7.133486 -20.960121,12.001856 -0.984051,1.349204 -2.309667,3.06334 -2.94581,3.809194 -1.771224,2.07671 -5.043677,9.522402 -5.837799,13.282512 -0.892278,4.22489 -0.909874,12.9239 -0.03413,16.87272 2.494442,11.24771 13.230876,23.74105 23.981663,27.906 3.268682,1.26633 4.328387,1.52004 8.728876,2.08986 1.34243,0.17383 2.58094,0.46299 2.75225,0.64257 0.62012,0.6501 8.37519,-0.43082 13.23905,-1.8453 z"
           id="path456-3-36" /><path
           style="fill:#3465a4;stroke:#000000;stroke-width:1.61413;stroke-dasharray:none;stroke-opacity:1"
           d="m 268.90882,105.76562 c 5.69065,-1.6549 12.38912,-5.19502 15.44445,-8.162322 1.14969,-1.116566 2.29781,-2.030109 2.5514,-2.030109 0.63969,0 7.06577,-9.746227 7.66193,-11.620602 0.26748,-0.840959 0.41628,-2.010668 0.33068,-2.599339 -0.0857,-0.588684 0.0779,-1.070321 0.36333,-1.070321 0.28545,0 0.56882,-0.481649 0.6297,-1.07032 0.23,-2.223694 0.52911,-3.560883 0.94821,-4.238989 1.10834,-1.793322 1.18004,-9.894868 0.12947,-14.628589 -2.76432,-12.455683 -9.94252,-21.140758 -22.33264,-27.020758 -6.72951,-3.193657 -15.67675,-4.035033 -24.65051,-2.318063 -7.43602,1.422733 -17.4093,7.133486 -20.96012,12.001857 -0.98405,1.349204 -2.30966,3.063339 -2.94581,3.809193 -1.77123,2.07671 -5.04368,9.522402 -5.8378,13.282515 -0.89228,4.224887 -0.90988,12.923893 -0.0341,16.872719 2.49444,11.247705 13.23088,23.741038 23.98167,27.905998 3.26868,1.26633 4.32838,1.52004 8.72888,2.08986 1.34242,0.17383 2.58094,0.46299 2.75225,0.64257 0.62011,0.6501 8.37519,-0.43082 13.23904,-1.8453 z"
           id="path456-3-6-0" /><path
           style="fill:#3465a4;stroke:#000000;stroke-width:1.61413;stroke-dasharray:none;stroke-opacity:1"
           d="m 427.81413,139.54638 c 5.69065,-1.6549 12.38913,-5.19502 15.44445,-8.16232 1.14969,-1.11657 2.29781,-2.03011 2.5514,-2.03011 0.63969,0 7.06578,-9.74623 7.66194,-11.6206 0.26748,-0.84096 0.41628,-2.01067 0.33067,-2.59934 -0.0857,-0.58869 0.0779,-1.07032 0.36334,-1.07032 0.28545,0 0.56881,-0.48165 0.6297,-1.07032 0.23,-2.2237 0.52911,-3.56089 0.9482,-4.23899 1.10834,-1.79332 1.18004,-9.894872 0.12947,-14.628593 -2.76432,-12.455682 -9.94251,-21.140757 -22.33263,-27.020758 -6.72952,-3.193656 -15.67676,-4.035033 -24.65051,-2.318062 -7.43602,1.422733 -17.4093,7.133486 -20.96012,12.001856 -0.98405,1.349205 -2.30967,3.06334 -2.94581,3.809194 -1.77123,2.07671 -5.04368,9.522402 -5.83781,13.282515 -0.89227,4.224887 -0.90987,12.923898 -0.0341,16.872718 2.49444,11.24771 13.23088,23.74104 23.98167,27.906 3.26868,1.26632 4.32839,1.52004 8.72888,2.08986 1.34243,0.17383 2.58094,0.46299 2.75225,0.64257 0.62012,0.6501 8.37519,-0.43082 13.23904,-1.8453 z"
           id="path456-3-6-7-62" /><path
           style="fill:#3465a4;stroke:#000000;stroke-width:1.61413;stroke-dasharray:none;stroke-opacity:1"
           d="m 443.73185,299.20811 c 5.69065,-1.65491 12.38912,-5.19503 15.44445,-8.16233 1.14969,-1.11656 2.29781,-2.03011 2.5514,-2.03011 0.63969,0 7.06577,-9.74622 7.66193,-11.6206 0.26748,-0.84096 0.41628,-2.01067 0.33068,-2.59934 -0.0857,-0.58868 0.0779,-1.07032 0.36333,-1.07032 0.28545,0 0.56882,-0.48165 0.6297,-1.07032 0.23,-2.22369 0.52911,-3.56088 0.94821,-4.23899 1.10834,-1.79332 1.18004,-9.89487 0.12947,-14.62859 -2.76432,-12.45568 -9.94252,-21.14075 -22.33263,-27.02076 -6.72952,-3.19365 -15.67676,-4.03503 -24.65051,-2.31806 -7.43603,1.42274 -17.40931,7.13349 -20.96013,12.00186 -0.98405,1.3492 -2.30966,3.06334 -2.94581,3.80919 -1.77123,2.07671 -5.04368,9.5224 -5.8378,13.28252 -0.89228,4.22488 -0.90988,12.92389 -0.0341,16.87272 2.49444,11.2477 13.23088,23.74104 23.98167,27.90599 3.26868,1.26633 4.32838,1.52004 8.72888,2.08986 1.34243,0.17384 2.58094,0.46299 2.75225,0.64257 0.62011,0.6501 8.37519,-0.43082 13.23904,-1.84529 z"
           id="path456-3-6-7-5-6" /><path
           style="fill:url(#linearGradient6686);fill-opacity:1;stroke:#000000;stroke-width:1.61413;stroke-dasharray:none;stroke-opacity:1"
           d="m 150.92235,467.07137 c -0.38072,-0.12622 -1.90228,4.99165 -1.90228,-1.57616 0,-8.40386 0.1825,-10.79105 0.87821,-11.48674 0.50234,-0.50236 2.7928,-1.05747 5.35159,-1.29705 38.29135,-4.73816 67.11308,-21.48806 77.739,-56.34512 5.93659,-20.45763 7.29964,-38.73911 4.64811,-61.62469 l -1.28985,-11.13279 -2.22691,-2.34441 c -5.1985,-5.47282 -17.25736,-15.29441 -24.10209,-19.6305 -12.18119,-7.71667 -34.68161,-15.02528 -56.69188,-18.41471 -3.87593,-0.59687 -6.78361,-1.3345 -6.82538,-1.73149 -0.2158,-2.05185 -0.17349,-3.75731 0.25052,-10.09985 0.53539,-8.00845 1.62896,-15.97881 2.19012,-15.96235 0.70139,0.0205 10.0224,1.74054 21.48493,3.96457 19.68366,3.81912 36.56636,9.09564 49.00668,15.31652 6.65328,3.32703 6.83926,3.70939 -3.43401,-7.06016 -3.36928,-3.53205 -7.91445,-8.47712 -10.10034,-10.98905 -2.18592,-2.51193 -5.52709,-6.29109 -7.42483,-8.39814 -4.43201,-4.92083 -16.35302,-19.41828 -18.25662,-22.20233 -7.67174,-11.22017 -16.07616,-21.95813 -23.98622,-30.64612 -9.79794,-10.76157 -35.26633,-32.88388 -37.91842,-33.04836 -2.931,-2.02291 -1.50501,-0.95702 -6.36648,-4.57744 -0.75066,-1.21461 7.56093,-19.16491 10.53366,-23.6704 1.74141,-2.63933 1.18485,-2.79312 7.04184,1.94585 6.03397,4.88218 30.1162,26.72039 36.58073,33.17207 11.54588,11.52296 26.22102,28.6575 38.14788,44.54106 12.50087,16.64802 16.96384,22.02342 27.27607,32.85261 8.49012,8.91573 36.58678,74.36558 37.96731,74.36558 20.82272,-42.90042 0.57032,-92.59199 -8.16028,-129.26498 -2.52421,-10.28824 -10.03954,-29.04785 -17.41062,-43.46001 -2.82102,-5.51571 0.50854,-25.48053 0.50854,-25.89644 0,-1.26493 2.31082,-1.60551 13.19767,-1.94511 l 10.44543,-0.32584 -1.11456,23.28997 c 4.02421,27.16911 22.24313,40.61105 24.24543,67.35138 0.26151,3.80378 0.56329,5.18923 1.04345,4.79073 0.37153,-0.30835 2.18857,-1.15056 4.03786,-1.87158 13.27706,-5.17658 32.05922,-28.51509 44.60891,-39.50285 6.87683,-6.02093 18.99201,-20.69951 24.80711,-30.05595 4.15025,-6.6777 3.92714,-6.51668 6.16809,-4.45191 3.07987,2.83774 7.01778,5.81711 13.23106,10.01048 5.1308,3.4628 7.17719,5.45042 5.61159,5.45042 -0.27748,0 -2.11791,2.27061 -4.08984,5.04579 -22.89508,32.22123 -41.16864,48.68291 -63.38102,57.09662 l -4.67368,1.77032 -0.44083,8.81835 c -0.24244,4.8501 -0.34109,16.1826 -0.21921,25.18335 0.19623,14.48941 0.32676,16.27187 1.13904,15.55256 0.83915,-0.74315 2.95033,-1.77747 14.67865,-7.19144 5.64039,-2.6037 17.34276,-5.79129 25.30885,-6.89388 12.13111,-1.67906 18.98643,-2.85059 21.27943,-3.63654 1.23558,-0.42349 2.51706,-0.60279 2.84772,-0.39843 0.33067,0.20437 1.16426,3.39878 1.85242,7.09869 0.68816,3.69991 1.87696,9.66958 2.6418,13.26593 0.76483,3.59635 1.2382,6.69122 1.05194,6.87748 -0.18627,0.18627 -2.93178,0.48157 -6.10114,0.6562 -10.31742,0.56853 -14.2308,0.98004 -20.15932,2.11989 -13.59311,2.61346 -25.88255,8.27787 -38.99661,17.9742 l -5.07621,3.75328 -4.0801,28.74569 c 2.84838,40.68346 6.03493,73.08008 31.51085,102.75059 6.12315,6.96508 14.08299,12.61068 22.98,16.29875 4.94932,2.05165 15.60149,4.79983 18.60921,4.80102 l 1.98773,8e-4 10e-6,10.85608 1.28735,1.61986 H 271.10386 c -65.76161,0 -119.84328,-0.0917 -120.18151,-0.20387 z"
           id="path440-1"
           inkscape:highlight-color="#3ed6e3"
           sodipodi:nodetypes="sssccscsssssssssssssccsssssccssscccssssssssscssssssssssssscccsscccss" /></g><path
         style="fill:#6e6e6e;fill-opacity:1;stroke:#000000;stroke-width:0.828459;stroke-dasharray:none;stroke-opacity:1"
         d="m 260.89934,457.88348 c 73.59239,0 133.24945,-59.65707 133.24945,-133.24946 H 127.64988 c 0,73.59137 59.65808,133.24946 133.24946,133.24946 z"
         id="path2615" /><path
         style="fill:#83a328;stroke:#000000;stroke-width:0.828459;stroke-dasharray:none;stroke-opacity:1;fill-opacity:1"
         d="m 376.76763,332.07364 c 4.28475,-2.95569 6.81653,-6.57696 6.81653,-10.49339 0,-7.78714 -9.97525,-14.41863 -23.93951,-16.93355 0.86938,-1.51105 1.34448,-3.10351 1.34448,-4.75225 0,-9.56213 -15.64887,-17.31406 -34.95196,-17.31406 -4.26875,0 -8.35546,0.38008 -12.13668,1.0738 -4.04232,-12.69861 -26.22883,-22.41075 -53.00116,-22.41075 -26.77233,0 -48.95797,9.71214 -53.00116,22.41075 -3.78121,-0.69372 -7.86971,-1.0738 -12.1367,-1.0738 -19.30308,0 -34.95195,7.7515 -34.95195,17.31406 0,1.64875 0.4751,3.24206 1.34449,4.75225 -13.96516,2.51492 -23.9395,9.14686 -23.9395,16.93355 0,3.91643 2.53088,7.5377 6.81653,10.49339 z"
         id="path2595" /><path
         id="rect564"
         style="fill:#545454;fill-opacity:1;stroke:#000000;stroke-width:0.989147;stroke-dasharray:none"
         class="UnoptimicedTransforms"
         d="m 118.27809,312.13565 v 0.003 a 14.516129,14.516129 0 0 0 -14.48627,14.51387 14.516129,14.516129 0 0 0 14.48627,14.51387 v 0.003 h 260.0345 v -0.0111 a 14.516129,14.516129 0 0 0 0.16397,0.0111 14.516129,14.516129 0 0 0 14.51556,-14.51666 14.516129,14.516129 0 0 0 -14.51556,-14.51666 14.516129,14.516129 0 0 0 -0.16397,0.0111 v -0.0111 z"
         transform="matrix(1.0005433,0,0,0.70110729,12.372416,102.05134)" /></g><g
       id="g3523"
       transform="matrix(-0.31102083,0,0,0.29270163,336.90357,309.15137)"
       style="stroke-width:3.31431;stroke-dasharray:none"
       inkscape:transform-center-x="2.2421554"
       inkscape:transform-center-y="-12.368693"><g
         id="g3515"
         transform="matrix(-0.30847827,-0.26548328,0.42221473,-0.49059236,267.38196,474.36604)"
         style="stroke-width:6.45746;stroke-dasharray:none"><path
           style="fill:#008000;stroke:#000000;stroke-width:6.45746;stroke-dasharray:none;stroke-opacity:1"
           d="m 112.38531,299.68259 c 5.69065,-1.65491 12.38913,-5.19502 15.44445,-8.16233 1.14969,-1.11656 2.29781,-2.0301 2.5514,-2.0301 0.63969,0 7.06578,-9.74623 7.66194,-11.62061 0.26748,-0.84096 0.41628,-2.01066 0.33067,-2.59934 -0.0857,-0.58868 0.0779,-1.07032 0.36334,-1.07032 0.28545,0 0.56881,-0.48165 0.6297,-1.07032 0.23,-2.22369 0.52911,-3.56088 0.9482,-4.23899 1.10834,-1.79332 1.18004,-9.89486 0.12947,-14.62859 -2.76432,-12.45568 -9.94251,-21.14075 -22.33263,-27.02075 -6.72952,-3.19366 -15.67676,-4.03504 -24.650512,-2.31807 -7.43602,1.42274 -17.4093,7.13349 -20.96012,12.00186 -0.98405,1.3492 -2.30967,3.06334 -2.945812,3.80919 -1.771225,2.07671 -5.043677,9.52241 -5.8378,13.28252 -0.892278,4.22489 -0.909874,12.92389 -0.03413,16.87272 2.494441,11.2477 13.230872,23.74104 23.981662,27.906 3.26868,1.26632 4.32839,1.52003 8.72888,2.08985 1.34243,0.17384 2.58094,0.46299 2.75225,0.64258 0.62011,0.65009 8.375192,-0.43083 13.239042,-1.8453 z"
           id="path3503" /><path
           style="fill:#3465a4;stroke:#000000;stroke-width:6.45746;stroke-dasharray:none;stroke-opacity:1"
           d="m 87.793518,151.89418 c 5.69065,-1.6549 12.389122,-5.19502 15.444452,-8.16232 1.14969,-1.11657 2.29781,-2.03011 2.5514,-2.03011 0.63969,0 7.06577,-9.74623 7.66193,-11.6206 0.26748,-0.84096 0.41628,-2.01067 0.33068,-2.59934 -0.0857,-0.58868 0.0779,-1.07032 0.36333,-1.07032 0.28545,0 0.56882,-0.48165 0.6297,-1.07032 0.23,-2.2237 0.52911,-3.56088 0.94821,-4.23899 1.10834,-1.79332 1.18004,-9.89487 0.12947,-14.62859 -2.76432,-12.455684 -9.94252,-21.140759 -22.332642,-27.02076 -6.72951,-3.193656 -15.67676,-4.035033 -24.650509,-2.318062 -7.43602,1.422733 -17.409298,7.133486 -20.960121,12.001856 -0.984051,1.349204 -2.309667,3.06334 -2.94581,3.809194 -1.771224,2.07671 -5.043677,9.522402 -5.837799,13.282512 -0.892278,4.22489 -0.909874,12.9239 -0.03413,16.87272 2.494442,11.24771 13.230876,23.74105 23.981663,27.906 3.268682,1.26633 4.328387,1.52004 8.728876,2.08986 1.34243,0.17383 2.58094,0.46299 2.75225,0.64257 0.62012,0.6501 8.37519,-0.43082 13.23905,-1.8453 z"
           id="path3505" /><path
           style="fill:#3465a4;stroke:#000000;stroke-width:6.45746;stroke-dasharray:none;stroke-opacity:1"
           d="m 268.90882,105.76562 c 5.69065,-1.6549 12.38912,-5.19502 15.44445,-8.162322 1.14969,-1.116566 2.29781,-2.030109 2.5514,-2.030109 0.63969,0 7.06577,-9.746227 7.66193,-11.620602 0.26748,-0.840959 0.41628,-2.010668 0.33068,-2.599339 -0.0857,-0.588684 0.0779,-1.070321 0.36333,-1.070321 0.28545,0 0.56882,-0.481649 0.6297,-1.07032 0.23,-2.223694 0.52911,-3.560883 0.94821,-4.238989 1.10834,-1.793322 1.18004,-9.894868 0.12947,-14.628589 -2.76432,-12.455683 -9.94252,-21.140758 -22.33264,-27.020758 -6.72951,-3.193657 -15.67675,-4.035033 -24.65051,-2.318063 -7.43602,1.422733 -17.4093,7.133486 -20.96012,12.001857 -0.98405,1.349204 -2.30966,3.063339 -2.94581,3.809193 -1.77123,2.07671 -5.04368,9.522402 -5.8378,13.282515 -0.89228,4.224887 -0.90988,12.923893 -0.0341,16.872719 2.49444,11.247705 13.23088,23.741038 23.98167,27.905998 3.26868,1.26633 4.32838,1.52004 8.72888,2.08986 1.34242,0.17383 2.58094,0.46299 2.75225,0.64257 0.62011,0.6501 8.37519,-0.43082 13.23904,-1.8453 z"
           id="path3507" /><path
           style="fill:#3465a4;stroke:#000000;stroke-width:6.45746;stroke-dasharray:none;stroke-opacity:1"
           d="m 427.81413,139.54638 c 5.69065,-1.6549 12.38913,-5.19502 15.44445,-8.16232 1.14969,-1.11657 2.29781,-2.03011 2.5514,-2.03011 0.63969,0 7.06578,-9.74623 7.66194,-11.6206 0.26748,-0.84096 0.41628,-2.01067 0.33067,-2.59934 -0.0857,-0.58869 0.0779,-1.07032 0.36334,-1.07032 0.28545,0 0.56881,-0.48165 0.6297,-1.07032 0.23,-2.2237 0.52911,-3.56089 0.9482,-4.23899 1.10834,-1.79332 1.18004,-9.894872 0.12947,-14.628593 -2.76432,-12.455682 -9.94251,-21.140757 -22.33263,-27.020758 -6.72952,-3.193656 -15.67676,-4.035033 -24.65051,-2.318062 -7.43602,1.422733 -17.4093,7.133486 -20.96012,12.001856 -0.98405,1.349205 -2.30967,3.06334 -2.94581,3.809194 -1.77123,2.07671 -5.04368,9.522402 -5.83781,13.282515 -0.89227,4.224887 -0.90987,12.923898 -0.0341,16.872718 2.49444,11.24771 13.23088,23.74104 23.98167,27.906 3.26868,1.26632 4.32839,1.52004 8.72888,2.08986 1.34243,0.17383 2.58094,0.46299 2.75225,0.64257 0.62012,0.6501 8.37519,-0.43082 13.23904,-1.8453 z"
           id="path3509" /><path
           style="fill:#008000;stroke:#000000;stroke-width:6.45746;stroke-dasharray:none;stroke-opacity:1"
           d="m 443.73185,299.20811 c 5.69065,-1.65491 12.38912,-5.19503 15.44445,-8.16233 1.14969,-1.11656 2.29781,-2.03011 2.5514,-2.03011 0.63969,0 7.06577,-9.74622 7.66193,-11.6206 0.26748,-0.84096 0.41628,-2.01067 0.33068,-2.59934 -0.0857,-0.58868 0.0779,-1.07032 0.36333,-1.07032 0.28545,0 0.56882,-0.48165 0.6297,-1.07032 0.23,-2.22369 0.52911,-3.56088 0.94821,-4.23899 1.10834,-1.79332 1.18004,-9.89487 0.12947,-14.62859 -2.76432,-12.45568 -9.94252,-21.14075 -22.33263,-27.02076 -6.72952,-3.19365 -15.67676,-4.03503 -24.65051,-2.31806 -7.43603,1.42274 -17.40931,7.13349 -20.96013,12.00186 -0.98405,1.3492 -2.30966,3.06334 -2.94581,3.80919 -1.77123,2.07671 -5.04368,9.5224 -5.8378,13.28252 -0.89228,4.22488 -0.90988,12.92389 -0.0341,16.87272 2.49444,11.2477 13.23088,23.74104 23.98167,27.90599 3.26868,1.26633 4.32838,1.52004 8.72888,2.08986 1.34243,0.17384 2.58094,0.46299 2.75225,0.64257 0.62011,0.6501 8.37519,-0.43082 13.23904,-1.84529 z"
           id="path3511" /><path
           style="fill:url(#linearGradient3527);fill-opacity:1;stroke:#000000;stroke-width:6.45746;stroke-dasharray:none;stroke-opacity:1"
           d="m 150.92235,467.07137 c -0.38072,-0.12622 -1.90228,4.99165 -1.90228,-1.57616 0,-8.40386 0.1825,-10.79105 0.87821,-11.48674 0.50234,-0.50236 2.7928,-1.05747 5.35159,-1.29705 38.29135,-4.73816 67.11308,-21.48806 77.739,-56.34512 5.93659,-20.45763 7.29964,-38.73911 4.64811,-61.62469 l -1.28985,-11.13279 -2.22691,-2.34441 c -5.1985,-5.47282 -17.25736,-15.29441 -24.10209,-19.6305 -12.18119,-7.71667 -34.68161,-15.02528 -56.69188,-18.41471 -3.87593,-0.59687 -6.78361,-1.3345 -6.82538,-1.73149 -0.2158,-2.05185 -0.17349,-3.75731 0.25052,-10.09985 0.53539,-8.00845 1.62896,-15.97881 2.19012,-15.96235 0.70139,0.0205 10.0224,1.74054 21.48493,3.96457 19.68366,3.81912 36.56636,9.09564 49.00668,15.31652 6.65328,3.32703 6.83926,3.70939 -3.43401,-7.06016 -3.36928,-3.53205 -7.91445,-8.47712 -10.10034,-10.98905 -2.18592,-2.51193 -5.52709,-6.29109 -7.42483,-8.39814 -4.43201,-4.92083 -16.35302,-19.41828 -18.25662,-22.20233 -7.67174,-11.22017 -16.07616,-21.95813 -23.98622,-30.64612 -9.79794,-10.76157 -35.26633,-32.88388 -37.91842,-33.04836 -2.931,-2.02291 -1.50501,-0.95702 -6.36648,-4.57744 -0.75066,-1.21461 7.56093,-19.16491 10.53366,-23.6704 1.74141,-2.63933 1.18485,-2.79312 7.04184,1.94585 6.03397,4.88218 30.1162,26.72039 36.58073,33.17207 11.54588,11.52296 26.22102,28.6575 38.14788,44.54106 12.50087,16.64802 16.96384,22.02342 27.27607,32.85261 8.49012,8.91573 36.58678,74.36558 37.96731,74.36558 20.82272,-42.90042 0.57032,-92.59199 -8.16028,-129.26498 -2.52421,-10.28824 -10.03954,-29.04785 -17.41062,-43.46001 -2.82102,-5.51571 0.50854,-25.48053 0.50854,-25.89644 0,-1.26493 2.31082,-1.60551 13.19767,-1.94511 l 10.44543,-0.32584 -1.11456,23.28997 c 4.02421,27.16911 22.24313,40.61105 24.24543,67.35138 0.26151,3.80378 0.56329,5.18923 1.04345,4.79073 0.37153,-0.30835 2.18857,-1.15056 4.03786,-1.87158 13.27706,-5.17658 32.05922,-28.51509 44.60891,-39.50285 6.87683,-6.02093 18.99201,-20.69951 24.80711,-30.05595 4.15025,-6.6777 3.92714,-6.51668 6.16809,-4.45191 3.07987,2.83774 7.01778,5.81711 13.23106,10.01048 5.1308,3.4628 7.17719,5.45042 5.61159,5.45042 -0.27748,0 -2.11791,2.27061 -4.08984,5.04579 -22.89508,32.22123 -41.16864,48.68291 -63.38102,57.09662 l -4.67368,1.77032 -0.44083,8.81835 c -0.24244,4.8501 -0.34109,16.1826 -0.21921,25.18335 0.19623,14.48941 0.32676,16.27187 1.13904,15.55256 0.83915,-0.74315 2.95033,-1.77747 14.67865,-7.19144 5.64039,-2.6037 17.34276,-5.79129 25.30885,-6.89388 12.13111,-1.67906 18.98643,-2.85059 21.27943,-3.63654 1.23558,-0.42349 2.51706,-0.60279 2.84772,-0.39843 0.33067,0.20437 1.16426,3.39878 1.85242,7.09869 0.68816,3.69991 1.87696,9.66958 2.6418,13.26593 0.76483,3.59635 1.2382,6.69122 1.05194,6.87748 -0.18627,0.18627 -2.93178,0.48157 -6.10114,0.6562 -10.31742,0.56853 -14.2308,0.98004 -20.15932,2.11989 -13.59311,2.61346 -25.88255,8.27787 -38.99661,17.9742 l -5.07621,3.75328 -4.0801,28.74569 c 2.84838,40.68346 6.03493,73.08008 31.51085,102.75059 6.12315,6.96508 14.08299,12.61068 22.98,16.29875 4.94932,2.05165 15.60149,4.79983 18.60921,4.80102 l 1.98773,8e-4 10e-6,10.85608 1.28735,1.61986 H 271.10386 c -65.76161,0 -119.84328,-0.0917 -120.18151,-0.20387 z"
           id="path3513"
           inkscape:highlight-color="#3ed6e3"
           sodipodi:nodetypes="sssccscsssssssssssssccsssssccssscccssssssssscssssssssssssscccsscccss" /></g><path
         style="fill:#6e6e6e;fill-opacity:1;stroke:#000000;stroke-width:3.31431;stroke-dasharray:none;stroke-opacity:1"
         d="m 260.20689,457.88348 c 73.59239,0 133.24945,-59.65707 133.24945,-133.24946 H 126.95743 c 0,73.59137 59.65808,133.24946 133.24946,133.24946 z"
         id="path3517" /><path
         style="fill:#83a328;stroke:#000000;stroke-width:3.31431;stroke-dasharray:none;stroke-opacity:1;fill-opacity:1"
         d="m 376.07518,332.07364 c 4.28475,-2.95569 6.81653,-6.57696 6.81653,-10.49339 0,-7.78714 -9.97525,-14.41863 -23.93951,-16.93355 0.86938,-1.51105 1.34448,-3.10351 1.34448,-4.75225 0,-9.56213 -15.64887,-17.31406 -34.95196,-17.31406 -4.26875,0 -8.35546,0.38008 -12.13668,1.0738 -4.04232,-12.69861 -26.22883,-22.41075 -53.00116,-22.41075 -26.77233,0 -48.95797,9.71214 -53.00116,22.41075 -3.78121,-0.69372 -7.86971,-1.0738 -12.1367,-1.0738 -19.30308,0 -34.95195,7.7515 -34.95195,17.31406 0,1.64875 0.4751,3.24206 1.34449,4.75225 -13.96516,2.51492 -23.9395,9.14686 -23.9395,16.93355 0,3.91643 2.53088,7.5377 6.81653,10.49339 z"
         id="path3519" /><path
         id="path3521"
         style="fill:#545454;fill-opacity:1;stroke:#000000;stroke-width:3.95715;stroke-dasharray:none"
         class="UnoptimicedTransforms"
         d="m 118.27809,312.13565 v 0.003 a 14.516129,14.516129 0 0 0 -14.48627,14.51387 14.516129,14.516129 0 0 0 14.48627,14.51387 v 0.003 h 260.0345 v -0.0111 a 14.516129,14.516129 0 0 0 0.16397,0.0111 14.516129,14.516129 0 0 0 14.51556,-14.51666 14.516129,14.516129 0 0 0 -14.51556,-14.51666 14.516129,14.516129 0 0 0 -0.16397,0.0111 v -0.0111 z"
         transform="matrix(1.0005433,0,0,0.70110729,11.679959,102.05134)" /></g><path
       style="fill:#ff9811;stroke-width:1.5625"
       d="m -1345.3079,499.76577 -151.6594,-61.325 c -6.1719,-2.49687 -13.2078,-1.50781 -18.4562,2.5875 -5.2469,4.09687 -7.9125,10.68281 -6.986,17.27656 l 22.875,163.10469 c 0.9235,6.59219 5.2969,12.19219 11.4688,14.68906 6.1718,2.49688 13.2078,1.50781 18.4562,-2.5875 l 129.8156,-101.36093 c 0.01,-0.008 0.016,-0.0141 0.03,-0.0234 8.1125,-6.33438 9.5547,-18.04531 3.2204,-26.15781 -2.3407,-2.99688 -5.4094,-5.08282 -8.7641,-6.20313 z"
       id="path2577" /><path
       style="fill:#ffc477;stroke-width:1.5625"
       d="m -1036.0035,748.81354 -14.1,-162.97969 c -0.5734,-6.63125 -4.6437,-12.45781 -10.675,-15.27656 -6.0312,-2.82031 -13.1078,-2.20781 -18.5672,1.60625 l -135.0047,94.33594 c -5.4562,3.81406 -8.4656,10.24844 -7.8921,16.88125 0.5734,6.63281 4.6437,12.45781 10.675,15.27656 l 149.2015,69.75 c 0.01,0.003 0.02,0.008 0.033,0.0141 9.3234,4.35938 20.4156,0.33438 24.7734,-8.98906 1.6094,-3.44062 2.0766,-7.12187 1.5563,-10.61875 z"
       id="path2579" /><path
       style="fill:#ffc477;stroke-width:1.5625"
       d="m -1432.009,381.74546 -130.1797,-99.06875 c -5.2984,-4.03125 -12.3469,-4.93125 -18.4859,-2.35938 -6.1391,2.57188 -10.4438,8.225 -11.286,14.82969 l -20.8484,163.37656 c -0.8422,6.60469 1.9016,13.15625 7.2,17.18907 5.2984,4.03125 12.3469,4.93124 18.4859,2.35937 l 151.9125,-63.63281 c 0.01,-0.005 0.02,-0.009 0.034,-0.0141 9.4938,-3.97656 13.9657,-14.89687 9.9891,-24.38906 -1.4703,-3.50468 -3.8844,-6.32656 -6.8219,-8.29062 z"
       id="path2587" /><path
       style="fill:#ffdaaa;stroke-width:1.5625"
       d="m -1171.4449,565.56359 -81.7937,-141.67188 c -3.3297,-5.76562 -9.4828,-9.31718 -16.1391,-9.31718 -6.6578,0 -12.8093,3.55156 -16.139,9.31718 l -82.3516,142.63438 c -3.3297,5.76562 -3.3297,12.87031 0,18.6375 3.3297,5.76562 9.4828,9.31718 16.1391,9.31718 h 164.7015 c 0.011,-0.002 0.022,-0.002 0.036,0 10.2938,0 18.6375,-8.34218 18.6375,-18.63593 -0,-3.8 -1.1375,-7.33438 -3.0906,-10.28125 z"
       id="path2589" /><path
       style="fill:#ffb655;stroke-width:1.5625"
       d="m -1205.8821,332.11235 c -0.037,-0.0719 -0.081,-0.14219 -0.1188,-0.21406 l -14.1093,110.55937 c -0.8422,6.60469 1.9015,13.15625 7.2,17.18906 5.2984,4.03125 12.3468,4.93125 18.4859,2.35938 l 85.6687,-35.88594 c -7.1218,-49.4875 -47.1437,-88.49063 -97.1265,-94.00781 z"
       id="path2591" /><path
       style="fill:#ffc477;stroke-width:1.5625"
       d="m -1334.0565,420.96281 c -2.9687,-35.49375 -22.8031,-66.25468 -51.4281,-84.26874 l -53.489,92.64531 c -3.3297,5.76562 -3.3297,12.87031 0,18.6375 3.3296,5.76562 9.4828,9.31718 16.139,9.31718 h 117.1516 c -6.8766,-13.875 -16.511,-26.28437 -28.3735,-36.33125 z"
       id="path2593" /><g
       id="g2647"
       transform="matrix(1.5625,0,0,1.5625,-1568.1255,-292.11693)">
	<path
   style="fill:#ffc477"
   d="m 136.469,376.789 c -2.059,0 -4.075,-0.836 -5.538,-2.288 -1.463,-1.463 -2.299,-3.479 -2.299,-5.548 0,-2.058 0.836,-4.086 2.299,-5.538 1.462,-1.463 3.478,-2.299 5.538,-2.299 2.068,0 4.086,0.836 5.548,2.299 1.453,1.463 2.288,3.48 2.288,5.538 0,2.069 -0.836,4.086 -2.288,5.548 -1.462,1.452 -3.48,2.288 -5.548,2.288 z"
   id="path2637" />
	<path
   style="fill:#ffc477"
   d="m 153.356,346.566 c -2.059,0 -4.075,-0.836 -5.538,-2.288 -1.463,-1.463 -2.299,-3.48 -2.299,-5.548 0,-2.058 0.836,-4.086 2.299,-5.538 1.462,-1.463 3.478,-2.299 5.538,-2.299 2.068,0 4.086,0.836 5.548,2.299 1.453,1.463 2.288,3.479 2.288,5.538 0,2.069 -0.836,4.086 -2.288,5.548 -1.462,1.453 -3.479,2.288 -5.548,2.288 z"
   id="path2639" />
	<path
   style="fill:#ffc477"
   d="m 171.91,376.563 c -2.059,0 -4.075,-0.836 -5.538,-2.288 -1.463,-1.463 -2.299,-3.479 -2.299,-5.548 0,-2.058 0.836,-4.086 2.299,-5.538 1.462,-1.463 3.478,-2.299 5.538,-2.299 2.068,0 4.086,0.836 5.548,2.299 1.453,1.463 2.288,3.479 2.288,5.538 0,2.069 -0.836,4.086 -2.288,5.548 -1.462,1.452 -3.48,2.288 -5.548,2.288 z"
   id="path2641" />
	<path
   style="fill:#ffc477"
   d="m 351.468,357.495 c -2.06,0 -4.075,-0.836 -5.538,-2.288 -1.463,-1.463 -2.299,-3.479 -2.299,-5.548 0,-2.058 0.836,-4.086 2.299,-5.538 1.462,-1.463 3.478,-2.299 5.538,-2.299 2.068,0 4.086,0.836 5.548,2.299 1.453,1.463 2.288,3.48 2.288,5.538 0,2.069 -0.836,4.086 -2.288,5.548 -1.462,1.451 -3.48,2.288 -5.548,2.288 z"
   id="path2643" />
	<path
   style="fill:#ffc477"
   d="m 374.516,373.169 c -2.06,0 -4.075,-0.836 -5.538,-2.288 -1.463,-1.463 -2.299,-3.479 -2.299,-5.548 0,-2.058 0.836,-4.086 2.299,-5.538 1.462,-1.463 3.478,-2.299 5.538,-2.299 2.068,0 4.086,0.836 5.548,2.299 1.453,1.463 2.288,3.479 2.288,5.538 0,2.069 -0.836,4.086 -2.288,5.548 -1.462,1.451 -3.479,2.288 -5.548,2.288 z"
   id="path2645" />
</g><text
       xml:space="preserve"
       style="font-style:normal;font-weight:normal;font-size:40px;line-height:1.25;font-family:sans-serif;fill:#000000;fill-opacity:1;stroke:none"
       x="-631.96179"
       y="983.09021"
       id="text6507"><tspan
         sodipodi:role="line"
         id="tspan6505"
         x="-631.96179"
         y="983.09021">https://www.svgrepo.com/svg/285998/nachos-mexican</tspan></text><g
       id="g3551"
       transform="matrix(0.07775521,0,0,0.07317541,235.2529,403.63306)"
       style="stroke-width:13.2572;stroke-dasharray:none"
       inkscape:transform-center-x="-0.56053434"
       inkscape:transform-center-y="-3.0921752"><g
         id="g3543"
         transform="matrix(-0.30847827,-0.26548328,0.42221473,-0.49059236,267.38196,474.36604)"
         style="stroke-width:25.8298;stroke-dasharray:none"><path
           style="fill:#ff0000;stroke:#000000;stroke-width:25.8298;stroke-dasharray:none;stroke-opacity:1"
           d="m 112.38531,299.68259 c 5.69065,-1.65491 12.38913,-5.19502 15.44445,-8.16233 1.14969,-1.11656 2.29781,-2.0301 2.5514,-2.0301 0.63969,0 7.06578,-9.74623 7.66194,-11.62061 0.26748,-0.84096 0.41628,-2.01066 0.33067,-2.59934 -0.0857,-0.58868 0.0779,-1.07032 0.36334,-1.07032 0.28545,0 0.56881,-0.48165 0.6297,-1.07032 0.23,-2.22369 0.52911,-3.56088 0.9482,-4.23899 1.10834,-1.79332 1.18004,-9.89486 0.12947,-14.62859 -2.76432,-12.45568 -9.94251,-21.14075 -22.33263,-27.02075 -6.72952,-3.19366 -15.67676,-4.03504 -24.650512,-2.31807 -7.43602,1.42274 -17.4093,7.13349 -20.96012,12.00186 -0.98405,1.3492 -2.30967,3.06334 -2.945812,3.80919 -1.771225,2.07671 -5.043677,9.52241 -5.8378,13.28252 -0.892278,4.22489 -0.909874,12.92389 -0.03413,16.87272 2.494441,11.2477 13.230872,23.74104 23.981662,27.906 3.26868,1.26632 4.32839,1.52003 8.72888,2.08985 1.34243,0.17384 2.58094,0.46299 2.75225,0.64258 0.62011,0.65009 8.375192,-0.43083 13.239042,-1.8453 z"
           id="path3531" /><path
           style="fill:#3465a4;stroke:#000000;stroke-width:25.8298;stroke-dasharray:none;stroke-opacity:1"
           d="m 87.793518,151.89418 c 5.69065,-1.6549 12.389122,-5.19502 15.444452,-8.16232 1.14969,-1.11657 2.29781,-2.03011 2.5514,-2.03011 0.63969,0 7.06577,-9.74623 7.66193,-11.6206 0.26748,-0.84096 0.41628,-2.01067 0.33068,-2.59934 -0.0857,-0.58868 0.0779,-1.07032 0.36333,-1.07032 0.28545,0 0.56882,-0.48165 0.6297,-1.07032 0.23,-2.2237 0.52911,-3.56088 0.94821,-4.23899 1.10834,-1.79332 1.18004,-9.89487 0.12947,-14.62859 -2.76432,-12.455684 -9.94252,-21.140759 -22.332642,-27.02076 -6.72951,-3.193656 -15.67676,-4.035033 -24.650509,-2.318062 -7.43602,1.422733 -17.409298,7.133486 -20.960121,12.001856 -0.984051,1.349204 -2.309667,3.06334 -2.94581,3.809194 -1.771224,2.07671 -5.043677,9.522402 -5.837799,13.282512 -0.892278,4.22489 -0.909874,12.9239 -0.03413,16.87272 2.494442,11.24771 13.230876,23.74105 23.981663,27.906 3.268682,1.26633 4.328387,1.52004 8.728876,2.08986 1.34243,0.17383 2.58094,0.46299 2.75225,0.64257 0.62012,0.6501 8.37519,-0.43082 13.23905,-1.8453 z"
           id="path3533" /><path
           style="fill:#3465a4;stroke:#000000;stroke-width:25.8298;stroke-dasharray:none;stroke-opacity:1"
           d="m 268.90882,105.76562 c 5.69065,-1.6549 12.38912,-5.19502 15.44445,-8.162322 1.14969,-1.116566 2.29781,-2.030109 2.5514,-2.030109 0.63969,0 7.06577,-9.746227 7.66193,-11.620602 0.26748,-0.840959 0.41628,-2.010668 0.33068,-2.599339 -0.0857,-0.588684 0.0779,-1.070321 0.36333,-1.070321 0.28545,0 0.56882,-0.481649 0.6297,-1.07032 0.23,-2.223694 0.52911,-3.560883 0.94821,-4.238989 1.10834,-1.793322 1.18004,-9.894868 0.12947,-14.628589 -2.76432,-12.455683 -9.94252,-21.140758 -22.33264,-27.020758 -6.72951,-3.193657 -15.67675,-4.035033 -24.65051,-2.318063 -7.43602,1.422733 -17.4093,7.133486 -20.96012,12.001857 -0.98405,1.349204 -2.30966,3.063339 -2.94581,3.809193 -1.77123,2.07671 -5.04368,9.522402 -5.8378,13.282515 -0.89228,4.224887 -0.90988,12.923893 -0.0341,16.872719 2.49444,11.247705 13.23088,23.741038 23.98167,27.905998 3.26868,1.26633 4.32838,1.52004 8.72888,2.08986 1.34242,0.17383 2.58094,0.46299 2.75225,0.64257 0.62011,0.6501 8.37519,-0.43082 13.23904,-1.8453 z"
           id="path3535" /><path
           style="fill:#3465a4;stroke:#000000;stroke-width:25.8298;stroke-dasharray:none;stroke-opacity:1"
           d="m 427.81413,139.54638 c 5.69065,-1.6549 12.38913,-5.19502 15.44445,-8.16232 1.14969,-1.11657 2.29781,-2.03011 2.5514,-2.03011 0.63969,0 7.06578,-9.74623 7.66194,-11.6206 0.26748,-0.84096 0.41628,-2.01067 0.33067,-2.59934 -0.0857,-0.58869 0.0779,-1.07032 0.36334,-1.07032 0.28545,0 0.56881,-0.48165 0.6297,-1.07032 0.23,-2.2237 0.52911,-3.56089 0.9482,-4.23899 1.10834,-1.79332 1.18004,-9.894872 0.12947,-14.628593 -2.76432,-12.455682 -9.94251,-21.140757 -22.33263,-27.020758 -6.72952,-3.193656 -15.67676,-4.035033 -24.65051,-2.318062 -7.43602,1.422733 -17.4093,7.133486 -20.96012,12.001856 -0.98405,1.349205 -2.30967,3.06334 -2.94581,3.809194 -1.77123,2.07671 -5.04368,9.522402 -5.83781,13.282515 -0.89227,4.224887 -0.90987,12.923898 -0.0341,16.872718 2.49444,11.24771 13.23088,23.74104 23.98167,27.906 3.26868,1.26632 4.32839,1.52004 8.72888,2.08986 1.34243,0.17383 2.58094,0.46299 2.75225,0.64257 0.62012,0.6501 8.37519,-0.43082 13.23904,-1.8453 z"
           id="path3537" /><path
           style="fill:#ff0000;stroke:#000000;stroke-width:25.8298;stroke-dasharray:none;stroke-opacity:1"
           d="m 443.73185,299.20811 c 5.69065,-1.65491 12.38912,-5.19503 15.44445,-8.16233 1.14969,-1.11656 2.29781,-2.03011 2.5514,-2.03011 0.63969,0 7.06577,-9.74622 7.66193,-11.6206 0.26748,-0.84096 0.41628,-2.01067 0.33068,-2.59934 -0.0857,-0.58868 0.0779,-1.07032 0.36333,-1.07032 0.28545,0 0.56882,-0.48165 0.6297,-1.07032 0.23,-2.22369 0.52911,-3.56088 0.94821,-4.23899 1.10834,-1.79332 1.18004,-9.89487 0.12947,-14.62859 -2.76432,-12.45568 -9.94252,-21.14075 -22.33263,-27.02076 -6.72952,-3.19365 -15.67676,-4.03503 -24.65051,-2.31806 -7.43603,1.42274 -17.40931,7.13349 -20.96013,12.00186 -0.98405,1.3492 -2.30966,3.06334 -2.94581,3.80919 -1.77123,2.07671 -5.04368,9.5224 -5.8378,13.28252 -0.89228,4.22488 -0.90988,12.92389 -0.0341,16.87272 2.49444,11.2477 13.23088,23.74104 23.98167,27.90599 3.26868,1.26633 4.32838,1.52004 8.72888,2.08986 1.34243,0.17384 2.58094,0.46299 2.75225,0.64257 0.62011,0.6501 8.37519,-0.43082 13.23904,-1.84529 z"
           id="path3539" /><path
           style="fill:url(#linearGradient3555);fill-opacity:1;stroke:#000000;stroke-width:25.8298;stroke-dasharray:none;stroke-opacity:1"
           d="m 150.92235,467.07137 c -0.38072,-0.12622 -1.90228,4.99165 -1.90228,-1.57616 0,-8.40386 0.1825,-10.79105 0.87821,-11.48674 0.50234,-0.50236 2.7928,-1.05747 5.35159,-1.29705 38.29135,-4.73816 67.11308,-21.48806 77.739,-56.34512 5.93659,-20.45763 7.29964,-38.73911 4.64811,-61.62469 l -1.28985,-11.13279 -2.22691,-2.34441 c -5.1985,-5.47282 -17.25736,-15.29441 -24.10209,-19.6305 -12.18119,-7.71667 -34.68161,-15.02528 -56.69188,-18.41471 -3.87593,-0.59687 -6.78361,-1.3345 -6.82538,-1.73149 -0.2158,-2.05185 -0.17349,-3.75731 0.25052,-10.09985 0.53539,-8.00845 1.62896,-15.97881 2.19012,-15.96235 0.70139,0.0205 10.0224,1.74054 21.48493,3.96457 19.68366,3.81912 36.56636,9.09564 49.00668,15.31652 6.65328,3.32703 6.83926,3.70939 -3.43401,-7.06016 -3.36928,-3.53205 -7.91445,-8.47712 -10.10034,-10.98905 -2.18592,-2.51193 -5.52709,-6.29109 -7.42483,-8.39814 -4.43201,-4.92083 -16.35302,-19.41828 -18.25662,-22.20233 -7.67174,-11.22017 -16.07616,-21.95813 -23.98622,-30.64612 -9.79794,-10.76157 -35.26633,-32.88388 -37.91842,-33.04836 -2.931,-2.02291 -1.50501,-0.95702 -6.36648,-4.57744 -0.75066,-1.21461 7.56093,-19.16491 10.53366,-23.6704 1.74141,-2.63933 1.18485,-2.79312 7.04184,1.94585 6.03397,4.88218 30.1162,26.72039 36.58073,33.17207 11.54588,11.52296 26.22102,28.6575 38.14788,44.54106 12.50087,16.64802 16.96384,22.02342 27.27607,32.85261 8.49012,8.91573 36.58678,74.36558 37.96731,74.36558 20.82272,-42.90042 0.57032,-92.59199 -8.16028,-129.26498 -2.52421,-10.28824 -10.03954,-29.04785 -17.41062,-43.46001 -2.82102,-5.51571 0.50854,-25.48053 0.50854,-25.89644 0,-1.26493 2.31082,-1.60551 13.19767,-1.94511 l 10.44543,-0.32584 -1.11456,23.28997 c 4.02421,27.16911 22.24313,40.61105 24.24543,67.35138 0.26151,3.80378 0.56329,5.18923 1.04345,4.79073 0.37153,-0.30835 2.18857,-1.15056 4.03786,-1.87158 13.27706,-5.17658 32.05922,-28.51509 44.60891,-39.50285 6.87683,-6.02093 18.99201,-20.69951 24.80711,-30.05595 4.15025,-6.6777 3.92714,-6.51668 6.16809,-4.45191 3.07987,2.83774 7.01778,5.81711 13.23106,10.01048 5.1308,3.4628 7.17719,5.45042 5.61159,5.45042 -0.27748,0 -2.11791,2.27061 -4.08984,5.04579 -22.89508,32.22123 -41.16864,48.68291 -63.38102,57.09662 l -4.67368,1.77032 -0.44083,8.81835 c -0.24244,4.8501 -0.34109,16.1826 -0.21921,25.18335 0.19623,14.48941 0.32676,16.27187 1.13904,15.55256 0.83915,-0.74315 2.95033,-1.77747 14.67865,-7.19144 5.64039,-2.6037 17.34276,-5.79129 25.30885,-6.89388 12.13111,-1.67906 18.98643,-2.85059 21.27943,-3.63654 1.23558,-0.42349 2.51706,-0.60279 2.84772,-0.39843 0.33067,0.20437 1.16426,3.39878 1.85242,7.09869 0.68816,3.69991 1.87696,9.66958 2.6418,13.26593 0.76483,3.59635 1.2382,6.69122 1.05194,6.87748 -0.18627,0.18627 -2.93178,0.48157 -6.10114,0.6562 -10.31742,0.56853 -14.2308,0.98004 -20.15932,2.11989 -13.59311,2.61346 -25.88255,8.27787 -38.99661,17.9742 l -5.07621,3.75328 -4.0801,28.74569 c 2.84838,40.68346 6.03493,73.08008 31.51085,102.75059 6.12315,6.96508 14.08299,12.61068 22.98,16.29875 4.94932,2.05165 15.60149,4.79983 18.60921,4.80102 l 1.98773,8e-4 10e-6,10.85608 1.28735,1.61986 H 271.10386 c -65.76161,0 -119.84328,-0.0917 -120.18151,-0.20387 z"
           id="path3541"
           inkscape:highlight-color="#3ed6e3"
           sodipodi:nodetypes="sssccscsssssssssssssccsssssccssscccssssssssscssssssssssssscccsscccss" /></g><path
         style="fill:#6e6e6e;fill-opacity:1;stroke:#000000;stroke-width:13.2572;stroke-dasharray:none;stroke-opacity:1"
         d="m 260.20689,457.88348 c 73.59239,0 133.24945,-59.65707 133.24945,-133.24946 H 126.95743 c 0,73.59137 59.65808,133.24946 133.24946,133.24946 z"
         id="path3545" /><path
         style="fill:#83a328;stroke:#000000;stroke-width:13.2572;stroke-dasharray:none;stroke-opacity:1;fill-opacity:1"
         d="m 376.07518,332.07364 c 4.28475,-2.95569 6.81653,-6.57696 6.81653,-10.49339 0,-7.78714 -9.97525,-14.41863 -23.93951,-16.93355 0.86938,-1.51105 1.34448,-3.10351 1.34448,-4.75225 0,-9.56213 -15.64887,-17.31406 -34.95196,-17.31406 -4.26875,0 -8.35546,0.38008 -12.13668,1.0738 -4.04232,-12.69861 -26.22883,-22.41075 -53.00116,-22.41075 -26.77233,0 -48.95797,9.71214 -53.00116,22.41075 -3.78121,-0.69372 -7.86971,-1.0738 -12.1367,-1.0738 -19.30308,0 -34.95195,7.7515 -34.95195,17.31406 0,1.64875 0.4751,3.24206 1.34449,4.75225 -13.96516,2.51492 -23.9395,9.14686 -23.9395,16.93355 0,3.91643 2.53088,7.5377 6.81653,10.49339 z"
         id="path3547" /><path
         id="path3549"
         style="fill:#545454;fill-opacity:1;stroke:#000000;stroke-width:15.8286;stroke-dasharray:none"
         class="UnoptimicedTransforms"
         d="m 118.27809,312.13565 v 0.003 a 14.516129,14.516129 0 0 0 -14.48627,14.51387 14.516129,14.516129 0 0 0 14.48627,14.51387 v 0.003 h 260.0345 v -0.0111 a 14.516129,14.516129 0 0 0 0.16397,0.0111 14.516129,14.516129 0 0 0 14.51556,-14.51666 14.516129,14.516129 0 0 0 -14.51556,-14.51666 14.516129,14.516129 0 0 0 -0.16397,0.0111 v -0.0111 z"
         transform="matrix(1.0005433,0,0,0.70110729,11.679959,102.05134)" /></g><g
       id="g3577"
       transform="matrix(-0.0194388,0,0,0.01829385,260.92782,426.87545)"
       style="stroke-width:13.2572;stroke-dasharray:none"
       inkscape:transform-center-x="0.14012859"
       inkscape:transform-center-y="-0.77304946"><g
         id="g3569"
         transform="matrix(-0.30847827,-0.26548328,0.42221473,-0.49059236,267.38196,474.36604)"
         style="stroke-width:25.8298;stroke-dasharray:none"><path
           style="fill:#3465a4;stroke:#000000;stroke-width:25.8298;stroke-dasharray:none;stroke-opacity:1"
           d="m 112.38531,299.68259 c 5.69065,-1.65491 12.38913,-5.19502 15.44445,-8.16233 1.14969,-1.11656 2.29781,-2.0301 2.5514,-2.0301 0.63969,0 7.06578,-9.74623 7.66194,-11.62061 0.26748,-0.84096 0.41628,-2.01066 0.33067,-2.59934 -0.0857,-0.58868 0.0779,-1.07032 0.36334,-1.07032 0.28545,0 0.56881,-0.48165 0.6297,-1.07032 0.23,-2.22369 0.52911,-3.56088 0.9482,-4.23899 1.10834,-1.79332 1.18004,-9.89486 0.12947,-14.62859 -2.76432,-12.45568 -9.94251,-21.14075 -22.33263,-27.02075 -6.72952,-3.19366 -15.67676,-4.03504 -24.650512,-2.31807 -7.43602,1.42274 -17.4093,7.13349 -20.96012,12.00186 -0.98405,1.3492 -2.30967,3.06334 -2.945812,3.80919 -1.771225,2.07671 -5.043677,9.52241 -5.8378,13.28252 -0.892278,4.22489 -0.909874,12.92389 -0.03413,16.87272 2.494441,11.2477 13.230872,23.74104 23.981662,27.906 3.26868,1.26632 4.32839,1.52003 8.72888,2.08985 1.34243,0.17384 2.58094,0.46299 2.75225,0.64258 0.62011,0.65009 8.375192,-0.43083 13.239042,-1.8453 z"
           id="path3557" /><path
           style="fill:#3465a4;stroke:#000000;stroke-width:25.8298;stroke-dasharray:none;stroke-opacity:1"
           d="m 87.793518,151.89418 c 5.69065,-1.6549 12.389122,-5.19502 15.444452,-8.16232 1.14969,-1.11657 2.29781,-2.03011 2.5514,-2.03011 0.63969,0 7.06577,-9.74623 7.66193,-11.6206 0.26748,-0.84096 0.41628,-2.01067 0.33068,-2.59934 -0.0857,-0.58868 0.0779,-1.07032 0.36333,-1.07032 0.28545,0 0.56882,-0.48165 0.6297,-1.07032 0.23,-2.2237 0.52911,-3.56088 0.94821,-4.23899 1.10834,-1.79332 1.18004,-9.89487 0.12947,-14.62859 -2.76432,-12.455684 -9.94252,-21.140759 -22.332642,-27.02076 -6.72951,-3.193656 -15.67676,-4.035033 -24.650509,-2.318062 -7.43602,1.422733 -17.409298,7.133486 -20.960121,12.001856 -0.984051,1.349204 -2.309667,3.06334 -2.94581,3.809194 -1.771224,2.07671 -5.043677,9.522402 -5.837799,13.282512 -0.892278,4.22489 -0.909874,12.9239 -0.03413,16.87272 2.494442,11.24771 13.230876,23.74105 23.981663,27.906 3.268682,1.26633 4.328387,1.52004 8.728876,2.08986 1.34243,0.17383 2.58094,0.46299 2.75225,0.64257 0.62012,0.6501 8.37519,-0.43082 13.23905,-1.8453 z"
           id="path3559" /><path
           style="fill:#3465a4;stroke:#000000;stroke-width:25.8298;stroke-dasharray:none;stroke-opacity:1"
           d="m 268.90882,105.76562 c 5.69065,-1.6549 12.38912,-5.19502 15.44445,-8.162322 1.14969,-1.116566 2.29781,-2.030109 2.5514,-2.030109 0.63969,0 7.06577,-9.746227 7.66193,-11.620602 0.26748,-0.840959 0.41628,-2.010668 0.33068,-2.599339 -0.0857,-0.588684 0.0779,-1.070321 0.36333,-1.070321 0.28545,0 0.56882,-0.481649 0.6297,-1.07032 0.23,-2.223694 0.52911,-3.560883 0.94821,-4.238989 1.10834,-1.793322 1.18004,-9.894868 0.12947,-14.628589 -2.76432,-12.455683 -9.94252,-21.140758 -22.33264,-27.020758 -6.72951,-3.193657 -15.67675,-4.035033 -24.65051,-2.318063 -7.43602,1.422733 -17.4093,7.133486 -20.96012,12.001857 -0.98405,1.349204 -2.30966,3.063339 -2.94581,3.809193 -1.77123,2.07671 -5.04368,9.522402 -5.8378,13.282515 -0.89228,4.224887 -0.90988,12.923893 -0.0341,16.872719 2.49444,11.247705 13.23088,23.741038 23.98167,27.905998 3.26868,1.26633 4.32838,1.52004 8.72888,2.08986 1.34242,0.17383 2.58094,0.46299 2.75225,0.64257 0.62011,0.6501 8.37519,-0.43082 13.23904,-1.8453 z"
           id="path3561" /><path
           style="fill:#3465a4;stroke:#000000;stroke-width:25.8298;stroke-dasharray:none;stroke-opacity:1"
           d="m 427.81413,139.54638 c 5.69065,-1.6549 12.38913,-5.19502 15.44445,-8.16232 1.14969,-1.11657 2.29781,-2.03011 2.5514,-2.03011 0.63969,0 7.06578,-9.74623 7.66194,-11.6206 0.26748,-0.84096 0.41628,-2.01067 0.33067,-2.59934 -0.0857,-0.58869 0.0779,-1.07032 0.36334,-1.07032 0.28545,0 0.56881,-0.48165 0.6297,-1.07032 0.23,-2.2237 0.52911,-3.56089 0.9482,-4.23899 1.10834,-1.79332 1.18004,-9.894872 0.12947,-14.628593 -2.76432,-12.455682 -9.94251,-21.140757 -22.33263,-27.020758 -6.72952,-3.193656 -15.67676,-4.035033 -24.65051,-2.318062 -7.43602,1.422733 -17.4093,7.133486 -20.96012,12.001856 -0.98405,1.349205 -2.30967,3.06334 -2.94581,3.809194 -1.77123,2.07671 -5.04368,9.522402 -5.83781,13.282515 -0.89227,4.224887 -0.90987,12.923898 -0.0341,16.872718 2.49444,11.24771 13.23088,23.74104 23.98167,27.906 3.26868,1.26632 4.32839,1.52004 8.72888,2.08986 1.34243,0.17383 2.58094,0.46299 2.75225,0.64257 0.62012,0.6501 8.37519,-0.43082 13.23904,-1.8453 z"
           id="path3563" /><path
           style="fill:#800080;stroke:#000000;stroke-width:25.8298;stroke-dasharray:none;stroke-opacity:1"
           d="m 443.73185,299.20811 c 5.69065,-1.65491 12.38912,-5.19503 15.44445,-8.16233 1.14969,-1.11656 2.29781,-2.03011 2.5514,-2.03011 0.63969,0 7.06577,-9.74622 7.66193,-11.6206 0.26748,-0.84096 0.41628,-2.01067 0.33068,-2.59934 -0.0857,-0.58868 0.0779,-1.07032 0.36333,-1.07032 0.28545,0 0.56882,-0.48165 0.6297,-1.07032 0.23,-2.22369 0.52911,-3.56088 0.94821,-4.23899 1.10834,-1.79332 1.18004,-9.89487 0.12947,-14.62859 -2.76432,-12.45568 -9.94252,-21.14075 -22.33263,-27.02076 -6.72952,-3.19365 -15.67676,-4.03503 -24.65051,-2.31806 -7.43603,1.42274 -17.40931,7.13349 -20.96013,12.00186 -0.98405,1.3492 -2.30966,3.06334 -2.94581,3.80919 -1.77123,2.07671 -5.04368,9.5224 -5.8378,13.28252 -0.89228,4.22488 -0.90988,12.92389 -0.0341,16.87272 2.49444,11.2477 13.23088,23.74104 23.98167,27.90599 3.26868,1.26633 4.32838,1.52004 8.72888,2.08986 1.34243,0.17384 2.58094,0.46299 2.75225,0.64257 0.62011,0.6501 8.37519,-0.43082 13.23904,-1.84529 z"
           id="path3565" /><path
           style="fill:url(#linearGradient3583);fill-opacity:1;stroke:#000000;stroke-width:25.8298;stroke-dasharray:none;stroke-opacity:1"
           d="m 150.92235,467.07137 c -0.38072,-0.12622 -1.90228,4.99165 -1.90228,-1.57616 0,-8.40386 0.1825,-10.79105 0.87821,-11.48674 0.50234,-0.50236 2.7928,-1.05747 5.35159,-1.29705 38.29135,-4.73816 67.11308,-21.48806 77.739,-56.34512 5.93659,-20.45763 7.29964,-38.73911 4.64811,-61.62469 l -1.28985,-11.13279 -2.22691,-2.34441 c -5.1985,-5.47282 -17.25736,-15.29441 -24.10209,-19.6305 -12.18119,-7.71667 -34.68161,-15.02528 -56.69188,-18.41471 -3.87593,-0.59687 -6.78361,-1.3345 -6.82538,-1.73149 -0.2158,-2.05185 -0.17349,-3.75731 0.25052,-10.09985 0.53539,-8.00845 1.62896,-15.97881 2.19012,-15.96235 0.70139,0.0205 10.0224,1.74054 21.48493,3.96457 19.68366,3.81912 36.56636,9.09564 49.00668,15.31652 6.65328,3.32703 6.83926,3.70939 -3.43401,-7.06016 -3.36928,-3.53205 -7.91445,-8.47712 -10.10034,-10.98905 -2.18592,-2.51193 -5.52709,-6.29109 -7.42483,-8.39814 -4.43201,-4.92083 -16.35302,-19.41828 -18.25662,-22.20233 -7.67174,-11.22017 -16.07616,-21.95813 -23.98622,-30.64612 -9.79794,-10.76157 -35.26633,-32.88388 -37.91842,-33.04836 -2.931,-2.02291 -1.50501,-0.95702 -6.36648,-4.57744 -0.75066,-1.21461 7.56093,-19.16491 10.53366,-23.6704 1.74141,-2.63933 1.18485,-2.79312 7.04184,1.94585 6.03397,4.88218 30.1162,26.72039 36.58073,33.17207 11.54588,11.52296 26.22102,28.6575 38.14788,44.54106 12.50087,16.64802 16.96384,22.02342 27.27607,32.85261 8.49012,8.91573 36.58678,74.36558 37.96731,74.36558 20.82272,-42.90042 0.57032,-92.59199 -8.16028,-129.26498 -2.52421,-10.28824 -10.03954,-29.04785 -17.41062,-43.46001 -2.82102,-5.51571 0.50854,-25.48053 0.50854,-25.89644 0,-1.26493 2.31082,-1.60551 13.19767,-1.94511 l 10.44543,-0.32584 -1.11456,23.28997 c 4.02421,27.16911 22.24313,40.61105 24.24543,67.35138 0.26151,3.80378 0.56329,5.18923 1.04345,4.79073 0.37153,-0.30835 2.18857,-1.15056 4.03786,-1.87158 13.27706,-5.17658 32.05922,-28.51509 44.60891,-39.50285 6.87683,-6.02093 18.99201,-20.69951 24.80711,-30.05595 4.15025,-6.6777 3.92714,-6.51668 6.16809,-4.45191 3.07987,2.83774 7.01778,5.81711 13.23106,10.01048 5.1308,3.4628 7.17719,5.45042 5.61159,5.45042 -0.27748,0 -2.11791,2.27061 -4.08984,5.04579 -22.89508,32.22123 -41.16864,48.68291 -63.38102,57.09662 l -4.67368,1.77032 -0.44083,8.81835 c -0.24244,4.8501 -0.34109,16.1826 -0.21921,25.18335 0.19623,14.48941 0.32676,16.27187 1.13904,15.55256 0.83915,-0.74315 2.95033,-1.77747 14.67865,-7.19144 5.64039,-2.6037 17.34276,-5.79129 25.30885,-6.89388 12.13111,-1.67906 18.98643,-2.85059 21.27943,-3.63654 1.23558,-0.42349 2.51706,-0.60279 2.84772,-0.39843 0.33067,0.20437 1.16426,3.39878 1.85242,7.09869 0.68816,3.69991 1.87696,9.66958 2.6418,13.26593 0.76483,3.59635 1.2382,6.69122 1.05194,6.87748 -0.18627,0.18627 -2.93178,0.48157 -6.10114,0.6562 -10.31742,0.56853 -14.2308,0.98004 -20.15932,2.11989 -13.59311,2.61346 -25.88255,8.27787 -38.99661,17.9742 l -5.07621,3.75328 -4.0801,28.74569 c 2.84838,40.68346 6.03493,73.08008 31.51085,102.75059 6.12315,6.96508 14.08299,12.61068 22.98,16.29875 4.94932,2.05165 15.60149,4.79983 18.60921,4.80102 l 1.98773,8e-4 10e-6,10.85608 1.28735,1.61986 H 271.10386 c -65.76161,0 -119.84328,-0.0917 -120.18151,-0.20387 z"
           id="path3567"
           inkscape:highlight-color="#3ed6e3"
           sodipodi:nodetypes="sssccscsssssssssssssccsssssccssscccssssssssscssssssssssssscccsscccss" /></g><path
         style="fill:#6e6e6e;fill-opacity:1;stroke:#000000;stroke-width:13.2572;stroke-dasharray:none;stroke-opacity:1"
         d="m 260.20689,457.88348 c 73.59239,0 133.24945,-59.65707 133.24945,-133.24946 H 126.95743 c 0,73.59137 59.65808,133.24946 133.24946,133.24946 z"
         id="path3571" /><path
         style="fill:#000000;stroke:#000000;stroke-width:13.2572;stroke-dasharray:none;stroke-opacity:1;fill-opacity:0"
         d="m 376.07518,332.07364 c 4.28475,-2.95569 6.81653,-6.57696 6.81653,-10.49339 0,-7.78714 -9.97525,-14.41863 -23.93951,-16.93355 0.86938,-1.51105 1.34448,-3.10351 1.34448,-4.75225 0,-9.56213 -15.64887,-17.31406 -34.95196,-17.31406 -4.26875,0 -8.35546,0.38008 -12.13668,1.0738 -4.04232,-12.69861 -26.22883,-22.41075 -53.00116,-22.41075 -26.77233,0 -48.95797,9.71214 -53.00116,22.41075 -3.78121,-0.69372 -7.86971,-1.0738 -12.1367,-1.0738 -19.30308,0 -34.95195,7.7515 -34.95195,17.31406 0,1.64875 0.4751,3.24206 1.34449,4.75225 -13.96516,2.51492 -23.9395,9.14686 -23.9395,16.93355 0,3.91643 2.53088,7.5377 6.81653,10.49339 z"
         id="path3573" /><path
         id="path3575"
         style="fill:#545454;fill-opacity:1;stroke:#000000;stroke-width:15.8286;stroke-dasharray:none"
         class="UnoptimicedTransforms"
         d="m 118.27809,312.13565 v 0.003 a 14.516129,14.516129 0 0 0 -14.48627,14.51387 14.516129,14.516129 0 0 0 14.48627,14.51387 v 0.003 h 260.0345 v -0.0111 a 14.516129,14.516129 0 0 0 0.16397,0.0111 14.516129,14.516129 0 0 0 14.51556,-14.51666 14.516129,14.516129 0 0 0 -14.51556,-14.51666 14.516129,14.516129 0 0 0 -0.16397,0.0111 v -0.0111 z"
         transform="matrix(1.0005433,0,0,0.70110729,11.679959,102.05134)" /></g><path
       id="path2625"
       style="fill:#393939;fill-opacity:1;stroke:#000000;stroke-width:1;stroke-dasharray:none;stroke-opacity:1"
       d="m 26.018092,435.06296 c -7.814396,0 -14.209054,6.39467 -14.209054,14.20906 v 4.01893 c 0,7.81441 6.394658,14.20905 14.209054,14.20905 H 485.98443 c 7.81439,0 14.20754,-6.39464 14.20653,-14.20905 v -4.01893 c 0,-7.81439 -6.39466,-14.20906 -14.20907,-14.20906 z" /><g
       id="g3523-5"
       transform="matrix(-0.31102083,0,0,0.29270163,336.76435,501.70243)"
       style="stroke-width:3.31431;stroke-dasharray:none"
       inkscape:transform-center-x="2.2421554"
       inkscape:transform-center-y="-12.368693"><g
         id="g3515-3"
         transform="matrix(-0.30847827,-0.26548328,0.42221473,-0.49059236,267.38196,474.36604)"
         style="stroke-width:6.45746;stroke-dasharray:none"><path
           style="fill:#008000;stroke:#000000;stroke-width:6.45746;stroke-dasharray:none;stroke-opacity:1"
           d="m 112.38531,299.68259 c 5.69065,-1.65491 12.38913,-5.19502 15.44445,-8.16233 1.14969,-1.11656 2.29781,-2.0301 2.5514,-2.0301 0.63969,0 7.06578,-9.74623 7.66194,-11.62061 0.26748,-0.84096 0.41628,-2.01066 0.33067,-2.59934 -0.0857,-0.58868 0.0779,-1.07032 0.36334,-1.07032 0.28545,0 0.56881,-0.48165 0.6297,-1.07032 0.23,-2.22369 0.52911,-3.56088 0.9482,-4.23899 1.10834,-1.79332 1.18004,-9.89486 0.12947,-14.62859 -2.76432,-12.45568 -9.94251,-21.14075 -22.33263,-27.02075 -6.72952,-3.19366 -15.67676,-4.03504 -24.650512,-2.31807 -7.43602,1.42274 -17.4093,7.13349 -20.96012,12.00186 -0.98405,1.3492 -2.30967,3.06334 -2.945812,3.80919 -1.771225,2.07671 -5.043677,9.52241 -5.8378,13.28252 -0.892278,4.22489 -0.909874,12.92389 -0.03413,16.87272 2.494441,11.2477 13.230872,23.74104 23.981662,27.906 3.26868,1.26632 4.32839,1.52003 8.72888,2.08985 1.34243,0.17384 2.58094,0.46299 2.75225,0.64258 0.62011,0.65009 8.375192,-0.43083 13.239042,-1.8453 z"
           id="path3503-5" /><path
           style="fill:#3465a4;stroke:#000000;stroke-width:6.45746;stroke-dasharray:none;stroke-opacity:1"
           d="m 87.793518,151.89418 c 5.69065,-1.6549 12.389122,-5.19502 15.444452,-8.16232 1.14969,-1.11657 2.29781,-2.03011 2.5514,-2.03011 0.63969,0 7.06577,-9.74623 7.66193,-11.6206 0.26748,-0.84096 0.41628,-2.01067 0.33068,-2.59934 -0.0857,-0.58868 0.0779,-1.07032 0.36333,-1.07032 0.28545,0 0.56882,-0.48165 0.6297,-1.07032 0.23,-2.2237 0.52911,-3.56088 0.94821,-4.23899 1.10834,-1.79332 1.18004,-9.89487 0.12947,-14.62859 -2.76432,-12.455684 -9.94252,-21.140759 -22.332642,-27.02076 -6.72951,-3.193656 -15.67676,-4.035033 -24.650509,-2.318062 -7.43602,1.422733 -17.409298,7.133486 -20.960121,12.001856 -0.984051,1.349204 -2.309667,3.06334 -2.94581,3.809194 -1.771224,2.07671 -5.043677,9.522402 -5.837799,13.282512 -0.892278,4.22489 -0.909874,12.9239 -0.03413,16.87272 2.494442,11.24771 13.230876,23.74105 23.981663,27.906 3.268682,1.26633 4.328387,1.52004 8.728876,2.08986 1.34243,0.17383 2.58094,0.46299 2.75225,0.64257 0.62012,0.6501 8.37519,-0.43082 13.23905,-1.8453 z"
           id="path3505-6" /><path
           style="fill:#3465a4;stroke:#000000;stroke-width:6.45746;stroke-dasharray:none;stroke-opacity:1"
           d="m 268.90882,105.76562 c 5.69065,-1.6549 12.38912,-5.19502 15.44445,-8.162322 1.14969,-1.116566 2.29781,-2.030109 2.5514,-2.030109 0.63969,0 7.06577,-9.746227 7.66193,-11.620602 0.26748,-0.840959 0.41628,-2.010668 0.33068,-2.599339 -0.0857,-0.588684 0.0779,-1.070321 0.36333,-1.070321 0.28545,0 0.56882,-0.481649 0.6297,-1.07032 0.23,-2.223694 0.52911,-3.560883 0.94821,-4.238989 1.10834,-1.793322 1.18004,-9.894868 0.12947,-14.628589 -2.76432,-12.455683 -9.94252,-21.140758 -22.33264,-27.020758 -6.72951,-3.193657 -15.67675,-4.035033 -24.65051,-2.318063 -7.43602,1.422733 -17.4093,7.133486 -20.96012,12.001857 -0.98405,1.349204 -2.30966,3.063339 -2.94581,3.809193 -1.77123,2.07671 -5.04368,9.522402 -5.8378,13.282515 -0.89228,4.224887 -0.90988,12.923893 -0.0341,16.872719 2.49444,11.247705 13.23088,23.741038 23.98167,27.905998 3.26868,1.26633 4.32838,1.52004 8.72888,2.08986 1.34242,0.17383 2.58094,0.46299 2.75225,0.64257 0.62011,0.6501 8.37519,-0.43082 13.23904,-1.8453 z"
           id="path3507-2" /><path
           style="fill:#3465a4;stroke:#000000;stroke-width:6.45746;stroke-dasharray:none;stroke-opacity:1"
           d="m 427.81413,139.54638 c 5.69065,-1.6549 12.38913,-5.19502 15.44445,-8.16232 1.14969,-1.11657 2.29781,-2.03011 2.5514,-2.03011 0.63969,0 7.06578,-9.74623 7.66194,-11.6206 0.26748,-0.84096 0.41628,-2.01067 0.33067,-2.59934 -0.0857,-0.58869 0.0779,-1.07032 0.36334,-1.07032 0.28545,0 0.56881,-0.48165 0.6297,-1.07032 0.23,-2.2237 0.52911,-3.56089 0.9482,-4.23899 1.10834,-1.79332 1.18004,-9.894872 0.12947,-14.628593 -2.76432,-12.455682 -9.94251,-21.140757 -22.33263,-27.020758 -6.72952,-3.193656 -15.67676,-4.035033 -24.65051,-2.318062 -7.43602,1.422733 -17.4093,7.133486 -20.96012,12.001856 -0.98405,1.349205 -2.30967,3.06334 -2.94581,3.809194 -1.77123,2.07671 -5.04368,9.522402 -5.83781,13.282515 -0.89227,4.224887 -0.90987,12.923898 -0.0341,16.872718 2.49444,11.24771 13.23088,23.74104 23.98167,27.906 3.26868,1.26632 4.32839,1.52004 8.72888,2.08986 1.34243,0.17383 2.58094,0.46299 2.75225,0.64257 0.62012,0.6501 8.37519,-0.43082 13.23904,-1.8453 z"
           id="path3509-9" /><path
           style="fill:#008000;stroke:#000000;stroke-width:6.45746;stroke-dasharray:none;stroke-opacity:1"
           d="m 443.73185,299.20811 c 5.69065,-1.65491 12.38912,-5.19503 15.44445,-8.16233 1.14969,-1.11656 2.29781,-2.03011 2.5514,-2.03011 0.63969,0 7.06577,-9.74622 7.66193,-11.6206 0.26748,-0.84096 0.41628,-2.01067 0.33068,-2.59934 -0.0857,-0.58868 0.0779,-1.07032 0.36333,-1.07032 0.28545,0 0.56882,-0.48165 0.6297,-1.07032 0.23,-2.22369 0.52911,-3.56088 0.94821,-4.23899 1.10834,-1.79332 1.18004,-9.89487 0.12947,-14.62859 -2.76432,-12.45568 -9.94252,-21.14075 -22.33263,-27.02076 -6.72952,-3.19365 -15.67676,-4.03503 -24.65051,-2.31806 -7.43603,1.42274 -17.40931,7.13349 -20.96013,12.00186 -0.98405,1.3492 -2.30966,3.06334 -2.94581,3.80919 -1.77123,2.07671 -5.04368,9.5224 -5.8378,13.28252 -0.89228,4.22488 -0.90988,12.92389 -0.0341,16.87272 2.49444,11.2477 13.23088,23.74104 23.98167,27.90599 3.26868,1.26633 4.32838,1.52004 8.72888,2.08986 1.34243,0.17384 2.58094,0.46299 2.75225,0.64257 0.62011,0.6501 8.37519,-0.43082 13.23904,-1.84529 z"
           id="path3511-1" /><path
           style="fill:url(#linearGradient4517);fill-opacity:1;stroke:#000000;stroke-width:6.45746;stroke-dasharray:none;stroke-opacity:1"
           d="m 150.92235,467.07137 c -0.38072,-0.12622 -1.90228,4.99165 -1.90228,-1.57616 0,-8.40386 0.1825,-10.79105 0.87821,-11.48674 0.50234,-0.50236 2.7928,-1.05747 5.35159,-1.29705 38.29135,-4.73816 67.11308,-21.48806 77.739,-56.34512 5.93659,-20.45763 7.29964,-38.73911 4.64811,-61.62469 l -1.28985,-11.13279 -2.22691,-2.34441 c -5.1985,-5.47282 -17.25736,-15.29441 -24.10209,-19.6305 -12.18119,-7.71667 -34.68161,-15.02528 -56.69188,-18.41471 -3.87593,-0.59687 -6.78361,-1.3345 -6.82538,-1.73149 -0.2158,-2.05185 -0.17349,-3.75731 0.25052,-10.09985 0.53539,-8.00845 1.62896,-15.97881 2.19012,-15.96235 0.70139,0.0205 10.0224,1.74054 21.48493,3.96457 19.68366,3.81912 36.56636,9.09564 49.00668,15.31652 6.65328,3.32703 6.83926,3.70939 -3.43401,-7.06016 -3.36928,-3.53205 -7.91445,-8.47712 -10.10034,-10.98905 -2.18592,-2.51193 -5.52709,-6.29109 -7.42483,-8.39814 -4.43201,-4.92083 -16.35302,-19.41828 -18.25662,-22.20233 -7.67174,-11.22017 -16.07616,-21.95813 -23.98622,-30.64612 -9.79794,-10.76157 -35.26633,-32.88388 -37.91842,-33.04836 -2.931,-2.02291 -1.50501,-0.95702 -6.36648,-4.57744 -0.75066,-1.21461 7.56093,-19.16491 10.53366,-23.6704 1.74141,-2.63933 1.18485,-2.79312 7.04184,1.94585 6.03397,4.88218 30.1162,26.72039 36.58073,33.17207 11.54588,11.52296 26.22102,28.6575 38.14788,44.54106 12.50087,16.64802 16.96384,22.02342 27.27607,32.85261 8.49012,8.91573 36.58678,74.36558 37.96731,74.36558 20.82272,-42.90042 0.57032,-92.59199 -8.16028,-129.26498 -2.52421,-10.28824 -10.03954,-29.04785 -17.41062,-43.46001 -2.82102,-5.51571 0.50854,-25.48053 0.50854,-25.89644 0,-1.26493 2.31082,-1.60551 13.19767,-1.94511 l 10.44543,-0.32584 -1.11456,23.28997 c 4.02421,27.16911 22.24313,40.61105 24.24543,67.35138 0.26151,3.80378 0.56329,5.18923 1.04345,4.79073 0.37153,-0.30835 2.18857,-1.15056 4.03786,-1.87158 13.27706,-5.17658 32.05922,-28.51509 44.60891,-39.50285 6.87683,-6.02093 18.99201,-20.69951 24.80711,-30.05595 4.15025,-6.6777 3.92714,-6.51668 6.16809,-4.45191 3.07987,2.83774 7.01778,5.81711 13.23106,10.01048 5.1308,3.4628 7.17719,5.45042 5.61159,5.45042 -0.27748,0 -2.11791,2.27061 -4.08984,5.04579 -22.89508,32.22123 -41.16864,48.68291 -63.38102,57.09662 l -4.67368,1.77032 -0.44083,8.81835 c -0.24244,4.8501 -0.34109,16.1826 -0.21921,25.18335 0.19623,14.48941 0.32676,16.27187 1.13904,15.55256 0.83915,-0.74315 2.95033,-1.77747 14.67865,-7.19144 5.64039,-2.6037 17.34276,-5.79129 25.30885,-6.89388 12.13111,-1.67906 18.98643,-2.85059 21.27943,-3.63654 1.23558,-0.42349 2.51706,-0.60279 2.84772,-0.39843 0.33067,0.20437 1.16426,3.39878 1.85242,7.09869 0.68816,3.69991 1.87696,9.66958 2.6418,13.26593 0.76483,3.59635 1.2382,6.69122 1.05194,6.87748 -0.18627,0.18627 -2.93178,0.48157 -6.10114,0.6562 -10.31742,0.56853 -14.2308,0.98004 -20.15932,2.11989 -13.59311,2.61346 -25.88255,8.27787 -38.99661,17.9742 l -5.07621,3.75328 -4.0801,28.74569 c 2.84838,40.68346 6.03493,73.08008 31.51085,102.75059 6.12315,6.96508 14.08299,12.61068 22.98,16.29875 4.94932,2.05165 15.60149,4.79983 18.60921,4.80102 l 1.98773,8e-4 10e-6,10.85608 1.28735,1.61986 H 271.10386 c -65.76161,0 -119.84328,-0.0917 -120.18151,-0.20387 z"
           id="path3513-2"
           inkscape:highlight-color="#3ed6e3"
           sodipodi:nodetypes="sssccscsssssssssssssccsssssccssscccssssssssscssssssssssssscccsscccss" /></g><path
         style="fill:#6e6e6e;fill-opacity:1;stroke:#000000;stroke-width:3.31431;stroke-dasharray:none;stroke-opacity:1"
         d="m 260.20689,457.88348 c 73.59239,0 133.24945,-59.65707 133.24945,-133.24946 H 126.95743 c 0,73.59137 59.65808,133.24946 133.24946,133.24946 z"
         id="path3517-7" /><path
         style="fill:#ffeeaa;stroke:#000000;stroke-width:3.31431;stroke-dasharray:none;stroke-opacity:1"
         d="m 376.07518,332.07364 c 4.28475,-2.95569 6.81653,-6.57696 6.81653,-10.49339 0,-7.78714 -9.97525,-14.41863 -23.93951,-16.93355 0.86938,-1.51105 1.34448,-3.10351 1.34448,-4.75225 0,-9.56213 -15.64887,-17.31406 -34.95196,-17.31406 -4.26875,0 -8.35546,0.38008 -12.13668,1.0738 -4.04232,-12.69861 -26.22883,-22.41075 -53.00116,-22.41075 -26.77233,0 -48.95797,9.71214 -53.00116,22.41075 -3.78121,-0.69372 -7.86971,-1.0738 -12.1367,-1.0738 -19.30308,0 -34.95195,7.7515 -34.95195,17.31406 0,1.64875 0.4751,3.24206 1.34449,4.75225 -13.96516,2.51492 -23.9395,9.14686 -23.9395,16.93355 0,3.91643 2.53088,7.5377 6.81653,10.49339 z"
         id="path3519-0" /><path
         id="path3521-9"
         style="fill:#545454;fill-opacity:1;stroke:#000000;stroke-width:3.95715;stroke-dasharray:none"
         class="UnoptimicedTransforms"
         d="m 118.27809,312.13565 v 0.003 a 14.516129,14.516129 0 0 0 -14.48627,14.51387 14.516129,14.516129 0 0 0 14.48627,14.51387 v 0.003 h 260.0345 v -0.0111 a 14.516129,14.516129 0 0 0 0.16397,0.0111 14.516129,14.516129 0 0 0 14.51556,-14.51666 14.516129,14.516129 0 0 0 -14.51556,-14.51666 14.516129,14.516129 0 0 0 -0.16397,0.0111 v -0.0111 z"
         transform="matrix(1.0005433,0,0,0.70110729,11.679959,102.05134)" /></g></g></svg>
