CC(C)(C)C(C)(C)C1(C)CC1(C)C,137.94744262695312,not in training set
CC1(C)CC1C(C)(C)C(C)(C)C,136.04220046997068,not in training set
CC(C)(C)C(C)(C)CC1(C)CC1(C)O,135.43247013092042,not in training set
COC(C)(C)C1(C)CC1(C)C,132.4511646270752,not in training set
CCC(C)(C)C1(C)C(C)C1(C)C,131.72371196746826,not in training set
CC(C)(C)C1(C)CC1(C)C,130.29496269226075,not in training set
CC(C)(C)C(=O)C1(C)CC1(C)C,129.29909000396728,not in training set
CC(C)(C)C1(C)OC1(C)C,129.09979915618896,not in training set
COC(C)(C)C1(O)CC1(C)C,128.9563627243042,not in training set
C/C=C(\C(C)(C)C)C1(C)CC1(C)C,128.39495277404785,not in training set
COC(C)(C)C1CC1(C)C,128.088907623291,not in training set
COC1(C)C(C)(C)C1(C)C,127.77763710021972,not in training set
CC(C)(C)C1CC1(C)C,127.6671562194824,in training set
CC(C)C1(C)C(C)(C)C1(C)C,127.27680263519287,not in training set
CC(C)(C)C(C)(O)C1(C)CC1(C)O,127.23399715423582,not in training set
COC(C)(C)C(O)C1CC1(C)C,127.06185989379881,not in training set
COC(C)(C)C=O,126.93539352416991,in training set
CC(C)(C)C(C)(C)C1CCC1=O,126.79204025268554,not in training set
CC(C)(C)C(=O)C1(C)C(C)(C)C1(O)O,126.72731037139891,not in training set
CC1CC1,126.59496612548828,in training set
CC(C)C(C(C)(C)C)C1(C)CO1,126.56523132324219,not in training set
CC(C)(C)C(=O)C1CC1(C)C,126.07098007202148,not in training set
COC(C)(O)C1(C)CC1(C)C,125.9428285598755,not in training set
CC1(C)OC(C)(C)C1(C)C,125.91992988586425,not in training set
CC(=O)C1(C)C(C)(C)C1(C)C,125.89363403320311,not in training set
C1CC1,125.76926269531249,in training set
CC(C)C(C)C1(C)CC1(C)C,125.45926151275634,not in training set
COC(C)C1(OC)CC1(C)C,124.93505001068115,not in training set
COC(C)(C)CC1(C)CC1(C)C,124.63098850250245,not in training set
CC(C)(C)C#CC1(C)CC1(C)O,124.52728958129882,not in training set
CC(C)(C)CC1(C)CC1(C)C,124.51529216766357,not in training set
CC(C)OC(C)(C=O)C=O,124.48110103607178,not in training set
COC1(C)C(C)(C)C1(C)O,124.41920223236085,not in training set
COC(C)(O)C(C)C1CC1(C)C,124.33706607818604,not in training set
CC(C)(O)C(=O)C1(C)CC1(C)C,124.307625579834,not in training set
CC(=O)C(C)C1(C)CC1(C)C,124.28836269378662,not in training set
COC(C)C1(C)CC1(C)C,124.28158855438234,not in training set
CC(C)C1(O)C(C)(C)C1(C)C,124.22143325805663,not in training set
CC(O)C1(C)C(C)(C)C1(C)C,124.11099739074706,not in training set
CC(C(O)C1(C)CO1)C(C)(C)C,124.09620265960694,not in training set
COC1(C)C(C)C1(C)C,123.93634529113771,in training set
COC1(OC)CC1(C)C,123.69347648620604,not in training set
CC(C)C1(C)C(C)(C)C1(C)O,123.60558586120605,not in training set
CC(C)(O)C1(C)CC1(C)C,123.54147090911866,not in training set
CC(=O)C1(O)C(C)(C)C1(C)C,123.5181562423706,not in training set
C/C=C(/C(C)(C)O)C1(C)CC1(C)C,123.30725116729737,not in training set
COC(C)(C)C#CC=O,123.19036712646485,in training set
COC(C)C=O,123.06319446563722,in training set
CC(C)C1(C)CC1(C)C,122.95718002319335,in training set
COC(C)(O)C1CC1(C)C,122.92431030273437,not in training set
CC1CO1,122.86559429168699,in training set
CC(C)(C)C1(C)CCC1=O,122.79114208221435,not in training set
CC(O)(C=O)C1(C)CC1(C)C,122.66936931610108,not in training set
C#CC(C)(C)OC,122.54549865722656,in training set
COC1(C)CC(=O)C1(C)C,122.52116298675537,not in training set
CC1(C)CC1(C)C,122.49941177368164,in training set
COC(C)(C=O)C(C)C,122.45700569152831,in training set
COC(C)OC,122.34846849441529,not in training set
CCO,122.33616199493407,in training set
CC(=O)C(O)C1(C)CC1(C)C,122.33381156921388,not in training set
COC1(OC=O)C(C)C1(C)C,122.21498336791991,not in training set
CCC1(C)C(=O)C1(C)OC,122.13377971649172,not in training set
O=CC1CC1,122.12982463836671,in training set
CC(=O)C1(C)C(C)(C)C1(C)O,122.09870872497558,not in training set
CC1(C)C(C=O)C1(C)C,122.09807109832765,in training set
COC(C)(C)C(O)C1CC1(C)O,122.09383754730223,not in training set
COC,122.01034755706789,in training set
CC(=O)C1(C)CC1(C)C,121.98885440826416,in training set
CC(C)C(C)(C)C(C)C=O,121.96878147125243,not in training set
CC1(C)CC1(C)C1(C)CO1,121.90217704772948,not in training set
CC(C)C(C)(C)OC=O,121.86878757476808,in training set
CC(C)(C)C1(C)[CH-]C(O)(C2(O)CO2)C1,121.85741004943849,not in training set
CC1(C)CC1(C)C1(C)CC1,121.83786449432372,not in training set
CCC1(C)C(C)(C)C1(C)O,121.80551300048829,not in training set
CC(C)(C=O)C1(C)CO1,121.80264549255367,in training set
CC(C)C(C)C(C)C1(C)CC1(C)O,121.70790920257568,not in training set
CC1(C)CC1(C)C=O,121.6142986297607,in training set
CC(C)C(C)(C)C,121.60049419403076,in training set
CC1(C)C(C)(C)C1(C)O,121.58087978363038,in training set
c1ccc[cH-][cH-]cc1,121.56164760589598,not in training set
CC(C)(C)C=O,121.42982368469237,in training set
CC(C)(O)C(=O)C1CC1(C)C,121.35653285980224,not in training set
COC(C)C1(C)OC1(C)C=O,121.33613243103026,not in training set
CC1(C)C(C)(C)C1(O)C=O,121.32581577301025,not in training set
CC1(C)CC1C1(C)CC1(C)O,121.25146713256835,not in training set
CC1(C)OC1(C)C,121.23383140563965,in training set
CC(C=O)(C=O)CC=O,121.21915168762206,in training set
Cc1ccccc1,121.20335216522216,in training set
CCC1(C)C(C)C1(C)OC=O,121.13408241271972,not in training set
CC1CC1C,121.11185817718507,in training set
CC1(C)CC1(C)CC=O,121.05273418426512,in training set
CC(C)(C)C(=O)C1(O)CC1(C)O,121.02194919586182,not in training set
CC(C)C1(C)CC1(C)C=O,121.01399154663088,not in training set
CCC(O)(C=O)C(C)(C)C=O,120.8322780609131,not in training set
CC(C)C1(C)CC1(C)C(C)O,120.81866855621337,not in training set
CC1(C)OC1(C)OC=O,120.80291633605957,not in training set
CC1(C)OC1(C)CC=O,120.78034114837651,in training set
CC1(C)C(C)(O)C1(C)C=O,120.76639366149902,not in training set
c1ccco[cH-]cc1,120.75975227355958,not in training set
COC(C)C,120.66805038452154,in training set
CC(C=O)C1(C)CC1(C)C=O,120.66639995574951,not in training set
COC(=O)C1(C)CC1(C)C,120.5909408569336,not in training set
CC(C)C(C)C1(C)CC1(C)O,120.5540102005005,not in training set
CC(C)(C=O)C=O,120.54334373474121,in training set
O=C1CC1,120.53803577423095,not in training set
CC1C(C)(C)C1(C)C=O,120.49578056335446,in training set
COC(C)(C)OC1CC1,120.4807668685913,not in training set
CC1(C)OC1(C)C=O,120.28835124969486,in training set
CC1CC(C)(C=O)C1(C)C,120.26214504241943,not in training set
CCC1(C)C(=O)C1(C)C,120.1937780380249,not in training set
CC1(C)CCC1(C)C,120.12563152313233,in training set
CC(C=O)C(C)(C=O)C=O,120.12272281646729,not in training set
CC(C=O)C(C)(C)C(O)C=O,120.04411964416504,not in training set
c1ccoc1,119.95503540039061,in training set
CC(=O)C1C(C)(C)C1(C)O,119.92085914611818,not in training set
C#CC(C)(C)C=O,119.91948165893555,in training set
COC1(C=O)C(O)C1(C)C,119.86633052825928,not in training set
CC(=O)C1(C)C(O)C1(C)C,119.84880409240722,not in training set
CC(C)OC(C=O)C=O,119.764483833313,in training set
CCC1(C)C(O)C1(C)C,119.74189319610598,in training set
CC(=O)C1(O)CC1(C)C,119.72709922790531,in training set
COC(C)C1(C)C(C)C1(C)O,119.65768203735352,not in training set
CC(=O)C(C)C1CC1(C)C,119.64909477233887,not in training set
CC1CC1(C)C,119.6294500350952,in training set
CC(C)C1(C)OC1(C)C(C)O,119.62747135162354,not in training set
CC(C)C1(C)OC1(C)C=O,119.59314632415771,not in training set
CC(O)C(C)COC(C)(C)C,119.12849712371826,not in training set
CC(=O)C1(C=O)CC1(C)C,119.05871944427491,not in training set
CC1(C)CC1C=O,119.04750404357912,in training set
CCC=O,119.04549293518062,in training set
CCC1(C)CC1(C)C(C)C,119.01194877624512,not in training set
COC(=O)C1(C)C(O)C1(C)C,118.94058666229247,not in training set
C#CC(C=O)C(OC)OC,118.91170005798341,not in training set
COC(C)(O)C(C)C=O,118.88839683532716,not in training set
CC1(C)C(=O)C1(C)OC=O,118.87522678375245,not in training set
CC1(C=O)CC1(C=O)C=O,118.85080623626709,not in training set
CC(C)(O)C(=O)C1(C)CC1(C)O,118.84357757568358,not in training set
C1CCC1,118.81182823181152,in training set
CCC1(C(C)C)OC1(C)C,118.77950668334962,not in training set
CC1(C)CC1C1(C)CC1(O)O,118.7610029220581,not in training set
CC(=O)C1OC1(C)C,118.7420129776001,in training set
COC(C#CC=O)C=O,118.67157669067383,in training set
CC(O)O,118.56423397064209,not in training set
CC1(C)CC1(O)C1(C)CC1,118.5045244216919,not in training set
C#CC(C)OC,118.47129859924321,in training set
CC1(C)CC1(C)C(=O)O,118.45316219329833,not in training set
COC1(OC=O)CC1,118.43921260833741,not in training set
CC(C=O)CC=O,118.43711795806882,in training set
CC1OC1C(C)(C)C=O,118.32620754241945,in training set
COC(=O)C(C)OC,118.32501888275146,in training set
CC1(C)CC1OC=O,118.31782302856445,in training set
O=C1CCC1,118.2747638702393,in training set
COC1(C=O)C(C=O)C1(C)O,118.26304912567139,not in training set
O=CC1CO1,118.24632968902587,in training set
CC(C)C1C(C)(C)C1(O)O,118.22874851226806,not in training set
O=CO,118.19040927886962,not in training set
COC1(C)CC(O)(C=O)C1C,118.18555736541748,not in training set
CC1C(C)(O)C1(C)OC=O,118.17405281066895,not in training set
CC(C)C(C)C1(C)CC1=O,118.1674165725708,not in training set
Oc1ccc2occc2c1,118.13290767669677,not in training set
CC(C)C(C)(O)C(C)C,118.12841377258302,in training set
CC(C)C1(C)CC1C1(C)CC1(O)O,118.095627784729,not in training set
CC(C)(C=O)CO,118.07250480651861,in training set
CC1OC1C1(C)CC1(C)C,118.02507419586182,not in training set
COCOC1(C)CC1(C)C,117.96534023284912,not in training set
CC(C)C1CC1(C)C,117.95486221313479,in training set
CC(C)C1(C)CC1(C)O,117.93063507080079,in training set
CC=O,117.7987997055054,in training set
CC(=O)C(=O)C1(C)C(C)(C)C1(O)O,117.73434200286866,not in training set
CC(O)C1(C)CCC1(C)C,117.7202896118164,not in training set
CC1(C2OC2(C)C)CC(=O)C1,117.7195333480835,not in training set
COCC(C)=O,117.65432090759276,in training set
COC(C(C)C)C1(C)CC1=O,117.62001876831056,not in training set
C#CC1(C)C(C)(O)C1(C)C=O,117.59269142150877,not in training set
CC(C)C(C)C1(C)CC1C,117.55925998687744,not in training set
CC(C)C1OC1(C)C,117.54762306213374,in training set
COC=O,117.5328409194946,in training set
CC(C)C(C)C1CC1(C)C,117.50795364379884,not in training set
CC1(C=O)CCC1(C)C=O,117.48573284149171,not in training set
CCC(C)(C)C=O,117.48007183074945,in training set
COC1(C=O)C(=O)C1(C)O,117.47584114074706,not in training set
CCC1(C)CC1(C)C=O,117.3243646621704,in training set
CC1(C)C(=O)C(=O)C1(C)C,117.31406002044677,not in training set
CC1(OC=O)CO1,117.30124282836914,not in training set
CC(C)C1(C)CC1C1(C)OC1(O)O,117.29121913909911,not in training set
CC1(C)OC1(O)CC=O,117.27894439697266,not in training set
CCC1(C=O)CC1(C)OC=O,117.2562400817871,not in training set
Oc1ccco1,117.20118637084961,not in training set
C=O,117.13716430664063,in training set
CC(C=O)C=O,117.00224475860601,in training set
COC1(CC=O)CC1=O,116.96540946960448,not in training set
CC1C(C)(O)C1(C)C=O,116.94892444610595,in training set
CC1(C=O)CC(=O)C1(C)O,116.82086334228516,not in training set
CC1(C)CCC1=O,116.76845588684081,in training set
CC1(C=O)C(=O)C1(C)CO,116.74420585632325,not in training set
CC(C)C(O)C1(C)CC1=O,116.7423641204834,not in training set
CC1(C)CC(=O)C1,116.74148216247559,in training set
CC(C)C1(C)CC1=O,116.67204666137695,not in training set
COC1(C(C)C)CC1=O,116.6278673171997,not in training set
COC(C)C1(O)C(C)C1(C)O,116.62437248229982,not in training set
CC(C=O)C(C)(C)O,116.6105171203613,in training set
CCC1(C)C(=O)C1C,116.57586917877197,not in training set
CC1(C)CC1(O)C(=O)O,116.51707191467285,not in training set
C#CC1(C)CC1(C=O)C=O,116.44571590423584,not in training set
CC1(O)CC1(C)C1(C)CO1,116.41317996978759,not in training set
CCC1(C=O)CC1(C)C=O,116.4117343902588,not in training set
CC(C)C(C=O)C1(C)CC1=O,116.37874774932861,not in training set
CC(O)C1(C)C(C)(O)C1(C)O,116.36154537200926,not in training set
CCc1ccccc1C,116.35819187164306,in training set
CC(C)(C)O,116.31181755065921,in training set
CCC1(C(C)O)CC1(C)C,116.30838642120361,not in training set
CC(O)(C=O)C=O,116.27182750701901,in training set
CC1C(C(=O)O)C1(C)C,116.25820751190186,not in training set
CC1(O)CC1(C)C1(C)CC1,116.22926883697511,not in training set
CC(C)O,116.15202426910396,in training set
CC1(C)CC1(C)C(=O)C(=O)O,116.13509101867677,not in training set
CC1(C)CC1(O)C1(C)CCC1,116.1254873275757,not in training set
CC(C)(O)C=O,116.09424266815185,in training set
CC(C=O)C1(C)CC1C,116.08636989593502,in training set
CCC1(C)OC1C1(C)CC1=O,116.02804889678954,not in training set
COC(C)O,115.98827743530275,not in training set
C#CC1(C=O)C(O)C1(C)C,115.9577507019043,not in training set
CC(=O)CO,115.95063972473152,in training set
CC(C=O)C1(C)CC1=O,115.94641666412353,not in training set
C1=CCCC1,115.9252060890198,in training set
CCC(O)C(OC)(OC)C(C)O,115.91095848083496,not in training set
O=CC(O)C=O,115.89429683685304,in training set
C=C(O)C(=O)C1CC1(C)C,115.85589962005615,not in training set
CC(C=O)C(C=O)C(C)C=O,115.85012063980102,not in training set
CC1(C(C=O)C=O)CO1,115.84066734313964,in training set
CC1(C)CC1(C)C1CC1,115.83902969360352,in training set
C#CC(C)C1(C)CC1=O,115.83143444061278,not in training set
O=C1CC(=O)C1,115.82489757537843,not in training set
CC(C)C(C)C1(O)CC1=O,115.82256870269774,not in training set
CCC(=O)C(C)OC,115.79854049682613,in training set
O=C(O)O,115.78713779449463,not in training set
COC(C)CO,115.77255249023438,in training set
CC(=O)O,115.72614727020265,not in training set
COC(C)CC=O,115.67099018096926,in training set
CCC(C)(C)OC,115.63082733154297,in training set
O=CCCO,115.62966346740723,in training set
CC(C1(C)CC1)C1(C)CC1(C)O,115.56427268981932,not in training set
CC1OCC1=O,115.54914531707762,in training set
CCC#CC(C)(C)OC,115.54114665985104,in training set
CC(=O)C(=O)C1CC1(C)C,115.4717866897583,not in training set
CC1(C2CC2=O)CC1=O,115.46576442718506,not in training set
CC(C1CC1(C)C)C1(C)CC1,115.46198539733885,not in training set
CC(C)C(C)C1(C=O)CC1(O)O,115.4320987701416,not in training set
CC(C=O)CO,115.38875770568848,in training set
CC(C)OC=O,115.3692756652832,in training set
CC(C)C1(C(C)C)CC1=O,115.3590166091919,not in training set
CC(C)C(O)C1C(=O)C1(C)C=O,115.3353443145752,not in training set
CC(O)C=O,115.32470245361324,in training set
CCC1(C)OC1C(C)=O,115.31563568115239,in training set
O=C(CO)CO,115.2988822937012,in training set
COC1(C=O)CC1,115.26938400268556,in training set
CC(C)C(C)C1(C)CO1,115.24130191802978,in training set
CC(C)C(C)C(C)C1(C)CO1,115.19677734375,not in training set
COCC(O)C=O,115.18238410949704,in training set
CC1(C)C(=O)C1(C)C1CC1,115.16898288726806,not in training set
CC1(C=O)CC1(C=O)CO,115.15540599822998,not in training set
CC1(C)CC1C(=O)C(=O)CO,115.14827804565431,not in training set
CC1(O)CC1,115.1036470413208,in training set
COC(C)=O,115.09234580993653,in training set
CCC(=O)C1(C)OC1C(C)=O,115.08848323822022,not in training set
CC(C=O)(C=O)C1CC1,115.08172492980957,in training set
CC(C)=O,115.07035312652589,in training set
CC(OC=O)C1(C)CO1,115.06996383666993,in training set
CC(C=O)C1(C)CO1,115.0181400299072,in training set
CC(C)C(C(C)C)C1(C)CO1,114.96206912994386,not in training set
CC(C)(C=O)C(O)CCO,114.87186946868896,not in training set
CC(C=O)C1CC1(C)C=O,114.8491678237915,not in training set
CC(C)C(C)C(C)C1CC1(C)O,114.84622917175292,not in training set
O=C(O)CO,114.79557342529296,not in training set
CC#CC(C)C1(OC)CC1=O,114.78487739562988,not in training set
O=COC(O)C=O,114.73584346771241,not in training set
C#CC1(OC)OC1C,114.68895721435547,not in training set
CC(C)(O)O,114.68059425354005,not in training set
CC1CC1(C)C(O)C=O,114.65820465087891,in training set
COC(=O)OC,114.65046157836913,not in training set
C#CC1(C)CC1CC(C)=O,114.63996582031248,not in training set
C#CC(C)C(C)=O,114.59609680175785,in training set
O=CC1(C=O)CO1,114.56255378723141,in training set
O=CC1(O)CO1,114.54851398468017,not in training set
CCC(O)C(C)OC,114.53188362121581,in training set
C#CCC(C)=O,114.52345523834224,in training set
O=CC(=O)O,114.5108768463135,not in training set
CCC(C=O)OC,114.50779256820678,in training set
CC(O)(O)O,114.47032203674316,not in training set
CC1=CC=CC=CC1(C)O,114.4459527015686,not in training set
C#CC(O)(CC)OC=O,114.41612873077393,not in training set
CC(=O)C=O,114.40863170623781,in training set
COC1(C2(C)CO2)CC1,114.39010925292969,in training set
CC1=CCC=C1,114.38121986389159,not in training set
O=CC1C(=O)C1O,114.3602647781372,not in training set
CCC(C)O,114.35621604919432,in training set
O=CC1(O)CC1,114.32116127014164,in training set
COC(=O)C=O,114.31171188354492,in training set
C#CC(C)C(=O)OC,114.24495182037356,in training set
CC(=O)OC=O,114.23758296966554,not in training set
CC(O)(C#CC=O)C=O,114.2277256011963,in training set
COC(C=O)OC1CC1,114.19825439453126,not in training set
COC(=O)OC=O,114.1887571334839,not in training set
CC(C)C(C)C(C)C1(O)CC1,114.1808650970459,not in training set
CC1(C2(C)CO2)CC1,114.14633522033691,in training set
O=CCC(C=O)CO,114.12620515823367,in training set
O=CC(=O)C=O,114.12438945770265,in training set
CC(C)OC(=O)C1(C)CC1,114.10654067993163,not in training set
CCC(=O)OC,114.09897861480717,in training set
CC(C)C1OC1(C)O,114.0959213256836,not in training set
COC1(OCO)CC1C,114.08765335083008,not in training set
CCC1CC1(C)C,114.07434444427491,in training set
O=c1oc1=O,114.04735736846924,not in training set
CC1(C2CC2=O)CO1,114.03587512969972,not in training set
CC1(O)CC1(C)C1(C)CCC1,114.02609119415283,not in training set
CC1(C)CC(=O)O1,114.02352085113527,in training set
CC(=O)CC=O,114.00265159606934,in training set
CC(C=O)C(C)C=O,113.99956703186037,in training set
CC(C)C1(C)CO1,113.98792991638184,in training set
CC1C(C)(O)C1(O)C=O,113.98773174285888,in training set
CC(C)C(C)C1OC1(C)O,113.90138931274416,not in training set
O=COC1(C=O)CC1,113.900789642334,in training set
CC(=O)C(O)O,113.89828758239747,not in training set
C#CO,113.80014629364014,not in training set
CCC(C)=O,113.74878444671631,in training set
CC(=O)OCO,113.74875240325926,not in training set
CC(C)C(O)O,113.73785667419432,not in training set
C#CC(C=O)C=O,113.7146438598633,in training set
C1CC2CC12,113.59849805831908,in training set
C#CC1(C)C(=O)C1(C)C#C,113.49248008728028,not in training set
C#CC(C)C=O,113.48859024047847,in training set
COC1(C)CCO1,113.48761787414551,not in training set
COC1(C)CC1,113.43739585876466,in training set
C#CC(=O)CC=O,113.42882442474367,not in training set
CC(C)C(=O)C1CC1(C)O,113.39039726257323,not in training set
CC1(C=O)CC1,113.3571660995484,in training set
CC(O)C(C)(C=O)CO,113.35057296752929,in training set
CCC(=O)OC=O,113.32106761932374,not in training set
CC(C=O)C1CC1(C)C(C)O,113.31780242919922,not in training set
CC(C)C=O,113.28809070587157,in training set
CC1(C)CC1C1(C)CC1,113.27486000061035,in training set
CC1CCC1,113.24099597930908,in training set
C#CC(C)=O,113.23527374267577,in training set
CC(C)C1(C(C)C=O)CC1C,113.2095350265503,not in training set
C#CCC1(C)OC(O)C1(C)C=O,113.1873041152954,not in training set
CC(C)C1CC1(O)C=O,113.15780601501467,in training set
CC(O)(C=O)CO,113.14499187469482,in training set
CC(C(=O)CO)C1OC1(C)O,113.12922649383545,not in training set
C#CC(O)C=O,113.10917301177975,in training set
C#CC1(C=O)CC1C,113.09770965576172,in training set
C#CCOC(C)=O,113.0668684005737,in training set
CCC1(C)OC1C(C)C,113.05430831909179,in training set
O=CC1(C=O)CC1,112.99289474487301,in training set
CC1(C2(C=O)CO2)CC1,112.98906002044674,in training set
CC1(O)C(=O)C1C(O)(O)O,112.98792839050293,not in training set
C#CC(C)C(C)C(=O)O,112.97600936889648,not in training set
CC(O)C(C)C=O,112.95598144531247,in training set
C#CC(=O)C(C)CC,112.93608093261719,in training set
COC1(CO)C(C)C1C,112.92984066009517,in training set
C#CC(C)C(=O)O,112.92457733154296,not in training set
CC1C(=O)CC1(C)CO,112.91233139038086,in training set
CC1(C)CC(=O)C1=O,112.9029541015625,not in training set
CC(=O)OC(C)=O,112.90021133422852,not in training set
COC(=O)OC(C)=O,112.87503719329834,not in training set
CC(=O)CCO,112.82758216857913,in training set
C#CC(O)C(C)C=O,112.81957244873047,in training set
CC(C=O)C1(C=O)CO1,112.80757694244379,in training set
CCC(C)C1(C=O)CC1=O,112.77381305694581,not in training set
CC(C)C(C)(C=O)C1CC1,112.75092029571535,not in training set
CCC1(C=O)CC1=O,112.69753227233886,not in training set
CC(C)C(C)C(C)O,112.69494972229003,in training set
COC#CC(=O)O,112.62117538452148,not in training set
CCC1(C=O)CC1(O)C=O,112.61600189208984,not in training set
CC(C)CC(C)C1(C)CC1(C)O,112.58994827270509,not in training set
CC12CC=CCC1(C=O)C2,112.55856246948244,not in training set
C#CC(=O)OC,112.50708274841305,in training set
CC1(O)C(=O)C1(C)C1CC1,112.50377712249757,not in training set
C#CC=O,112.4989112854004,in training set
C#CC(=O)O,112.48672199249266,not in training set
CC(=O)C(CC=O)C(C)C,112.43638820648192,not in training set
CCC(O)C(C)C(C)C,112.42830677032471,in training set
CC(C)C(C)C1CC1(O)C=O,112.40883808135986,not in training set
CC(=O)C(C)C,112.4084770202637,in training set
CC(C)C(C)C1(C)CC1,112.4079393386841,in training set
COC(=O)C(C)O,112.38213481903075,in training set
CCC1C(C)C1O,112.35996608734129,in training set
CC1(C)CCO1,112.28677196502684,in training set
CC1(O)CC(O)C=CC1=O,112.27440567016602,not in training set
CC1(O)CC1C(=O)C=O,112.26307907104487,in training set
CC12CC(C1)C2=O,112.20163040161133,not in training set
CCC(O)OC(C)=O,112.1642786026001,not in training set
C#CC(C(C)C)C(C)C=O,112.12169704437257,not in training set
CC(=O)C1CC(=O)C1O,112.11285152435299,in training set
CC#CC#CC1(C)C(C)C1(C)C,112.11034832000732,not in training set
CC(O)C1(OC=O)CC1O,112.06585636138917,not in training set
CC(=O)C(C)=O,112.06409263610838,in training set
CCCOC(C)=O,112.04861297607421,in training set
CC1(C=O)CCO1,111.99058246612545,in training set
CC1(C)CC1,111.98214721679685,in training set
CC(CO)C1(CO)C(=O)C1C,111.96728897094727,not in training set
CCC(=O)C(C)CC,111.89549732208248,in training set
OC1C=CCC1,111.87470865249638,in training set
CCCC1(C)C(O)C1(C)C=O,111.87408828735353,not in training set
CC(=O)C(=O)C(O)C(C)C1(C)CC1,111.8671287536621,not in training set
C#CC(=O)C=O,111.8557054519653,in training set
CC(C)OC1CC1(O)O,111.75357036590576,not in training set
CC(C=O)C1(C)CC1,111.74752502441402,in training set
CC#CC(C=O)C=O,111.72403373718262,in training set
CC(C)C(C)C=O,111.70561866760252,in training set
C1C23CC12C3,111.69183387756348,not in training set
CCC(O)C(O)(C=O)CC,111.6378917694092,not in training set
C#COC(=O)C=O,111.62104740142823,not in training set
CC(C)(C)C,111.62010345458984,in training set
CCC(O)C(O)C=O,111.57826557159426,in training set
CC#CC=O,111.55972328186036,in training set
CC(=O)C(=O)C(=O)C(C)(C)O,111.5268970489502,not in training set
CCC1(C)CC1(C)CO,111.52419052124024,in training set
CC1C(O)C1(C=O)CO,111.52187805175781,in training set
CC(=O)C(=O)C1(O)CC1(O)C(C)C1(C)CC1,111.51557006835937,not in training set
CC(C1(O)CCC1)C1(C)CC1(C)O,111.50369815826417,not in training set
C#CC1(C)CO1,111.4669800758362,in training set
CCC1(OC=O)CC1C,111.46435432434083,in training set
CC1(O)CC1(C)C1CO1,111.46423816680905,in training set
COC(=O)C1OC1(O)O,111.46127395629884,not in training set
COC(=O)C(C)C,111.45999889373778,in training set
C#CC1(C(C)C)CC1C,111.43017673492432,in training set
O=C(CO)C1CC1(O)O,111.42651596069335,not in training set
CC(C)C1(C(C)C=O)CO1,111.41048183441161,not in training set
CC(O)C1(C=O)C(C)C1C=O,111.39914913177492,not in training set
CC(C)C(C)C(C)C=O,111.39837570190429,in training set
CC(=C1CC1)C1(C)CC1(C)C,111.38822822570802,not in training set
C#CC(O)C1(C)CCC1=O,111.37939376831056,not in training set
C#CC(C=O)CC,111.37630462646483,in training set
CCC(C)C=O,111.36554470062254,in training set
CCOC(=O)C#CC(=O)O,111.31936283111573,not in training set
CC1C(=O)C2(O)C(C=O)C12,111.30335254669188,not in training set
CCCC(C)=O,111.28390426635742,in training set
CC(O)C1CC1O,111.27819442749028,in training set
C#CC1(C=O)OC1=O,111.26596546173094,not in training set
O=CC1(C=O)CCC(=O)C1,111.2335105895996,not in training set
CC(C1CC1(C)O)C1(C)CC1,111.22429504394532,not in training set
CC(C=O)C(=O)C1CC1(O)O,111.14250659942626,not in training set
CC#CC(=O)C=O,111.13806152343747,in training set
CC(C)C(C=O)C(C)C,111.11032276153564,in training set
CCC(C=O)CC=O,111.09468431472774,in training set
O=C(O)C#CO,111.08195972442627,not in training set
O=CC(O)C1CO1,111.06749134063718,in training set
CCC(=O)C(C)=O,111.03410758972169,in training set
C1=CC2C3C=CC1C23,110.98386383056639,in training set
CC1C(C)(O)C1(C)C1CC1,110.97826442718507,not in training set
CCCC1(C)CC1(C)C,110.97822360992434,in training set
CC(C)C(=O)C(C)C=O,110.90725936889649,in training set
CC(=O)C#CCO,110.86747570037844,in training set
C1CC2OC12,110.81152696609496,in training set
C1OC2CC12,110.78617544174195,in training set
CC1CC(O)C1(O)C=O,110.70705070495606,in training set
C#CCC1(OC=O)CC1,110.5841451644898,in training set
CC(C)C1CC(C)(O)C1,110.57845706939696,in training set
C#CC1(C)OC1(C=O)C1CC1O,110.55529499053955,not in training set
CC1CC1C1(C)CC(=O)O1,110.55250091552736,not in training set
CC(C)C(C)C,110.54259700775148,in training set
CC(C)C(=O)C=O,110.50779514312744,in training set
O=C1C23CC12C3,110.49709491729736,not in training set
CC(=CO)C(=O)O,110.46150512695311,not in training set
CC12CC(O)(CCC1=O)C2,110.40413398742676,not in training set
O=CCC1(O)C(O)OC1(O)C=O,110.39880332946778,not in training set
CC1=CC(C)CO1,110.35141773223876,not in training set
CC(=O)C(=O)C(C)C1(C)CC1,110.28855247497557,not in training set
C#CC(=O)C#C,110.26038675308227,in training set
COC(C)C(OC)C(C)C,110.23640155792238,not in training set
O=C(O)CC1CC1(O)O,110.2117950439453,not in training set
C#CC1(C#CC=O)C(C)C1O,110.21040363311768,not in training set
CC(C)C,110.18491592407227,in training set
O=C(O)CC#CO,110.17062950134277,not in training set
CC(C)C(O)C#CCC=O,110.16028842926026,not in training set
CC(=O)OC(O)C(C)=O,110.1216833114624,not in training set
CC1(C)CCOC1O,110.11874675750732,not in training set
C#CC(C)C1(C)CC1,110.09900493621825,in training set
C#CC1(OC)CC1,110.08199405670167,in training set
CC(C)C1(C)CC1,110.07608833312987,in training set
CCC1(C)CC1C(C)O,110.07086200714113,in training set
CCC1C(O)C1(CO)OC,110.01090450286864,not in training set
CC(C=O)CC(=O)C(C)O,109.94166049957275,not in training set
CC1=CC(O)C(C)(C(O)CO)C1O,109.938507270813,not in training set
COC1(C(O)CO)CO1,109.93244400024415,not in training set
O=C1CCO1,109.89849510192872,in training set
C#CC1(C#C)C(C)C1OC,109.8577236175537,not in training set
CC1CC(O)C(C)(C)C1,109.82950286865234,in training set
CC1(C=O)OC(=O)C1=O,109.79895153045655,not in training set
CCCC(=O)CC(C)C(C)=O,109.77411918640138,not in training set
C1=CC2OC1C1CC21,109.76054372787475,in training set
CC1(C)C(=O)OC1=O,109.66087837219239,not in training set
CC1(C2CO2)CC1O,109.64855098724362,in training set
CC(O)C1CC1(C)CO,109.6205615997314,in training set
CCC#CC(=O)O,109.6068946838379,not in training set
O=CC1=COC=CC1,109.5967514038086,not in training set
CC(C)(C=O)C1(C)CCC12CC2,109.59452266693116,not in training set
CC(=O)OCCO,109.57576999664312,in training set
COC1(C(C)C)CC1,109.55373172760008,in training set
C1=CC2C3[CH-]CC2C13,109.50921545028686,not in training set
CCC1(CO)C(=O)C1=O,109.48472652435302,not in training set
CC(C)C1(C(C)C)CC1,109.45490684509276,in training set
COC(C)C1(C(C)O)CC1,109.4118480682373,not in training set
CC1(C2(O)CC2(O)C2(O)CCC2)OC1(O)CO,109.36616859436035,not in training set
CC(=O)CC(=O)C(C)C=O,109.35230712890626,not in training set
CC1C(C)C1(CC#CCO)OC=O,109.3421600341797,not in training set
O=C1C2C=COC12,109.28034038543703,not in training set
C1=CC2[CH-]C3C(C1)CC23,109.16903686523438,not in training set
CC(=O)C(=O)C(C)C,109.16211872100827,in training set
CC1(C2CO2)CC(=O)C1,109.1593994140625,in training set
C#CC(C)(O)C1C(O)C1CC,109.153835105896,not in training set
C1C23CC12O3,109.12027521133425,in training set
OC1C2C=CC3C([CH-]2)C13,109.08862619400023,not in training set
CC1(C=O)OC1OCO,109.07779998779296,not in training set
CC1CC1C1(O)CO1,109.07324180603028,not in training set
C1C23OC12O3,109.06263246536255,not in training set
CCC1(CO)CC1=O,109.03243904113768,not in training set
CC12CC(C=C1O)C2O,109.01836471557615,not in training set
C#CC1(C=O)CC1,108.98805294036866,in training set
C1=CC2C3CCC2C13,108.98722620010378,in training set
CC1(C2(C)CC2)CCC1,108.98253059387206,in training set
CC(O)C1(CO)CC1C,108.8197984695434,in training set
CC1(C=O)C=CC2(CC2)C1,108.80351448059082,not in training set
CCC1(C)C2CC(=O)C21,108.79322013854981,in training set
OC1CC2C=CC3C1C23,108.77039699554444,in training set
O=C1C2CCC12,108.76235570907593,not in training set
C#CCCC1C23C4C=CC2C413,108.73880376815796,not in training set
C#CC(C)(C)C#C,108.71534137725828,in training set
C#CC(C)C1(C#CO)CO1,108.70166692733764,not in training set
CC1(O)CCC1(O)CO,108.68648643493655,in training set
CC1(C2CC2=O)COC(=O)CC1=O,108.6723581314087,not in training set
CC(C=O)CC(=O)C(=O)CO,108.65297813415529,not in training set
CC1(C2CC2)CC1C=O,108.65089550018314,in training set
CC(=O)CC(C)C,108.61528282165527,in training set
COCC(C=O)C(C)O,108.61060657501223,in training set
CC1(CO)CC1(C)C1CC1,108.55589351654054,not in training set
CC(C)C1(C=O)CC1,108.55409832000733,in training set
O=C1C=CCCC1,108.52986679077148,in training set
O=C1CC2CC1C2=O,108.52252159118652,not in training set
CCC(C=O)C(C)C1(O)CC1C,108.50618686676026,not in training set
COCCC(=O)C#CO,108.4708782196045,not in training set
CC(C)C(O)COCO,108.44352893829345,not in training set
CC(O)C(=O)CCC#CO,108.38457622528075,not in training set
CC(CO)C(C)C1CC1(C)O,108.31621189117432,not in training set
CC(=O)CCCO,108.28571319580078,in training set
CC(O)(O)C1=COCC1,108.2685359954834,not in training set
OC1C2C3C=CC2C13,108.2460206985474,in training set
C#CC(CC=O)C(O)CC,108.24109001159668,not in training set
C#CCC(C)C1(C=O)CC1,108.18554515838625,not in training set
CC1(C(=O)CCO)CCC1,108.17349872589111,not in training set
C1=CC2CC3C(C1)CC23,108.1639346122742,in training set
OC12[CH-]C3C14OC324,108.14642486572265,not in training set
C1CO1,108.12136106491091,in training set
C#CC,108.10959014892578,in training set
CC(O)(CO)C(=O)C1(C)CCOC1,108.08307361602783,not in training set
C#CC1(C)CC1,108.07249565124512,in training set
CC1C2C=CC3CC3C12,108.03731136322021,in training set
O=C1CC1C1(O)CCC1,108.00497474670411,not in training set
CC1(C2CC2)COC1=O,107.94576625823971,in training set
CC(C)OC1CC1(C)CO,107.93765335083006,not in training set
O=C1CCC12CCC2=O,107.92023677825927,not in training set
CCC(=O)C(O)C1(C=O)CC1,107.875461769104,not in training set
CC12C=CC3C([CH-]C31)[CH-]2,107.83839340209963,not in training set
CC1=CC(=O)CC1=O,107.83769168853759,in training set
OCCCC1/C2=C/C=C\C=C/C1[CH-]2,107.82611293792723,not in training set
CCC1(CO)C(C)C1O,107.80794200897218,in training set
OCC1C2/C=C/[CH-]O/C=C/C21,107.78634767532347,not in training set
CC(=O)C1CCC12CC2=O,107.75215587615966,not in training set
CC(CO)C1(CO)CC1O,107.73827075958252,not in training set
OC12C=CC3C1[CH-]CC32,107.73764629364013,not in training set
CC1(C2CC2=O)CCO1,107.72636489868162,not in training set
CC(OC=O)C1(CO)CO1,107.71558036804198,not in training set
CC(C)C1(C2CC2)OC1=O,107.71258716583252,not in training set
CC(O)C1(C)CC12C=CCO2,107.70930271148683,not in training set
CC12C3C=CC1C2O[CH-]3,107.60652074813842,not in training set
C1=CC2C34CC23C14,107.48767347335817,not in training set
CC12C=CC(C)(CC1)C2,107.4656400680542,in training set
CC(C)C1(C(O)C(=O)C(=O)O)CC1,107.45228080749513,not in training set
O=CC1CCCCC1=O,107.38180656433107,in training set
O=C1C2C=CC3C1C23,107.37966384887694,in training set
CC12C=CC([CH-]1)C1CC12,107.34077005386352,not in training set
CCCC(C)C1(C)CC1=O,107.27810115814208,not in training set
CC(=C1CC1)C(C)C(C)O,107.27609004974366,not in training set
CCC(C)C1(O)C2CC(=O)C21,107.27336540222167,not in training set
OC12C=CCC1C=CC2,107.26921215057372,in training set
[CH-]1C23C4C5OC5C2C143,107.26557683944701,not in training set
C1=CC2C=CC1C2,107.24135856628418,in training set
OC1C23C4C=CC2C143,107.2176085472107,not in training set
CC(OC=O)C1(C)CCC1,107.18019409179688,not in training set
OC12C3C=CCC1C2O3,107.16280775070189,in training set
C#CC1(C)CCO1,107.15293807983394,in training set
COC12C=CC(C1)C(O)O2,107.14212760925292,not in training set
CC1(CC(=O)CO)CO1,107.10421085357667,in training set
O=C(CO)C(O)C1(O)CCC1,107.08446712493895,not in training set
CCCC(=O)C1CC1O,107.07869014739991,in training set
O=C1CCC12CC2(O)CO,107.07256393432617,not in training set
O=C1CC12C=CCC2,107.02295608520507,not in training set
CC1(C=O)CCC1,107.00594902038574,in training set
CC(=O)C(=O)C(=O)CC1OC1(O)O,106.96021060943605,not in training set
C1=C2C(CC1)C1CC21,106.93477058410643,in training set
CC1(C2CC2)CO1,106.91284542083739,in training set
COC1=CCCCC1=O,106.89544715881348,not in training set
O1C2C1C1OC21,106.87655811309817,in training set
O1C2C3OC2C13,106.87145328521729,in training set
O=C1CC=CC12CC2,106.86043128967282,in training set
O=CC1(O)CCC(=O)C1=O,106.85429458618165,not in training set
CC(=O)OCC(=O)C1CO1,106.82431526184082,not in training set
C1C2C1C1OC21,106.81352252960207,in training set
CC#CC,106.78813610076904,in training set
OC12CC3CC=CC1C32,106.7627007484436,in training set
O=C1CCCOC1,106.74388217926021,in training set
CC1CC1C(O)C1(C)CO1,106.73162212371827,not in training set
CC#CC(C)C1(OC)CC1,106.69825439453126,not in training set
CC(OC(=O)C(=O)CO)C1(C=O)CC1,106.68479194641114,not in training set
O=C1CCCC1=O,106.67370796203613,in training set
OCCC1O/C=C\C=C\C2OC21,106.66523532867433,not in training set
O1C2OC3C1C23,106.6022183418274,not in training set
CCC12C=CC(C=C1)C2,106.5443154335022,in training set
O=CC(O)C1CC(=O)C1=O,106.45943679809571,not in training set
OCCC1C2/C=C\C=C/C(O)C1C2O,106.45682506561278,not in training set
OCC1C2[CH-]/C=C\C=C/OC21,106.43149271011353,not in training set
CC(C)C#CC(C)C(C)C,106.29884033203125,not in training set
O=C1CC2(CC2=O)C1=O,106.25087547302248,not in training set
CC1(C=O)OC1C1CC1,106.16900482177738,in training set
OC12OC3C4C3C1C42,106.15874252319337,not in training set
O=C1C=CCC(=O)C2C(O)C12,106.15724449157715,not in training set
CC#CCC(O)C1(C=O)OC1C,106.12850437164306,not in training set
CC(=O)CCC(=O)CCCO,106.12795639038086,not in training set
CC(=C1CCC1)C1(C)CC1(C)O,106.06829147338867,not in training set
OCC1C#C/C=C\C=C/C(O)C1O,106.06137247085573,not in training set
CC#CCC(=O)C#CCCO,105.96426563262939,not in training set
O=C1C23C4C=CCC2C143,105.9620460510254,not in training set
CC1(C)CC1C1(C)CCC1,105.95716667175294,not in training set
OCC1/C=C\C(O)/C=C\C(O)/C=C\1,105.92546844482422,not in training set
C1=CC2CC3CC1C2C3,105.91846351623539,in training set
OCC(O)C1=C(O)CCC1,105.88514671325683,not in training set
OCC12C=CCC1=CCC2,105.87742338180543,not in training set
CC(C)C1OC1(C)C1CC1,105.8434190750122,not in training set
C1=C2COC2CC1,105.82400360107422,in training set
C#CC1CC2C3CC3C12,105.82212581634518,in training set
CCCC1(O)CC1(O)O,105.76816406249999,not in training set
CC12C=CC3C1CCC32,105.73180742263798,in training set
[CH-]1C2C3C1C1([CH-]C1)C23,105.7189697265625,not in training set
C1C2C34OC23C14,105.7006446838379,in training set
OC1C2C1C1C34OC13C24,105.65125751495364,in training set
CCCCC(=O)C=O,105.60805377960206,in training set
CCC1(C2CC2)CC1=O,105.59176998138427,not in training set
OCC1C#C/C=C\C=C/C(O)[CH-]1,105.58497419357299,not in training set
COC12CC3C1C=CC32,105.5492288589478,in training set
[CH-]1C2C3[CH-]C4C1C4C23,105.54865598678589,not in training set
C1=C2CCC2CC1,105.54842281341553,in training set
[CH-]1CC2C34[CH-]C23C14,105.45411434173585,not in training set
COC1(C)C2C3CC3(C)C21,105.40925846099854,not in training set
CC(=O)C1CC1C1(C=O)CC1,105.40017166137694,not in training set
C#CC(CO)C(CC)C(C)C=O,105.37855434417725,not in training set
O1C2C3OC4C2C4C13,105.37304420471189,in training set
C#CC1(C2CC2CO)C(C)C1C,105.33649406433105,not in training set
CC12CC3C=CC1C3(O)C2,105.29101419448851,not in training set
OC1/C=C\C=C/[CH-]/C=C\1,105.27174873352051,not in training set
C1C2C34CC23C14,105.25853729248048,not in training set
CC(C1CC1)C1(C)CO1,105.22762184143068,in training set
CC1(C)COC1,105.18050613403321,in training set
[CH-]1C2C3[CH-]C4C1C4CC23,105.12970809936525,not in training set
O=C1CCC2(CC2=O)O1,105.09010372161866,not in training set
C#CC1(C)CC2C=CCC21,105.07901811599731,not in training set
O=C1C=CC(=O)C12CC2,105.02659492492675,in training set
O=CC1C2C3C(O)C3C12O,104.99990291595459,not in training set
O=C1CC12C(=O)C1CC12,104.98339242935181,not in training set
CC12C=CC(O1)C1(C)OC21,104.9741231918335,not in training set
C1C2C3C1C1C2C31,104.9641053199768,in training set
CC(C)C1(C)COC1,104.96290473937984,in training set
[CH-]1C2[CH-]C3C4CC(C14)C23,104.96006355285644,not in training set
CC(CC1CC1)C(C)(O)O,104.95529975891114,not in training set
C#CC#CC=O,104.95381746292115,in training set
OCC(O)OC1C23C4C=CC2C413,104.94335498809815,not in training set
CCC(CO)C1(O)CC(=O)C1C=O,104.94334545135499,not in training set
C#CCC1(C)CC1,104.93052024841307,in training set
C1C2C1C1C3OC2C31,104.92245693206787,not in training set
CC1=CC2=C(C1)OCC2,104.86820125579834,not in training set
[CH-]1OC2C3OC3C3C1C23,104.85715780258178,not in training set
CC1(C=O)CC1C1CC1,104.68348693847655,in training set
[CH-]1C2C3C4CCC13C24,104.68088474273681,not in training set
O=CC(=O)C12CC=CC1CC2,104.67593059539796,not in training set
CC1(O)CC1(C)C(O)=C1CCC1,104.66696338653564,not in training set
[CH-]1C2CC3C1C1[CH-]C3C21,104.65832338333131,not in training set
CCC1C(O)CC1OC,104.62492771148683,in training set
COC1/C=C\C=C/C/C=C\1,104.60121822357178,not in training set
[CH-]1C2OC3C4CC(C14)C23,104.59281616210939,not in training set
C1CCCC1,104.54906978607178,in training set
CC12C=CCC3CC1C3O2,104.54568214416504,not in training set
CC1C2C3C(=O)C1(C)C32,104.53591575622555,in training set
CC(=O)C(=O)C(=O)C(=O)OC1(O)CC1,104.52348003387452,not in training set
O=CC12CC3C=CC1CC32,104.50718774795533,not in training set
CC1C/C=C\C=C/C(O)O1,104.50659828186033,not in training set
O=CCC(O)C#CCC#CO,104.4584358215332,not in training set
OCC1(O)CCCC1,104.42959728240967,in training set
OC1[CH-]C12C1C34[CH-]C13C24,104.38445024490358,not in training set
CC12CCC3(O)C1C=CC23,104.3795708656311,not in training set
[CH-]1OC2[CH-]C3C1OC23,104.3511248588562,not in training set
CC1C2C3CC3C12,104.17482376098633,in training set
C1=C2C([CH-]C23CC3)CC1,104.1738476753235,not in training set
OC1CC12C1C34[CH-]C13C24,104.08935251235962,not in training set
CCC(=O)C1(C)CC12CCC2,104.08446712493897,not in training set
CC1(C)C(=O)C1C1CCC1,104.06996135711668,not in training set
OC1/C=C\C=C/O/C=C\1,104.02616720199585,not in training set
CC1(C2CC2CC=O)CO1,103.99685306549074,not in training set
CC1(C)CCC1,103.97601108551025,in training set
OC12CCC3C14OC324,103.93270053863525,in training set
C1=CC2C3[CH-]C2C3[CH-]1,103.91381511688232,not in training set
C1CC2C1C1CC21,103.8791928291321,in training set
[CH-]1CC12C13CC21C3,103.84610023498534,not in training set
CCC1C=C(C)CC1,103.8374813079834,in training set
CCC1/C=C\C=C/C/C=C\1,103.8373773574829,not in training set
C#CCC1COC1(C)CO,103.82424125671386,not in training set
OC1C23CC12C31CO1,103.81202239990235,not in training set
COC1(C)CCC1,103.80943908691407,in training set
CC(C)C(C)CCC(=O)CO,103.80254325866699,not in training set
O=C1CC12C1CC3C1C32,103.61666259765624,not in training set
OC#CC1/C=C\C=C/C/C=C\1,103.60517024993896,not in training set
C#CC1CC1(C#C)CO,103.5911922454834,in training set
CC(C)C1(C)CCC1,103.55388927459713,in training set
OCC(O)C1(CO)CC1,103.55321159362792,in training set
OC1C2C3C=C[CH-]C2C13,103.5408452987671,not in training set
C1=CC2C3[CH-]C([CH-]1)C23,103.53089189529419,not in training set
CC12C(=O)CC1C2C#CC#CO,103.51098289489747,not in training set
CC1(C)CC12CCO2,103.48774280548096,in training set
O=C1C2CC3OC1C32,103.4431692123413,in training set
CC1(O)CC(C2CC2O)C1,103.38361625671388,not in training set
O=C1CC2C3CC12C3,103.36801490783692,not in training set
OCC1/C=C\C=C/C/C=C\1,103.3561894416809,not in training set
O=C1C2C3C4CCC13C42,103.33308601379395,not in training set
C1=C2CC3CCC23OC1,103.30446529388428,in training set
C#CC1C2C(=O)OC3C1C32,103.28999099731446,not in training set
CC1C2C3C2C2C1C32,103.27380008697511,in training set
CC1(OCC=O)CCCO1,103.2125925064087,not in training set
[CH-]1CC2C3C4[CH-]C12C3C4,103.21040687561035,not in training set
OC(O)C1C23C4OC2C413,103.1751395225525,not in training set
C1=CC2OC3C([CH-]1)C23,103.17371721267702,not in training set
C1=C2COCC2OC1,103.16596803665163,in training set
O=C1C2CCC3C1C23,103.1193507194519,in training set
O=CC12CCC1C(=O)C2=O,103.0988187789917,not in training set
O=C1C2C3C4OCC13C42,103.0548415184021,not in training set
O=C1CC2C3CC2(C1)C3=O,103.01477994918822,not in training set
CCOC(=O)C12CC1C1OC12C,102.88100833892823,not in training set
C1=CC2(CC2)C2(C1)CO2,102.84658699035644,in training set
OC12CC3C4CC(C1C4)C32,102.83115911483765,not in training set
C1=CC2=C(C1)C[CH-]C2,102.82518978118895,not in training set
O=C1CC2C1C21CCC1=O,102.79057111740113,not in training set
CC#CCC#CO,102.77514772415162,not in training set
O=CC1(O)C2CC3C2C31,102.6902214050293,in training set
O=C1OC2C3C(=O)C1C23,102.6758306503296,in training set
O=CCC(=O)CC1CCO1,102.66093559265136,not in training set
CC1C2OC1C2(C)CO,102.59952259063719,not in training set
O=C1C=COC2(CCO)CC12,102.52507972717285,not in training set
C1C2CC3C1C3C2,102.49719543457032,in training set
OCC#CC1C2C3C(O)C2C2C1C32,102.42404804229736,not in training set
CC12CC3C(CC1=O)C32,102.39234447479252,in training set
CC#CC1C23C4CC2C143,102.38237047195435,not in training set
OCC#CC1C2C3OC2C2C1C32,102.29176721572877,not in training set
O=C1C2CCC2C2C(=O)C12,102.28810882568361,not in training set
CC(C1(C)CCC1)C1(O)CO1,102.20052604675294,not in training set
COC1(C2OC2CO)CO1,102.18525695800781,not in training set
C1CC12C1C34CC13C24,102.10469360351563,not in training set
OCCC#CC#CC1(O)CC1,102.08866348266602,not in training set
CC1(C(O)C2(O)CCC2)CC1,102.05246391296386,not in training set
O=C1C2OC3CC(O)(C3)C12,102.03578739166261,not in training set
OC1CC23[CH-]CC2([CH-]3)C1,102.03420467376708,not in training set
OCCCC1(O)OC1CO,102.01800861358643,not in training set
CCC(C)OC,101.9298755645752,in training set
CC1=CCC2CC2CC1,101.91426925659181,in training set
COC1(C)CC1CC(C)C,101.89643440246583,not in training set
OC1CC12C[CH-]C1OC12,101.86814956665039,not in training set
CC1(O)CC2C3CC2C3C1,101.77691774368284,not in training set
C#CCC1(C)C2CCC21,101.72791013717652,in training set
C1=CC2OC3C(O1)C23,101.72417421340943,not in training set
CC(C=O)C1(C)C2CC1C2,101.67774925231934,not in training set
OC1/C=C\C=C/C/C=C\1,101.58203458786011,in training set
OCCC1(O)C23C4CC2C413,101.54814252853394,not in training set
CC1(C)CC2OCC21,101.53094310760498,in training set
O=C1CC12C1CC2C1,101.45042476654052,not in training set
CCC1(CC#CO)OC1C,101.4432243347168,not in training set
CCC1C=C2C3C45CC34C25O1,101.38881921768188,not in training set
OCC1OC12C1C34OC13C24,101.37158012390137,not in training set
COC1(C(C)C)CCC1,101.32742252349853,in training set
CC1=CC2CC2C12CCC2,101.30882225036622,not in training set
C1=CC23CCC2(C1)CC3,101.28646144866944,in training set
OC12CCC(O1)C21[CH-]C1,101.28295812606812,not in training set
CC1CC1(C)C1COC1,101.28098220825194,in training set
C1C2CC3OC1C1C2C31,101.26077966690065,in training set
OCCC1(O)C2CCC21,101.26060199737549,in training set
OC#CCC1(O)CCC12CO2,101.24794673919679,not in training set
CC1C2C3CC(=O)C1(C)C32,101.22908630371094,not in training set
OCC1OC=C2C3C45[CH-]C34C215,101.21582918167114,not in training set
COC#CC#CCO,101.19436197280884,not in training set
OC12C[CH-]C3COC1C32,101.18557929992674,in training set
C/C=C(/C(=O)CCO)C12COC3C=CC1CC32,101.10116634368896,not in training set
OCC(O)CC1C2C3CC3C12,101.08540325164796,not in training set
CC12CC3C4C[CH-]C4C1C32,100.98257074356079,not in training set
CCC1(C=O)CC1,100.96287879943849,in training set
CC12CC(CCO1)C2=O,100.93233966827391,in training set
CC#CC12CCCC(O)(C1)C2,100.8932397842407,not in training set
CC1C2CC3=C(CC=C3)C12,100.83939294815063,not in training set
OCCCCC1=CC(O)C2OC12,100.77861328125002,not in training set
CC12CC3C1C1([CH-]C1)C32,100.72235383987426,not in training set
OCC1=CCCC2CCC12,100.71092901229859,not in training set
C1=CC2=CC[CH-]C2C1,100.70215139389038,not in training set
O=CC(CO)C(O)CCCO,100.61658649444581,not in training set
CC1OC12C13CC12C3CO,100.56687488555909,not in training set
CC1C2[CH-]C3C4OCC24C13,100.54148149490356,not in training set
O=COC1C2OC3C1C23,100.5227071762085,in training set
CC(C)C1=CCC2(CC2)C1,100.50565071105956,not in training set
CC1C2C3OC3C3C2C13C,100.44387102127077,not in training set
CC1C(=O)C2CC3C(O2)C13,100.4398708343506,not in training set
OC12CC3CCC3C1O2,100.40243940353393,not in training set
O=CC1C2CC3C1C23,100.3305601119995,in training set
C#CC1(C#C)CC1,100.3088625907898,in training set
O=C1CCC12CCC2,100.30015659332275,in training set
O=C1C2CCC3CC2C13,100.23539752960207,in training set
CC#CC(C)CC,100.21394672393798,in training set
O=C1C2CCC3CC1C32,100.21169185638429,in training set
C1OC23OC4OC2C4C13,100.18440561294557,not in training set
C1=CC2[CH-]C(C=C1)[CH-]2,100.12019996643068,not in training set
OCCCC(O)C1(O)CCC1,100.11955127716064,not in training set
O=C1CC23COC2C1C3,100.11356372833252,in training set
C1=CC23CCCC2(C1)C3,100.06065778732301,in training set
CCC(C)C(C)C,100.0422010421753,in training set
CC1CCCC12CC2=O,100.00746669769288,not in training set
OCC1OCC(C(O)CO)O1,99.9970600128174,not in training set
CC1(C2CCC2)CO1,99.9673194885254,in training set
CC1(C=O)C(=O)C2CCCC21,99.9663815498352,not in training set
OC12CC(O1)C1CC2C1,99.92092847824097,not in training set
CC1C2C3OCC4C3C4C12,99.85906362533571,not in training set
CCCC(=O)CCCC(C)=O,99.84563331604004,not in training set
OC1CCC12C1CCC12,99.831618309021,in training set
CC1CC=C2C=CCC21,99.8311327934265,in training set
COC1C23C4CC2C413,99.73601713180543,not in training set
OC1CC2CC1CO2,99.68266353607179,in training set
C1CC2C3COC1C23,99.65808906555175,in training set
CC12C3OC1C2C1COC13,99.64693708419799,not in training set
C#CC1OC1C1C2CCC21C,99.55896234512329,not in training set
COC12CC3C1C2C1CC13O,99.49789199829101,not in training set
C1=C\C/C=C\C\C=C/1,99.49190759658813,in training set
COCC#CCC(C)=O,99.45575361251832,in training set
CC12OC3C4C3C1(C#CCCO)C42,99.41841087341308,not in training set
CC1(C#CC#CC=O)CC1,99.3705015182495,not in training set
CC1(CC#CO)C2CCC21,99.34718780517576,not in training set
OCCCC12C3CC1(O)C1C(O3)C12,99.34520196914673,not in training set
C1OC2(O1)C13CC12O3,99.27961893081667,not in training set
CC(C=O)C12CC3C(=O)C3C1C2,99.21205911636352,not in training set
CC1(C)C2OC3CC2C31,99.21020278930665,in training set
O=CC1C23CC12C31CC1,99.20285997390748,not in training set
OC12CCC1C21[CH-]CC1,99.1597960472107,not in training set
CC12C[CH-]C3C1[CH-]CC32,99.1340989112854,not in training set
O=CC(=O)C1=CCCC12CO2,99.11255397796631,not in training set
CC12CC(C)(C1)C1CC12,99.09963874816897,in training set
CCC#CC(=O)CC1CC1,99.07754669189453,not in training set
O=C1C2C3CCCC3C12,99.04331340789794,not in training set
C#CC#CC1OC2C34OC23C14,99.03750743865966,not in training set
CCCCC(=O)C(O)OC,98.99888343811034,not in training set
CCC(CO)C(OC)OC,98.98932933807374,not in training set
C1C2C3CCC34C1CC24,98.77570896148681,in training set
O=C1CC(C2=CCC3(CC3)C2)C1,98.70549983978272,not in training set
OC1(C2CCC2)COC1,98.60272655487061,in training set
[CH-]1OCC2CC3C1C23,98.59360914230348,not in training set
C#CC#CC(C#C)CC=O,98.56814699172975,not in training set
CCC1C23C4C5(CC5O)C2C143,98.4540738105774,not in training set
CC1C2C(=O)C3C2COC13C,98.44041538238524,not in training set
CC(=O)C12CCC3C(C1)C32,98.43756065368652,not in training set
O=C1C=CC2CC23COC13,98.38738107681273,not in training set
CC12CCC(OC1)C2O,98.38496856689449,in training set
CC1CC2C(C#CCO)C12,98.3731195449829,not in training set
CCC12CC(O1)O2,98.36439027786254,not in training set
COC12C3CC4C(CC31)C42,98.31873722076415,not in training set
COC(=O)C12CC3C4OC4C1C32,98.27399425506593,not in training set
CC12[CH-]C=CC3OC3C1C2,98.21050910949705,not in training set
CC(C)CC(C)C=O,98.20213985443115,in training set
CC(C)C1(C2CO2)CC1,98.11332111358642,in training set
CC1C2CC(=O)C1C1C(C)C21,98.09942550659179,not in training set
O=C1C(=O)C2OC1C1CC21,98.04811754226685,not in training set
CC1CC2C3CC1(C)C23,98.02537050247192,in training set
CC(CO)COC1(C)CO1,97.9797824859619,not in training set
CCC(=O)C12CC3C4CC4C1C32,97.9677635192871,not in training set
CCC(O)C#CCCC=O,97.91580181121827,not in training set
O=C1CC2CC3CCC132,97.8516046524048,in training set
CC12CCC3C4C3C1(C)C42,97.83140840530396,not in training set
CC12COCOC(C1)C2=O,97.7422052383423,not in training set
CC(O)C1CC2CC1C1OC21,97.73638010025024,not in training set
CC12OC3CC1C3C2C=O,97.60815200805663,not in training set
CC1(C2CC(O)C2)CCO1,97.51667900085448,not in training set
OCOC12CC3C(CC31)O2,97.47930307388305,not in training set
CC1C2CC1(C)C21CC1,97.46256055831908,in training set
C1OCC2C1C1CC21,97.40782146453857,in training set
O=CC1=C2CCC2CC1,97.29880771636964,in training set
C1=C2CCC2OCCC1,97.2775447845459,in training set
OC1CCCC2C3CC2C13,97.2108286857605,not in training set
COC1C(O)C2CCC21,97.19515457153321,in training set
OCCCC12C3(CO3)C3C14CC342,97.13847980499267,not in training set
OCC1CC2(C1)OCC2O,96.98029956817628,not in training set
OC12CC3(CC4CC13C4)C2,96.85100288391114,not in training set
C1OC2C1CC21CO1,96.78935623168947,in training set
CC12CCCC1C1(O)CC21,96.78822546005249,not in training set
CCC(C)C1(C)CCC1,96.7768381118774,in training set
CC(CCCCO)C(=O)CCO,96.76584510803221,not in training set
C1OC2CC1C2,96.60613851547242,in training set
OCC12C3[CH-]CC1C2CC3,96.57757244110108,not in training set
CCC1(OC)CC1,96.49805793762212,in training set
COC(C)C(C)C1CC1,96.46468887329101,in training set
CC12COCC1C=CO2,96.18201293945312,not in training set
[CH-]1CC2([CH-]C3CCC32)O1,96.13630809783935,not in training set
CC(O)CCC(=O)CCCCO,95.95562801361083,not in training set
CC12C(CCCO)C1C1OC12,95.92091798782347,not in training set
CCCC(=O)C1CC2(C(C)C)OC12,95.86668701171875,not in training set
CC12C(O)C1CC21CCO1,95.73189649581909,not in training set
CC12CCC3CCC1C32O,95.60738086700441,not in training set
CC1C[CH-]C2COC=C12,95.56777372360229,not in training set
OC1(C2CC2)OC1C1CC1,95.39731636047364,not in training set
O=C1OC2CC3C1CCC23,95.32048168182372,not in training set
COC1C2C3CC4C1C4C32,95.26527891159058,not in training set
CCC12CC3C4CCC4C1C32,95.2489031791687,not in training set
CC1OCOC2OC12,95.19372892379762,not in training set
CC1C2CC3CC3C1C2,95.14164648056031,in training set
CCC1(O)C(C)C2COCC21,95.04790325164795,not in training set
CCOC1CC1(C=O)CC,94.92299156188963,not in training set
OCCCCC12OC3C14[CH-]C324,94.88343467712403,not in training set
CCCC(OC)C(C)C(=O)C(C)O,94.74173603057862,not in training set
OCCCC(CO)CO,94.64748191833496,in training set
COC1[CH-]C(O)C2COC12,94.49683418273925,not in training set
O=CC(C=O)C12CC3C(CO1)C32,94.43778800964355,not in training set
C1=C\CC[CH-]CC\C=C/1,94.4222324371338,not in training set
O=C(CO)CC1CCC1,94.23506565093999,in training set
OC1CCCCC2OC12,94.1779062271118,in training set
CC1(C)CCC2CC1O2,94.00718841552734,in training set
CC12CCOC3C1C3(C)C2,93.67124671936035,not in training set
CC#CCC1CCC2(O)CC12,93.56484622955321,not in training set
COC1OC1C1C23CC12C3,93.50708408355715,not in training set
CCC1(C)CC1,93.4232109069824,in training set
CC12CC3CC4(CC1C4)C32,93.22239313125611,not in training set
CCC(=O)C1CCCCO1,92.95017852783202,not in training set
OCCCC1OC1C1C=CCC1,92.81182088851928,not in training set
CC12CCCCC(O1)C2O,92.78761177062988,not in training set
C1=C\CCCCC\C=C/1,92.58694992065429,in training set
C1=C\COCC[CH-]C/1,92.51624593734742,not in training set
CC1C2OC3(CCC3)C12,92.43287115097046,in training set
O=CC1CCC2C3CC1C23,92.36575546264649,not in training set
CCC1(C)CC1C1CC1,92.05953311920167,in training set
OC1(O)CCC2CCC1C2,91.9580750465393,not in training set
OCC12CCC3(CC3)C1C2,91.8729944229126,not in training set
CC12CC(C1)CC1(C)CC21,91.50181922912599,not in training set
C1COC1,91.46393728256224,in training set
CC(O)C12COC(CCCC1=O)C2,91.28468532562255,not in training set
COCC1=CCCC2CC12,91.2693510055542,not in training set
COC#CC12CCC3C1CC32,91.13512544631956,not in training set
C1=CC2(CC2)CO1,91.10124235153198,not in training set
C#CC#CC#CC(C=O)CC=O,90.75219478607177,not in training set
OCCCCC1C23CC12C3,90.65374736785887,not in training set
C1OC1C1CCC12CO2,90.12383460998532,in training set
C1=CC2CC(CO1)O2,90.04420843124389,not in training set
O=CC1(CC2CC2)OCO1,90.04323749542236,not in training set
COCC12CC3C4[CH-]C4C1C32,89.55599861145019,not in training set
COC(=O)C12CC3CCC1OC3C2,89.55436973571777,not in training set
C1C2CC1C1CC1C2,89.54687013626098,in training set
C1=CC2=CCCC2CC1,89.41143350601199,in training set
C1CC2CC3CC3C2C1,89.35838346481324,in training set
COC12CCCC1C1OC12,89.32789945602416,not in training set
CCCC12C=CC3(C1)OC3O[CH-]2,89.30494146347047,not in training set
C#CC#CCCC,89.07225532531739,in training set
C1CC2CCC1C21CO1,89.03623809814454,in training set
CC1OC1C1(C)CCOC1,88.69107818603517,not in training set
CC12CC3CC(C1)C3(C)C2,88.50527706146241,not in training set
CC1(C)CC2CCC1C21CC1,88.47404918670655,not in training set
CC1C/C=C\CCCC1,88.27508745193481,in training set
O=CCC1CC1OCCO,88.1856328010559,not in training set
CC1CC2CC3CC3(O1)O2,88.08370199203492,not in training set
CC1CC(C(O)C2(C)CC2)C1,87.98210449218749,not in training set
CC#CCC(C)CC#CO,87.96005964279175,not in training set
CC(=O)C12CC1CCCCO2,87.77602577209473,not in training set
C1CC23CCC12CC3,87.68569717407227,in training set
CC(C1CO1)C1C23CC12C31CC1,87.48167047500611,not in training set
COC1OC23CCCC12O3,86.89298524856568,not in training set
CCOC12CCCCC1C2=O,86.77596235275269,not in training set
CCC1(C2OC2O)CCC1,86.5015516281128,not in training set
O=C1CC1C12CCC(C1)C2,86.31612281799315,not in training set
CCC1OCCOCC1(C)C,86.00682878494261,not in training set
OCCCCC1CC2C3OC1C23,84.6210922241211,not in training set
CC1[CH-]CCC2[CH-]C2C1,84.58854885101319,not in training set
CCC(C#CC1OC1=O)C1CCO1,84.40970525741577,not in training set
C1CCOC1,83.42631349563598,in training set
OCCCCCC1OC1O,82.60643911361696,not in training set
O=CCCCC1(C=O)CC1,81.12966766357422,not in training set
CC(C)OCC1CC1C,80.4443254470825,in training set
C1CC2(C1)CC2,80.44222917556763,in training set
CCC1(C)CCC2(CO2)C1,80.00609226226806,not in training set
OCCCCCC1OC1(O)CCCCO,79.22893896102906,not in training set
[CH-]1CC12CC1([CH-]CC1)C2,79.20612974166869,not in training set
CC1CC(O)OC2(CCC2)C1,79.06112937927246,not in training set
C1COCO1,78.51266860961914,in training set
COCC(=O)C1CCCOC1,77.85622100830078,not in training set
COC12CCC(CC1)C2,76.67495355606079,in training set
C1OC1COC1C23CC12C3,76.32932786941528,not in training set
CC(=O)CCCCCOC=O,75.41250438690187,not in training set
C1COCC2CC2C1,74.978666305542,in training set
OCCCCCCC12CC1C1[CH-]C12,74.56520071029662,not in training set
CCCCCc1cc2c(o1)[CH-]C1[CH-]C21,74.5076189994812,not in training set
CCC(C)C(C)C1CC1,74.44952487945555,in training set
OCCC1CC(C2CO2)CO1,74.39622192382812,not in training set
CC1CCOCCO1,71.556210231781,in training set
COC(CC1CC1C1CO1)OC,69.31692123413086,not in training set
C#CC(CCC#CC)COC,69.11728811264037,not in training set
CC(C)CC1(C)CCC1,67.60185890197755,in training set
CC1(CCCCCO)CC1,66.42301092147827,not in training set
CCC(CO)CC#CCCOCO,66.1341567993164,not in training set
CCCCOC1(C)CC1C,65.30334138870238,not in training set
COC1CC1CC1COC1,64.67585954666137,not in training set
COCCC(C)C(O)C1CO1,64.54981632232666,not in training set
CCCCCCC1(O)OCC1CO,64.13005275726317,not in training set
O=CCC12CCCC(CC1)C2,61.43699684143066,not in training set
O=COCCCC1CO1,58.50846252441408,in training set
C1CC(C2CCC3CC3CO2)C1,57.653615570068354,not in training set
CC(C)CC(C)C1CC1,56.43309535980223,in training set
CCCC(=O)CCOC1CC12CCO2,55.35702266693116,not in training set
C#CCCC1CCC1COC,55.080510711669916,not in training set
CC#CCCCCC1CCO1,37.540355396270755,not in training set
CCCCOCCOC(C)O,31.930583477020264,not in training set
CCCCCC1CCC1,7.399487686157228,in training set
CC1(C23CCOOOC2CC3)CO1,0,not in training set
COCCCCC#COOC,0,not in training set
CC1(C2(O)COC2)CCOOCO1,0,not in training set
CC1(C2OO2)CC1O,0,not in training set
OCC1(O)OOC2(CC2)O1,0,not in training set
OCC#CCC1C2OOC12,0,not in training set
CC1=CCC2OOC(C1)O2,0,not in training set
CC12C3(OO3)C3C14CC342,0,not in training set
O=CCC1(O)CC2(CC2)OO1,0,not in training set
OCC1COOC12CO2,0,not in training set
O=C(CO)C1=CCC[CH-]C12OO2,0,not in training set
C1=CC2(CCC2)OOC1,0,not in training set
C#CCC1(O)OOCC1=O,0,not in training set
O=C(CC1OO1)C(O)CCO,0,not in training set
COOC1(C)CC1(C)C,0,not in training set
CC1OOC1C(C)(C)C=O,0,not in training set
CC1(C2(C)OO2)CC1,0,not in training set
C1COO1,0,not in training set
C1OOC2C3CC2C13,0,not in training set
COOC(C)C1CC1(C)C,0,not in training set
COOC(C)=O,0,not in training set
C#CC1(C)CC1OOC,0,not in training set
C1CC2C3OOC1C23,0,not in training set
COC1C23C4C5(O)OOCC52C143,0,not in training set
COOC(C=O)C=O,0,not in training set
CC(O)OO,0,not in training set
OCCC1C23C4C5(OO5)C2C143,0,not in training set
CC(=O)OOC=O,0,not in training set
CCC(=O)OOC(C)C(C)O,0,not in training set
COOC=O,0,not in training set
OC1C=CCC12[CH-]OO2,0,not in training set
COCC(C)C(C)C1OO1,0,not in training set
CC(C)C(C)OOC(C)C(C)O,0,not in training set
OCCCCC1C23C4OOC2C143,0,not in training set
C/C=C(C)/C(=C\C)C(O)C(=O)C(=O)C(O)C1(O)OO1,0,not in training set
C#CC1(O)OO1,0,not in training set
COC1OO1,0,not in training set
CC(C=O)OO,0,not in training set
C1=COC2OOC2C1,0,not in training set
CCC1(C)OOC1=O,0,not in training set
O=COOC(=O)C=O,0,not in training set
COOC1(C)CCC=C1C,0,not in training set
