CC(C)(C)C1C(=O)C1O,121.13636589050294,not in training set
CC(C)(C)C(C=O)CO,121.10098285675048,in training set
CC1(C)CC(=O)C1(C)O,119.3048776626587,in training set
CC1(C)C2C(C)(O)C21C,118.72624511718752,not in training set
CC(=O)C1C(C)C1(C)C,118.69211807250974,in training set
CCC1C(=O)CC1(C)C,118.0261194229126,in training set
CC1(C)CC2(O)C(=O)C12,117.32212524414064,not in training set
CC1(C)CC(=O)CC1O,117.29353618621826,in training set
CC(O)C(C)(C)CC=O,117.19319152832033,in training set
CCC12C(=O)C1C2(C)C,117.14370574951172,not in training set
COC1(C(C)C)CC1=O,116.62786521911622,not in training set
CC1(C)CC(O)C1C=O,116.60811614990236,in training set
CC(O)C1C(C)C1(C)C,116.48351459503174,in training set
CC1(O)CC1(C)CC=O,116.47566070556643,in training set
CC(CC=O)C(C)(C)O,116.39714317321777,in training set
CC1C(C)(C)C12CC2=O,116.17453975677489,not in training set
CC(=O)C12CC1(C)C2C,116.00826511383057,not in training set
CCC1(OC)C(=O)C1C,115.74071998596192,not in training set
CC(O)(O)C1(C)CC1=O,115.6681116104126,not in training set
CC1C23C(=O)C12C3(C)C,115.32634239196777,not in training set
CC1(O)C2(C)C3(C)CC132,114.98960876464845,not in training set
CCC1C(O)CC1(C)C,114.8692770004272,in training set
CCC1(C(C)=O)CC1C,114.70736370086667,in training set
CC(C)(O)C(C=O)CO,114.3072624206543,in training set
CC12CC(=O)CC1(O)C2,114.19889469146726,in training set
CC1C(CO)C1(C)C=O,114.08703308105468,in training set
CC(CC=O)C(C)(O)O,113.87221698760987,not in training set
CCC1(C(C)C)CC1=O,113.67013130187988,not in training set
CC1(CO)C(=O)C1CO,113.61246814727784,not in training set
CCC(C(C)=O)C(C)C,113.60126895904546,in training set
CC1(C)COC12CC2=O,113.56055030822755,not in training set
CC1C2C(=O)C1C2(C)C,113.11731452941898,in training set
CC1(C)CCCC1(C)O,113.03656387329099,in training set
CC(O)C12CC1(C)C2C,112.90349140167235,not in training set
CC1(C)CCC12CC2=O,112.41068592071532,not in training set
CC1(C)COCC1C=O,112.08484020233158,in training set
CC(C)C12C(=O)C1C2C,112.03580780029297,not in training set
CC(C)C1C(=O)CC1C,111.9969615936279,in training set
CC1C(C)C2(O)C(=O)C12,111.75385150909423,not in training set
CCC1(C(C)C)OC1=O,111.7105157852173,not in training set
CC(C)C(C=O)C(C)O,111.48677768707275,in training set
CCC(C(=O)O)C(C)C,111.34712104797364,not in training set
CC(C=O)C(C=O)CO,111.22475776672364,in training set
CC(C)C(C=O)C(O)O,111.16206092834472,not in training set
COC12C(=O)C1CC2C,111.05720291137696,not in training set
CC1C(C)C(C=O)C1O,110.86944236755375,in training set
COC1C(C)CC1C=O,110.59779777526856,in training set
CC1(C2C(=O)C2O)CC1,110.11536521911621,not in training set
CC12CC1C1(O)C(=O)C21,109.76993560791017,not in training set
CC1(C)COC2C(=O)C21,109.6362840652466,not in training set
CC1C2C(O)C1C2(C)C,109.5073072433472,in training set
CC1(C(C=O)CO)CC1,109.16609859466557,in training set
CC12CC1C(O)C2C=O,109.06531295776368,in training set
CC1C(CO)C12CC2=O,109.06261100769044,not in training set
CCC(C(C)C)C(C)O,108.67415637969971,in training set
CC(C)C1C(C)CC1O,108.5614059448242,in training set
CC12CC13C1(O)C#CC123,107.18382682800294,not in training set
CCC(C)C1C(=O)C1O,107.00326595306397,not in training set
CCC12C(=O)C1CC2C,106.9710624694824,not in training set
CC12CC13C(=O)C#CC23,106.28376502990723,not in training set
CC1COC(O)C1C=O,106.0405330657959,not in training set
CC(=O)C1CCCC1C,105.33348617553712,in training set
CC1CCC(O)C1C=O,105.31174507141114,in training set
CC12COC13C(C=O)C23,105.11397686004639,not in training set
CC12COC13C(=O)C3C2,104.92341594696045,not in training set
CC12CCC3C14C(=O)C324,104.4415126800537,not in training set
CCC(CO)C(C)C=O,104.22479553222652,in training set
O=C1C2C3OC4C3CC142,103.91765794754029,not in training set
CC(C=O)(CO)CCO,103.75422954559329,in training set
CC12COC1C(C=O)C2,103.67436485290524,in training set
CC12C3OC14C(=O)C4C32,103.59622154235839,not in training set
CC12C3CCC14C(=O)C342,103.44812135696411,not in training set
CCC1C(C)C2C(=O)C12,102.95259304046631,not in training set
CC12CCCC13C(=O)C23,102.64540462493895,not in training set
CCC(CO)C1CC1=O,102.5443292617798,not in training set
CC12C3OC1C2C3C=O,102.23214759826661,in training set
CC1OCC2(C)C(C)C12,101.99604816436766,in training set
CCC(C)C(C=O)CO,101.99111957550048,in training set
COC1C(C=O)C2CC21,101.8907078742981,in training set
CC1C2OC13C(C=O)C23,101.5629204750061,not in training set
O=C1C2C34COC12C3C4,101.56105585098265,not in training set
CCC12OCCC1C2=O,101.18094863891602,not in training set
CC1C2COC13C(=O)C23,101.04435930252076,not in training set
CC12COC34C1C3(C)C24,100.97957735061647,not in training set
CC1C2CC1C2(C)CO,100.91332473754883,in training set
CC1COC12CC2C=O,100.59729309082032,in training set
CC1C2CCC13C(=O)C23,100.58951482772827,not in training set
O=CC1C2OC3C14CC234,100.5832718849182,not in training set
CC1(CO)C2C3CC2C31,100.4717891693115,in training set
CC1CCC2C3C(=O)C123,100.2040862083435,not in training set
C1OC23CC45CC1(C42)C53,100.17737684249877,not in training set
CC1CCCC12CC2=O,100.00746612548829,not in training set
CC12COC34CC(C13)C24,99.65726823806763,in training set
CCCC1C(=O)C1OC,99.32466945648194,not in training set
CC1C2CC(C=O)C1O2,99.20293989181518,in training set
CC1CCCC12OC2=O,99.20090370178221,not in training set
O=CC1C2CC3C1OC23,99.06497344970703,in training set
CC1C2COC1C2C=O,98.73641891479492,in training set
CC1C2C3OCC2(C)C13,98.23527317047117,in training set
O=C1C2OCC3(CC3)C12,98.07342596054077,not in training set
O=CC1C2OCC13CC23,97.62508850097656,not in training set
CCC1CCC1(C)CO,97.18604831695556,in training set
O=CC1C2CC23COC13,97.01487560272216,not in training set
CC1CCCC2C(=O)C12,96.67760314941407,not in training set
CC1(CO)CC2CCC21,95.76959877014158,in training set
C1OC23CC4CC1(C2)C43,95.70502977371217,not in training set
CCC1COC2C(=O)C12,95.38343620300293,not in training set
CC12COC3(CCC13)C2,95.28429059982301,in training set
CCC1C(C)COC1C,94.4084629058838,in training set
CCCC(=O)CC(C)C,94.16374435424807,in training set
CCC1C2CC1(C)CO2,94.16234664916992,in training set
CC(CO)C1CCC1C,93.84461231231688,in training set
CCC(CC)C1CC1=O,93.79274005889894,not in training set
CCC1CCC2C(=O)C12,93.69612035751342,not in training set
O=CC1C2COC1OC2,93.56221294403076,in training set
CC(CO)C1C2CC1C2,93.08982124328614,in training set
O=CC1C2CCC1OC2,91.84009342193605,in training set
O=CC1COCC12CC2,90.64467449188231,in training set
CC1COC2CC(C)C12,90.50376787185668,in training set
CCC1OCCC1C=O,89.53199472427369,in training set
CCC1COCC1C=O,86.92344818115235,in training set
CCC(CC)C(C)CO,85.94573230743407,in training set
CCCC(C)C1CC1=O,85.37410202026368,not in training set
CC(CO)CC1CCC1,65.5672043800354,in training set
CCCCCC1OC1=O,59.21851148605346,not in training set
CCCCCC1CC1=O,54.06104907989503,not in training set
