CO,127.46741638183593,in training set
CC1CC1,126.59496612548828,in training set
C1CC1,125.76926269531249,in training set
OCO,123.52560729980468,not in training set
C[C@@H]1CO1,122.86559314727783,not in training set
CCO,122.33616199493407,in training set
O=CC1CC1,122.12982463836671,in training set
CC,122.07426662445067,in training set
COC,122.01034755706789,in training set
CCC,121.1877944946289,in training set
OC1CC1,120.72170486450194,in training set
O=C1CC1,120.53803596496581,not in training set
O[C@@H]1CO1,120.40039596557618,not in training set
CCC=O,119.04549293518062,in training set
OC(O)O,119.02149066925048,not in training set
C1CCC1,118.81182823181152,in training set
COCO,118.67428264617921,not in training set
CC(O)O,118.56423435211182,not in training set
C#C[C@H](C)OC,118.47129917144775,not in training set
O=CO,118.19040813446045,not in training set
CC=O,117.7987997055054,in training set
C=O,117.13716430664063,in training set
C1=CCC=C1,116.89552640914917,not in training set
CCCO,116.47468280792238,in training set
O=CC(O)O,116.27159976959229,not in training set
O=COC=O,116.2571451187134,not in training set
CC(C)O,116.15202426910396,in training set
OC1CCC1,115.99332313537597,in training set
C1=CCCC1,115.9252060890198,in training set
O=C(O)O,115.78713626861573,not in training set
O=CC=O,115.6621503829956,in training set
CC1(O)CC1,115.1036470413208,in training set
CC(C)=O,115.07035312652589,in training set
C#CCOC,114.7138677597046,in training set
COC(C)(O)O,114.50621948242188,not in training set
O=C=O,114.26173477172853,not in training set
OC(O)(O)O,114.24864597320558,not in training set
OCCO,113.9857679367065,in training set
C#COC,113.93183193206787,not in training set
COC(O)(O)O,113.89573974609375,not in training set
C#CO,113.80014743804931,not in training set
OCC(O)O,113.44170799255372,not in training set
C1[C@H]2O[C@H]12,113.35909156799318,not in training set
C1[C@@H]2O[C@H]12,113.3590913772583,not in training set
CC1CCC1,113.24099597930908,in training set
O=C1CO1,113.11870174407959,not in training set
OC1CCCC1,113.09548225402835,in training set
O=CC#CC=O,112.72426700592041,in training set
C#C[C@H](C)C(C)C,112.53829097747801,not in training set
C[C@@H]1CCO1,112.44843463897706,not in training set
C1=CCOC1,112.43666152954103,in training set
OC12CC(C1)C2,112.33298110961914,in training set
C#CCC,112.20605974197389,in training set
CC1(C)CC1,111.98214721679685,in training set
C1C23CC12C3,111.69183502197266,not in training set
CC1(C)C=CCCC1,111.6854049682617,in training set
C#COCO,111.1447732925415,not in training set
C#CC1(O)CC1,110.72566785812381,in training set
O=C[C@H]1C=CCCC1,110.62763986587525,not in training set
C1=CC[C@@]23O[C@@H]2C=C[C@@H]3C1,110.59856929779052,not in training set
C#CC1CC1,110.31390867233276,in training set
CC(C)C,110.18491592407227,in training set
C1=C[C@H]2CCCC=C2[C@@H]2C[C@@H]12,110.06466836929323,not in training set
O=CO[C@@H]1CC(=O)CO1,109.8657238006592,not in training set
C1=C[C@@H]2C[C@H]2[C@H]2C[C@H]12,109.66878147125244,not in training set
O[C@@H]1C=CCCC1,109.42468528747558,not in training set
OCOCO,109.19308261871336,not in training set
CC(=O)[C@@H]1C[C@H]2O[C@]21O,109.13585491180422,not in training set
C#CC1(C=O)CC1,108.98805294036866,in training set
C#CCC[C@H](C)O,108.59875392913818,not in training set
O=C1C=CCCC1,108.52986679077148,in training set
C1=CCCCC1,108.4250943183899,in training set
O=C1[C@H]2C=C[C@H]3O[C@H]3[C@H]12,108.1938000679016,not in training set
C1CO1,108.12136106491091,in training set
C#CC,108.10959014892578,in training set
C[C@]12C=CC(=O)[C@@H]1CO2,108.02465362548827,not in training set
C#COCCO,107.95978107452393,not in training set
CCCC=O,107.91096725463869,in training set
CC12C=CC(C1)C2,107.81641006469727,in training set
C1=C[C@H]2C=CCC3(CC3)[C@H]2CC1,107.64847545623779,not in training set
C1=C[C@H]2C[C@H]2C1,107.63471689224244,not in training set
C1=CC2=C[C@H]3C=CC[C@H]3[C@H]2C1,107.30840606689455,not in training set
C[C@@H]1C=CCCC1,107.18452777862548,not in training set
C[C@H]1C=CCCC1,107.1845272064209,not in training set
C1=C[C@@H]2O[C@@H]2C1,107.05975532531738,not in training set
C1=CC2CC1C2,106.99652633666993,in training set
CC#CC,106.78813610076904,in training set
O[C@@H]1C=CCCCC1,106.60020923614502,not in training set
CC[C@@]12O[C@@H]1[C@@H]2C,106.3441806793213,not in training set
C1=C[C@@H]2C[C@@H]2CC1,106.33166179656982,not in training set
OC12CC3[C@H]1C[C@H]32,106.24265832901,not in training set
C1=CC[C@@H]2C[C@H]2C1,106.24072027206421,not in training set
C1=CC[C@H]2C[C@H]2C1,106.24071950912476,not in training set
C1=CC[C@H]2C[C@@H]2C1,106.24071941375732,not in training set
C1=CCC2CC=CCC2C1,105.8617811203003,not in training set
C[C@]12CC=CC[C@H]1C2,105.8517285346985,not in training set
C1=CC2C=CCCC2CC1,105.57429370880126,not in training set
C1=C2[C@@H]3O[C@@H]3C[C@H]2CC1,105.4701498031616,not in training set
C[C@H]1C=CC[C@@H]2C[C@@H]21,105.31882762908936,not in training set
O=C1C=CC23CC2(C1)C3,105.2899709701538,not in training set
C#CC12CC1C2,105.24250802993775,not in training set
C[C@H]1CC=CCC1,105.17310914993286,not in training set
C[C@@H]1CC=CCC1,105.17310886383058,not in training set
O=C1C=C2[C@@H]3O[C@]23C1,105.1720630645752,not in training set
C1=C[C@@]23C[C@@H]2[C@@H]3CC12CC2,105.09100379943847,not in training set
O=C1[C@H]2C=C3O[C@H]3[C@H]12,105.06948385238648,not in training set
C1CCC2=C(C1)C2,105.02132053375243,not in training set
C[C@H]1C=C[C@@H]2C[C@H]2C1,105.0206624031067,not in training set
COCOCO,104.70173139572142,not in training set
O=C1C[C@@]12C=CCCC2,104.6926326751709,not in training set
C1CC12CC2,104.58701248168946,not in training set
C1CCCC1,104.54906978607178,in training set
C[C@]12C=CCC[C@H]1C2,104.49045238494872,not in training set
O=C[C@@H]1C2=C[C@H]3O[C@H]3[C@@H]21,104.46318626403809,not in training set
C[C@@]12C[C@H]1CC=C1C[C@@H]12,104.33207921981811,not in training set
C#C[C@H]1[C@@H](C=O)C12CC2,103.94828348159791,not in training set
C[C@H]1CC=CC23CC12C3,103.92291536331176,not in training set
O=C1C[C@@]12C=C1O[C@@H]1C2,103.81587524414064,not in training set
O=C1CCC=CC2(CC2)C1,103.7653720855713,not in training set
C1C[C@H]2C[C@H]1O2,103.45815973281861,not in training set
O=C1C=CC[C@@H]2C[C@H]12,103.40394344329835,not in training set
C#COCCC,103.30467920303346,not in training set
O=C1C2=C[C@@H]3O[C@@H]3[C@H]12,103.3008876800537,not in training set
CCOCCO,103.1726640701294,in training set
C1=CCOC=C1,103.04605045318604,not in training set
C1=C2C[C@]23CC[C@H]1C3,103.03445682525636,not in training set
C#CC1[C@H]2CC[C@H]1O2,102.68402118682863,not in training set
CC(C)[C@@H]1C=CCCC1,102.51213626861572,not in training set
C1CC1OC1CC1,102.44072427749634,in training set
O[C@@H]1COCCO1,102.21110973358155,not in training set
C#COC1CC(C)C1,102.08224296569823,not in training set
O[C@@H]1CC[C@]2(CO2)O1,101.90733585357667,not in training set
C1=CC[C@]2(CC1)CO2,101.8405468940735,not in training set
OCOCOCO,101.36463527679442,not in training set
CC1=CCCCCC1,100.83516321182252,in training set
OC12CCOC(C1)C2,100.7765253067017,in training set
CC1CCCC1,100.64772548675536,in training set
OCO[C@]1(O)CCCCO1,100.32079315185547,not in training set
C1=C[C@]2(CCC1)CO2,100.14767446517945,not in training set
C#CC#CC,100.0539478302002,in training set
CC[C@@]12CCC=C[C@@H]1C2,99.55911769866943,not in training set
C1O[C@@H]1C1[C@@]23C[C@]12O3,99.24666013717652,not in training set
O=C1C=CC[C@@]2(CC=CCC2)C1,99.05169010162352,not in training set
C1CC12C[C@@]21CO1,98.92128458023072,not in training set
C1=C2[C@@H](CCC1)C[C@H]1C[C@@H]21,98.91611633300782,not in training set
C[C@]1(O)C[C@]12COCO2,98.89855976104735,not in training set
C[C@@]12CCC3(C=C1C2)CC3,98.65944051742554,not in training set
CC[C@@H]1CC=CC23CC12C3,98.59017143249513,not in training set
C1C[C@@H]2C[C@H]3C[C@H]2[C@@H]13,98.41277980804445,not in training set
C#C,98.08467798233032,in training set
OC12CC(C1)C21CCC1,97.63569555282594,in training set
CCCC,97.62277984619138,in training set
C1=CCC2(CC2)C2(C1)CC2,97.61965007781983,not in training set
C1=C[C@@]2(CCC1)C[C@@]21CO1,97.11107273101806,not in training set
C[C@]12CCC13CC2C3,97.03915758132933,not in training set
COCOC,96.83332061767578,not in training set
C1=CCCCCC1,96.64424018859863,in training set
CC[C@]1(OC)CCO1,96.18954124450683,not in training set
O[C@@H]1OCC2CC1C2,96.04485216140746,not in training set
C1=CCC2(CC1)CC2,96.04006538391114,in training set
O=C1O[C@@H]2C[C@H]1[C@@H]1C[C@@H]1O2,95.56624946594238,not in training set
CC1(OC2CC2)CC1,95.01842708587645,in training set
C1CC1CC1[C@@H]2C[C@H]12,94.92739057540894,not in training set
OCCO[C@]12C=C[C@@H](CC1)C2,94.86250743865966,not in training set
O[C@]12CCOC[C@@H](C1)O2,94.8069909095764,not in training set
C1=CC2(CCC1)CC2,94.70745592117308,in training set
C1=CC2(CC2)C[C@]2(C1)C[C@@]21CO1,94.70333375930787,not in training set
O=C1C[C@@H]2CO[C@@H](C2)O1,93.7172727584839,not in training set
OC(O)C1CCOCC1,93.35530281066895,not in training set
C1=CC2(C=CCCC2)CCC1,92.51417779922485,not in training set
C1CC2(C1)CO2,92.42878828048705,in training set
CC[C@]1(C)CCO1,92.34672241210937,not in training set
C1CC2(C1)O/C2=C1\CCO1,91.85716409683226,not in training set
C1COC1,91.46393728256224,in training set
C1C2CC1C2,91.42419757843018,in training set
C1=CC=CC2(C=C1)CC2,89.69924249649047,in training set
C1=CC2(CC2)CC2(C1)CC2,89.52294521331787,not in training set
C1=CCOCCCC1,89.3748601913452,not in training set
C1CC2(CCO2)O1,89.18288288116456,not in training set
OCOC1CCC1,88.84758262634278,not in training set
C[C@]1(O[C@H]2CCO2)CCO1,88.4185914993286,not in training set
C1CC1[C@@H]1C[C@]12O[C@@]21CO1,88.14376544952393,not in training set
C1=CCCC2(CC1)CC2,86.58914499282838,in training set
CCC[C@@]12CC=CC[C@H]1C2,84.44173192977905,not in training set
C1CCOC1,83.42631349563598,in training set
CC[C@]1(C)[C@H]2COCC[C@H]1O2,83.08922061920165,not in training set
C1CC1C1(C2CC2)CC12CC2,82.05258083343507,not in training set
C1C[C@@H]2C[C@@H]2OCO1,81.79771022796632,not in training set
COCOCOCO,80.85329055786131,not in training set
COC#COC1CC2(CCO2)C1,80.6543550491333,not in training set
CO[C@]12CCOC[C@@H](C1)O2,80.08662109375001,not in training set
CC[C@]1(C)C[C@H]2C[C@@H](CO1)O2,78.51676578521729,not in training set
CC1CCOCC1,78.2263759613037,in training set
CC[C@@]1(C)CCCCO1,77.87102451324463,not in training set
CCCC[C@@]12CO[C@]13C[C@@]32C,76.52170553207398,not in training set
C1CC(O[C@@H]2CO2)C1,74.84607248306274,not in training set
C1CC2(C1)CC1(CO1)C2,72.66767187118532,in training set
CCCCC1C23CC12C3,71.81182947158814,not in training set
C1CC2(CC2)CC2(CC2)O1,71.74064111709595,not in training set
CCC[C@H](C)C(C)C,70.25520057678222,not in training set
C1CCOCC1,69.64495410919189,in training set
CCC[C@]1(C)OCC[C@H]2C[C@H]1O2,67.68344650268554,not in training set
OCCO[C@@H]1CCOC1,66.12857608795167,not in training set
CC1CC2(CCC2)C1,65.40913009643555,in training set
CCC[C@]1(C)[C@H]2COCC[C@H]1O2,65.39354925155641,not in training set
CCC[C@@]1(C)[C@H]2COCC[C@H]1O2,65.39354915618897,not in training set
CCC[C@@H]1CC12CC2,65.18225355148316,not in training set
CCC[C@@H]1CC=CCC1,61.0140474319458,not in training set
C1CC2(C1)CCC2,60.99010419845581,in training set
C1COCCOC2(C1)CC2,57.62506761550904,not in training set
CCCCC[C@]12C[C@@H]1O2,53.87040328979492,not in training set
C1CCOCOC1,53.709066963195795,in training set
C1COCC2(CCO1)CC2,52.66043615341186,not in training set
CCCC[C@]1(C)C[C@H]2C[C@@H](CO1)O2,51.82925062179565,not in training set
C1CCOCOCC1,45.78746862411499,in training set
CC[C@H]1CCCOC1,45.53431806564331,not in training set
CCOC1CCOCC1,41.12832736968994,in training set
CCCC1(CCC)CC1,37.308424854278584,in training set
CCCC1CCOCC1,30.272209739685067,in training set
CCCCCCCCC,-10.486587333679196,in training set
