CC(C)(C)C1OC1(C)C,126.54467048645019,in training set
COC1CC1(C)C(C)(C)C,125.94122734069825,not in training set
C1CC1,125.76926269531249,in training set
CC1CC1(C)C(C)(C)C,124.90560092926026,in training set
COC(C)(C)C1(C)CCC1,124.08449535369873,not in training set
COC1(C)C(C)C1(C)C,123.93634529113771,in training set
COC1C(C)(C)C1(C)C,123.18415050506586,in training set
CC(C)(C)C1(C)CC1,123.16753311157225,in training set
CC(C)(C)C1(C)OCC1=O,122.5996883392334,not in training set
CC1(C)CC1(C)C,122.49941177368164,in training set
COC1CC1(C)OC,122.47790355682369,in training set
CC(C)(C)C1(C)COC1,122.22823905944828,in training set
COC1(C)COC1(C)C,121.9633535385132,in training set
CC1(C)CC1(C)C1(C)CO1,121.90217571258545,not in training set
CC1C(C)(C)C1(C)C,121.81362323760986,in training set
COC1C(C)(O)C1(C)OC,121.78627910614013,not in training set
CC1CCC1(C)C(C)(C)C,121.74804878234863,not in training set
CCC1(O)CC1C(C)(C)C,121.64321956634521,not in training set
CC(C)(C)C1(C)CCC1,121.58912620544434,in training set
COC1(C)CC1C(C)(C)O,121.37227897644044,not in training set
CC1(C)OC1(C)C,121.23383140563965,in training set
CC(C)(C)C1(C)CCC1O,120.70096435546876,not in training set
COC1(C)OC1C=O,120.56506881713867,not in training set
O=C1CC1,120.53803615570068,not in training set
CC1C(C)(C)C1(C)C=O,120.49578056335446,in training set
CC1(C)C(=O)C1(C)C,120.41849670410156,not in training set
CC(C)(C)C1(O)CCC1=O,120.41373844146729,not in training set
COC1(C)CC1OC=O,120.4120500564575,in training set
CC1(C)C(CO)C1(C)C,120.3619516372681,in training set
CCC(C)C(C)(C)C=O,120.35950508117679,in training set
CC(C)C1(C)COC1(C)C,120.3468641281128,not in training set
CC1(C)COC1(C)C,120.33648376464843,in training set
COC1(C)CC1C=O,120.14159832000728,in training set
COC1(C)CO1,119.79171924591064,not in training set
COC1CC1(C)C,119.78044776916505,in training set
COC1(C)CC1C,119.70558261871341,in training set
COC1C(C)(C)C1(C)O,119.70505046844481,in training set
CC(C)C1(C(C)(C)C)CCO1,119.63808555603028,not in training set
CC1CC1(C)C,119.6294500350952,in training set
COC1(C)OC1(C)O,119.5994451522827,not in training set
COC1(C)CC1=O,119.59229125976562,not in training set
COC(C)C(C)OC,119.54488048553466,in training set
CCC(=O)C1(C)CC(C)(C)C1,119.47854442596437,not in training set
CC(C)(C)C(=O)C1(C)CCC1,119.42132396697998,not in training set
CC1OC1(C)C,119.1748399734497,in training set
COC1(C)C(C)C1C,119.16243190765384,in training set
CC1(C)CC1=O,119.14435100555419,not in training set
CC1(C)CCC1(C)C=O,119.08122539520258,in training set
CC1(C)CC1C=O,119.04750404357912,in training set
CC(=O)C1[CH-]C1(C)C,119.0292251586914,not in training set
C1CCC1,118.81182823181152,in training set
CC1(C)CC1O,118.71521835327147,in training set
CC(C)(C)C1(C)COCO1,118.66524105072023,not in training set
CC1(C)OC1C=O,118.64428749084476,in training set
C#CC1(C)C(C)C1(C)C,118.60695838928223,in training set
CC1(C)CO1,118.56373310089117,in training set
CC1(C)CC1(C)C(=O)O,118.45316200256349,not in training set
CC1C(=O)C1(C)C,118.33097171783447,not in training set
CC1(C)OC1O,118.31101818084719,not in training set
O=C1CCC1,118.2747638702393,in training set
CCC(=O)C1CC1(C)C,118.19130458831785,in training set
CC1C(C)(C)C1(C)O,118.17268962860109,in training set
CC(C1CC1CO)C(C)(C)C,118.16837844848632,not in training set
CC1(C)C(=O)C1(C)O,118.1409273147583,not in training set
CC1C(C)C1(C)C,118.10434989929198,in training set
C#CC1(C)OC1(C)C(C)=O,118.04621868133545,not in training set
CC(C)(C)C1(C)CCOCC(=O)C1,118.02328338623046,not in training set
COC1CC1(C)C=O,117.95670356750489,in training set
CC(C)C1CC1(C)C,117.95486221313479,in training set
CC(C)(C)C1(C)CCOC1,117.89967498779298,not in training set
CC(=O)C(C)C(C)(C)O,117.87256088256832,in training set
CC1(C)OC1(C)O,117.85282402038574,not in training set
CC=O,117.7987997055054,in training set
CC(C)(C)C(=O)C1(C)CCO1,117.79336547851562,not in training set
CC1(C)CC(=O)C1(O)C=O,117.79184551239015,not in training set
COC1(O)COC1(C)C,117.63558921813964,not in training set
CC1(C)CC1(C)CO,117.60049591064455,in training set
CCC1C(OC)C1(C)OC,117.55583972930907,not in training set
CC(C)C1OC1(C)C,117.54762306213374,in training set
CC1(C)CC1C(=O)CO,117.53285865783693,in training set
COC1(C)CCC1(C)O,117.5162942886352,in training set
CC1(C=O)CCC1(C)C=O,117.48573207855225,not in training set
COC1(C)CCC1=O,117.37258110046388,in training set
CC1(C)OC1OC=O,117.34357452392577,not in training set
CC1CC1C=O,117.34284896850586,in training set
CC1OC(C)(O)C1(C)C,117.32129878997802,not in training set
COC1(C)C(C)C1C(=O)O,117.2136089324951,not in training set
COC1C(OC)C1(C)O,117.1276659011841,in training set
CC#CC(=O)C1CC1(C)C,117.11499786376953,not in training set
C/C=C(\C)C1(O)[CH-]C(C)(C)O1,117.04747390747069,not in training set
CC1(C)CC(=O)CO1,116.93762874603269,in training set
CC1(C)C(=O)C1CO,116.9243133544922,not in training set
CC1CC1(C)OC=O,116.91130313873293,in training set
CC1(O)OC1(C)C=O,116.85493659973145,not in training set
CC1CC1(C)C=O,116.82786407470704,in training set
CC(C)(C)C1=CCCC1=O,116.82089157104491,not in training set
CC1(C)C(O)C1C=O,116.80579471588135,in training set
CC1(C)CC1C(=O)O,116.78262748718261,not in training set
CC1(C)OCC1=O,116.67149562835692,in training set
CC1(C=O)CO1,116.61343612670898,in training set
C#CCC(=O)C1CC1(C)C,116.5726661682129,not in training set
CC1CCC(C)(C(C)(C)C)C1,116.51893978118896,not in training set
CC1(C=O)CC1C=O,116.45649147033693,in training set
CC1OC1(C)OC=O,116.44876537322997,not in training set
CC(C)C1(C)COC1(C)O,116.3688039779663,not in training set
CC1(C)CC1C(=O)C=O,116.27122383117675,in training set
CC1OC1(C)C=O,116.17345390319824,in training set
CC(=O)C1(C)CC1O,116.05946216583251,in training set
CC1OCC1(C)C,116.00673236846923,in training set
CC1(C)CCC1(O)C=O,115.98228626251219,in training set
COC1(OC)CC1,115.96508731842042,not in training set
CC(=O)CO,115.95063972473152,in training set
CC1(C)CC(C)(C(=O)O)C1,115.93310070037842,not in training set
CC(C)OC1OC1(C)C,115.91017036437988,not in training set
CC1(C)CCC1(C)O,115.87369956970215,in training set
CC(C)C1(C)C(C)C1C,115.86561584472663,in training set
CC(=O)COC(C)C,115.81697921752931,in training set
CC(C)C1(C)CC1C,115.81598663330074,in training set
COC1CC1(C)C(C)C,115.80570087432865,in training set
CCOCOC(C)=O,115.79398155212401,not in training set
CC(=O)O,115.72614879608156,not in training set
COC1(C)COC1=O,115.72584781646728,in training set
COC(C)C#CC(C)=O,115.72327919006351,in training set
CCC1C(C)C1(C)C,115.71359920501709,in training set
CC1C(CO)C1(C)C,115.71254348754881,in training set
CC1(C)CC1CO,115.70935821533203,in training set
CC(C)(C=O)C1(C)CCCO1,115.70824909210205,not in training set
CC(C)OC1CC1(C)C,115.703356552124,in training set
CC(=O)C1C(C)C1(C)O,115.59014110565184,in training set
COC1C(C)(O)C1(C)O,115.58343563079832,in training set
CC1(C)OCC1(O)C=O,115.53456459045407,in training set
CC(=O)C1(C)OC1O,115.50561218261717,not in training set
CC1(O)CO1,115.44937725067138,not in training set
CC1(C)CC2(C)CC12,115.42284431457523,in training set
CC(C)C1(C)OC1C,115.35495300292972,in training set
CC(C)(C)C1(C=O)CCCO1,115.33870162963868,not in training set
CC1(OC=O)CC1,115.33217124938967,in training set
CC(C)(C)C1CCC1,115.32148990631103,in training set
CC(C)C1(C)CC1C=O,115.30473289489744,in training set
C#CC(C)(O)C(=O)OC,115.29775333404541,in training set
COC1(C=O)CC1,115.26938400268556,in training set
COC1(C)C=CCCC=C1,115.22461929321288,not in training set
O=CCC(=O)CO,115.20357189178468,in training set
COC1(C(C)C)CC1C,115.13362903594975,in training set
CC1(C)C(O)C1C(=O)CO,115.1316982269287,not in training set
C#CC1(C)CC1OC,115.11502876281739,in training set
CC1(O)CC1,115.1036470413208,in training set
COC(C)=O,115.09234580993653,in training set
CC(C)=O,115.07035312652589,in training set
CC1(C)CC1C(=O)CCO,115.06420574188232,not in training set
CC1(C)CC1C#CC=O,115.03628692626954,in training set
CC(=O)C1(O)CC1C,115.00698871612549,in training set
CC(C)C1(C)CC1O,114.96144485473636,in training set
CC1(O)CCC1(C)C=O,114.95855445861814,in training set
CC(C)(C)C(=O)C1=CCCC1,114.92163581848146,not in training set
CCC(C)C1(C)CC(C)(O)C1,114.91221351623537,not in training set
CC1C(C=O)C1(C)O,114.90549488067627,in training set
CC(C)C1(O)CC1=O,114.8057035446167,not in training set
CC(C)(C)C1=CCCO1,114.64673919677735,not in training set
C#CC1CC1(C)C=O,114.64606227874759,in training set
CC(C)C1(C)OC1O,114.63566741943359,not in training set
CC1(C=O)C=CC=CO1,114.62806358337401,not in training set
CC#CC1C(=O)C1(C)C,114.57338600158691,not in training set
O=CC1(C=O)CO1,114.56255378723141,in training set
CC1(O)CCC1=O,114.5252151489258,in training set
C#CCC(C)=O,114.52345523834224,in training set
COC(O)C(=O)C=O,114.43107051849366,not in training set
CC(C)C1(C)CCC1=O,114.43102321624761,in training set
COC1(C)CCC1C,114.42461204528804,in training set
C#CC1(C)OC1(O)C=O,114.41425037384033,not in training set
CC(C=O)OC1(C)CC1,114.381351852417,in training set
CC1OC(C=O)O1,114.37894496917724,not in training set
CCOCC(C)=O,114.37210884094237,in training set
O=C1CCOC1,114.3413824081421,in training set
COC1(C(C)C)CCC1=O,114.32901744842529,not in training set
COC1C(CO)C1(C)C=O,114.2716859817505,not in training set
CC(C)C1(C)OCC1=O,114.26662006378174,in training set
CC1(O)CC1(C)C(=O)O,114.25618495941161,not in training set
CCC1(C)CCC1(C)C,114.24557666778567,in training set
CC1(C)CCC1(O)O,114.21518077850342,not in training set
CC1(C)CC(C)(O)C1,114.14213447570805,in training set
COC(C)C1(O)OC1O,114.12740230560303,not in training set
CC1(C=O)OCC1=O,114.11367359161378,in training set
CC1CC1(C=O)C=O,114.0547130584717,in training set
CC1CCC1(C)C,114.04508991241454,in training set
CC1(C)CCCC1=O,114.04483242034914,in training set
CC(=O)C(C)C(C)C,114.0336322784424,in training set
CC1(C=O)CCC1=O,114.02921104431158,in training set
CC1(C2(C)COC(=O)C2)CC1,114.01614952087402,not in training set
CCC1CC1(C)OC=O,114.01235256195069,in training set
CC1(C=O)OCC1(O)C=O,114.0024766921997,not in training set
CC(C)C1(C)CO1,113.98792991638184,in training set
CC1(C=O)C=CC=CC1=O,113.96925945281981,not in training set
CC(=O)C(C)CO,113.91684741973879,in training set
CC1CC1(C)C1CC1(C)O,113.91077213287355,not in training set
O=COC1(C=O)CC1,113.900789642334,in training set
COC1(C)C23CC12O3,113.81200466156005,in training set
CCC(O)C(=O)C(C)OC,113.81005954742432,not in training set
CCC1C(OC)C1(C)O,113.75854568481446,in training set
CC#CC1(C)OC1OC,113.75825252532958,not in training set
C#CC(=O)CO,113.74926376342769,in training set
CCC(C)=O,113.74878444671631,in training set
COC1(O)OC1C(C)O,113.6944351196289,not in training set
CC1(C=O)OC1CO,113.67414722442628,in training set
CC(C)(C)C1=CCCC1,113.59643859863286,in training set
CC(C)C12C=CCC1(C)C2,113.58796157836915,not in training set
CC(C)C1(O)CC1C,113.57910652160643,in training set
COC(C)(C)C12CC1CO2,113.53787155151367,not in training set
CC1(C)CC=CC1,113.5168882369995,in training set
CC(=O)C1CC1,113.47479076385497,in training set
COC1(C)CC1,113.43739585876466,in training set
CC(C)OC1(C=O)CC1,113.4295682907105,in training set
COC1C(CO)C1(C)O,113.39409503936771,in training set
C#CC1(O)OC1C(C)=O,113.3867837905884,not in training set
CC1(C=O)CC1,113.3571660995484,in training set
CC1C=C(C(C)(C)C)CC1,113.35276432037352,not in training set
CC1CCC=C1C(C)(C)C,113.35132522583008,not in training set
CC1(C=O)CCC1(O)O,113.3457202911377,not in training set
CC1CC1(O)CC=O,113.34378662109378,in training set
CC1CCC1(C)OC=O,113.3297546386719,in training set
CCC(=O)OC=O,113.32106609344483,not in training set
C#CC1CC1(C)C(C)C,113.32034568786617,in training set
CCC1(C)CC1(C)O,113.2968231201172,in training set
CC1=CCCC1,113.28720283508301,in training set
CC1C(C(=O)O)C1(C)O,113.26219615936279,not in training set
CC1CCC1,113.24099597930908,in training set
C#CC(C)=O,113.23527374267577,in training set
CC1(C)CCC(=O)C1,113.21731452941894,in training set
COC1(C(C)C)CO1,113.11419010162354,not in training set
O=CC1(C=O)CC1,112.99289474487301,in training set
COC1(C=O)CCC1O,112.9290601730346,in training set
CC1(O)OC1C(=O)CO,112.91137180328369,not in training set
O=CC1(O)CCC1=O,112.88336181640625,in training set
CC(C)(C=O)C1=COCC1,112.8800401687622,not in training set
COC1(C)C=COCC1C,112.83323860168457,not in training set
CC1(C)OCCC1=O,112.8275371551514,in training set
CC(C)C1(C)CC1CO,112.77946643829347,in training set
CC(C)C1(C)OC1=O,112.76700534820557,not in training set
CC1(C)CCC1(O)CO,112.70880947113038,in training set
COC1(C(C)C=O)CC1,112.68158740997316,in training set
CC(=O)C1(C)CCC1,112.68074245452884,in training set
CC12OCC1(C=O)O2,112.59832305908203,not in training set
COC(C)C1(C=O)CC1,112.56190605163572,in training set
CC#CC(=O)C1CC1(C)O,112.56109867095947,not in training set
C#CC(C)C#CC(C)=O,112.54239311218265,in training set
C#CC(=O)OC,112.50708274841305,in training set
CC1(O)CC=CC1,112.44554777145386,in training set
CC(C)C1(OC=O)CC1,112.41796073913574,in training set
CC#CC(C)=O,112.41656284332278,in training set
CC(=O)C(C)C,112.4084770202637,in training set
CCCC(=O)O,112.3710823059082,not in training set
CC(=O)C(O)C=O,112.35573444366456,in training set
CC(C=O)C(=O)C=O,112.31901092529297,not in training set
COC(=O)C#CC=O,112.3025735855102,in training set
CC1(C)CCO1,112.28677196502684,in training set
CC1(C)CCC(O)O1,112.26194305419921,not in training set
CC(=O)CC1(O)CC1O,112.23726730346675,in training set
CC#CC1CC1(C)C,112.22193393707272,in training set
CC(C)(O)C1CC1(C)C1CO1,112.15294799804687,not in training set
CC1(C)CCC(=O)O1,112.14850902557373,in training set
CC(C)C1(O)CC1O,112.14303836822513,in training set
C#CCC1CC1(C)C,112.13532905578616,in training set
CC(C)C1(C=O)CC1O,112.11277160644535,in training set
CC(=O)CC(C)C(=O)CCO,112.07069244384765,not in training set
CC(=O)C1(C)CCO1,112.03936233520507,in training set
CC(C)C(O)C(=O)C=O,112.01838550567628,in training set
O=CC1(C=O)COC1,111.99063701629643,in training set
CC1(C=O)CCO1,111.99058246612545,in training set
CC1(C)CC1,111.98214721679685,in training set
CC(O)COC=O,111.98200778961181,in training set
CCC1C(OC)C1(C)CC,111.95786514282226,not in training set
C#CC(=O)C(C)C,111.94187126159669,in training set
C#CC1(C)CC1C(C)O,111.9299165725708,in training set
CC#CC(=O)OC,111.90254478454585,in training set
CC1(C)OCC1(C)C1CO1,111.88033046722413,not in training set
CC1CCC1(C)C=O,111.87622985839845,in training set
O=CCC1CCC1=O,111.84386634826662,in training set
C#CC(=O)C1CC1(O)O,111.83482151031492,not in training set
CC(C1CC1CCO)C(C)(C)C,111.82247333526612,not in training set
CCC(C)C(=O)C=O,111.81855335235598,in training set
CC(O)C1(O)CC1C,111.80761775970464,in training set
C#CC1(C)CCC1(O)C=O,111.77879829406737,not in training set
CCC(=O)C(C)C,111.77815837860109,in training set
C#CCCC(O)c1ccoc1,111.77676372528077,not in training set
CC(C=O)C1(C)CC1,111.74752502441402,in training set
CC(=O)C1(C)C23CC21C3,111.72570018768309,not in training set
COC#CC(=O)C(C)C,111.71244659423829,not in training set
C#CC1C(C)C1(C)O,111.70707664489747,in training set
C1C23CC12C3,111.69183406829835,not in training set
CC1(O)CCCC1=O,111.67114009857177,in training set
CC1C2(C)COC12C=O,111.66958179473879,in training set
COC1CC1(C)C1(C)CCC1,111.64962387084961,not in training set
CC12CCC1(C=O)C2,111.64636726379395,in training set
CC(C)C(=O)C(C)C,111.62753963470463,in training set
CC(C=O)C1(C)OCO1,111.62037200927735,not in training set
CC(C)(C)C,111.62010345458984,in training set
CC1=CCCC1(C)O,111.61025733947756,in training set
CCCC1(O)OC1(C)C,111.55359420776368,not in training set
CCOC(=O)C1OC1C,111.53157196044923,in training set
CC(O)C(=O)C=O,111.5235572814941,in training set
CC(C)OC1(C)CCC1C,111.52233772277832,not in training set
CCC(=O)C1(C)CCC1,111.48418903350827,in training set
CC(=O)C(C)C(=O)CCO,111.4766254425049,not in training set
C#CC1(C)CO1,111.4669800758362,in training set
C#CC1(C(C)C)CC1C,111.43017673492432,in training set
CCC1OC1(C)C(C)C,111.40426197052003,in training set
CC1(C)CCC1(C)C1CO1,111.38827819824219,not in training set
CC(C)C1(C)CCC1O,111.37686309814453,in training set
CC(=O)OCC(C)C,111.35947208404538,in training set
CC(=O)C(O)OC=O,111.30709266662598,not in training set
CC(O)C(=O)C(C)C=O,111.23939819335938,in training set
COC(=O)C1(C)CCC1,111.23629150390624,in training set
CC(C)CC(O)C1(C)CC1(C)O,111.23618850708007,not in training set
O=COC1(C=O)CCC1,111.2339515686035,in training set
CC(=O)CC#CC(C)C,111.20126953125002,in training set
CC(O)C(C)C1(C)CC1,111.19378376007079,in training set
O=CC12CC(=O)C1C2O,111.1927577972412,in training set
CC#CCC(=O)C=O,111.17593975067139,in training set
O=CC1(C=O)CCO1,111.17171478271487,in training set
CC1(OC=O)CCCO1,111.16112880706785,in training set
CC(C)C1(C)OCC1C,111.15790367126469,in training set
CCC(O)C(C)O,111.13408126831052,in training set
CC1(C)C(=O)C1CCO,111.11241207122802,not in training set
COC1=CCC=CO1,111.08539619445801,not in training set
CC(=O)COCC(C)(C)C,111.08417701721193,not in training set
CC1(O)CCC1,111.03455181121826,in training set
CCC(=O)C(C)=O,111.03410758972169,in training set
CCCC1(C)CC1(C)C,110.97822360992434,in training set
CC1(C)C23CC12C3,110.9745933532715,not in training set
CCC1CC1(O)C=O,110.9656238555908,in training set
CC1(C)C23CC12O3,110.94259910583497,in training set
CC(C)C1(C=O)CO1,110.87148170471191,in training set
CC1(C=O)OCCC1=O,110.82942466735841,in training set
CC1(C)COC(=O)C1,110.81745853424071,in training set
CC(C)C1(C)CCC1C,110.77634353637694,in training set
CC(C)C1CCC1=O,110.73400173187255,in training set
O=CC1(O)CCC1,110.672459602356,in training set
CC(C=O)C1(C=O)CC1,110.63718547821044,in training set
CC1(C2(C)CO2)CCC1,110.61777057647706,in training set
CCC1CC1(C)C(C)C,110.58763942718505,in training set
CC(O)C1(C=O)CCC1=O,110.5443021774292,not in training set
CC(=O)C1=CCCC=CC1,110.51480445861816,not in training set
COC1CC1C(C)C(C)=O,110.5108959197998,not in training set
CCC(=O)C1(C)CCO1,110.50458316802978,in training set
CC(OC=O)C1CC1,110.50418930053709,in training set
O=C1C23CC12C3,110.49709634780885,not in training set
C#CC1CC1=O,110.48668308258058,not in training set
CC1(C)CC1C1(C)CCO1,110.37888240814209,not in training set
C#CCC(=O)C(O)C#CO,110.35509357452392,not in training set
CC(C)C1(O)CC1CO,110.31094417572021,in training set
C#CC(=O)C#C,110.26038675308227,in training set
CC(C=O)C1CC1,110.25262336730961,in training set
C#CC1(O)OC1C(C)O,110.20634021759034,not in training set
CC(=O)C(=O)C1(C)C[CH-]C1,110.19063816070556,not in training set
CC1COC1(C)C1(C)CC1,110.13409500122071,not in training set
COC1=CCCC(=O)C=C1,110.12828311920167,not in training set
CC(OC=O)C1CO1,110.10921020507818,in training set
C#CC1(OC)CC1,110.08199405670167,in training set
CC(C)C1(C)CC1,110.07608833312987,in training set
CC(C=O)C1(O)CCC1C,110.052725982666,not in training set
COC(=O)C1C=CC=CO1,110.04547004699708,not in training set
CCC#CC(C)=O,110.03599662780759,in training set
CC(O)C#CC1CC1(C)O,110.01852474212647,not in training set
CC(O)C1(C)CC1,110.00651741027832,in training set
COC1(C)C(C)C1CCO,109.9804262161255,not in training set
CC(OC=O)C1[CH-]C1,109.96642932891845,not in training set
CC1CC(=O)O1,109.907536315918,in training set
O=C1CCO1,109.89849510192872,in training set
CC(C)C1CC1C,109.8804653167725,in training set
CC(C)C1(C)OCO1,109.87218360900877,not in training set
CC(=O)C1C=CCCC=C1,109.87129478454588,not in training set
CC(C=O)C1(C)CCO1,109.78146915435792,in training set
C#CCCCC(C)=O,109.75620307922365,in training set
CC(C)C1(C)C23CC21O3,109.75467472076416,in training set
CC1(C(=O)O)CCC1,109.743572807312,not in training set
O=CC1=CCC=CC=C1,109.69482660293579,in training set
CC1=CC(=O)CO1,109.63534393310547,not in training set
O=C1CC=CC(O)(CO)CC1,109.62940750122071,not in training set
CC1(O)C23CC12C3,109.60472221374512,not in training set
COC1(C(C)C)CC1,109.55373172760008,in training set
CC(=O)C(=O)C(C)O,109.5440532684326,in training set
O=C1CC(C#CO)C1O,109.5351053237915,not in training set
O=C1C=C2CC=CC2C1,109.52486324310301,in training set
O=CCC1CC1(O)CO,109.47373638153077,in training set
CC1(C(=O)O)CCO1,109.46899280548097,not in training set
CC(C)C1(C(C)C)CC1,109.45490684509276,in training set
CC(C)OC1OC1C,109.45301380157471,not in training set
COC1(C(C)O)CC1,109.39252357482908,in training set
O=C(C#CO)CCO,109.21706333160401,not in training set
CC1CCCC1(C)C,109.12766170501705,in training set
C#CC(=O)CCCC=O,109.12314453125,in training set
C1C23CC12O3,109.12027521133425,in training set
C#CC1(C)CC1CC,109.11369476318359,in training set
O=C1COC(O)C1CO,109.05814971923829,not in training set
CC(C)OC1(C(C)O)CC1,109.02876853942871,not in training set
COC1C=CCCC=C1,109.0183997154236,in training set
CC1(C2(C)CC2)CCC1,108.98253059387206,in training set
O=C1CCC1=O,108.94534111022949,not in training set
O=CC(=O)C1=CC=COC1,108.89560165405274,not in training set
CC1(C)C=CC(=O)C2CC21,108.88884487152099,not in training set
CC1(O)C(=O)C1CCO,108.88429431915284,not in training set
CC(C=O)C1=COC=CC1,108.87987499237062,not in training set
O=CC1=CCC=CO1,108.81499280929566,not in training set
O=CCC(=O)C1=CCOC1,108.7892822265625,not in training set
CC12CC(O1)C(C)(C)C2,108.7483226776123,in training set
CC(C)(C)C1(C)COCCCO1,108.74150905609132,not in training set
CC(=O)OC1OCC1C,108.67058486938477,not in training set
CC1=CCCCC1,108.65067729949948,in training set
O=C1CC(=O)O1,108.64148750305176,not in training set
C1=CC2C3CC1CC23,108.61791715621949,in training set
CCCC(=O)C(C)C(C)C(C)C,108.58435916900635,not in training set
O=CC1(C=O)CCCO1,108.57256650924687,in training set
CC(C)C1(C=O)CC1,108.55409832000733,in training set
C1=CC2C3[CH-]C2C13,108.5521743774414,not in training set
CC(C)(C)C1(C)CC12CCOC2,108.53266201019288,not in training set
O=C(CO)C1=CCOC1,108.52987689971923,in training set
O=C1CCC(O)O1,108.49032440185546,not in training set
O=COC1=CCC(CCO)=C1,108.48167343139647,not in training set
C1OC2OC12,108.46278400421144,not in training set
COCC1C(O)C1(C)C,108.45470886230466,in training set
O=CC1(C=O)CCC1,108.44718685150147,in training set
CC1(C)CC1CC#CC=O,108.39107074737548,not in training set
O=CCCC(=O)C1CO1,108.37169818878172,in training set
CC1=CCCCC(C)(C2(C)CO2)C1,108.32681541442872,not in training set
CC1(C)CCC1(O)C1CC1,108.32232151031494,not in training set
CCC(O)C1(C)CC1,108.3106716156006,in training set
CCCC1(C)OC1C(C)=O,108.29322299957275,not in training set
O=C1CCOCC(=O)C1,108.27136917114258,not in training set
CC1(C)CC(C2(C)CO2)C1,108.21700992584228,not in training set
CC1(C2(C)CCO2)CC1,108.20658760070799,in training set
O=CC12CCCC1(O)C2=O,108.17314529418945,not in training set
C1CO1,108.12136106491091,in training set
C#CC1(C)CC1,108.07249565124512,in training set
CC12C3C=CC14CC2C34,108.07198858261114,in training set
CC(C)C1(C)CCO1,108.06078205108643,in training set
COC(=O)C1(C)CC2(CO2)C1,108.0566053390503,not in training set
CC1C(CCO)C1(C)C,108.02320079803465,in training set
CC(C)C#COCC=O,108.02173261642456,not in training set
CCC(OC)C(C)O,108.02136955261234,in training set
O=C1C2C3C=CCC3C12,107.94433479309083,not in training set
CC1C2C=CC3CC1C32,107.91273050308227,in training set
COC(CO)C1CC1(C)C,107.90929222106934,not in training set
CCC(O)C(C)CO,107.90727729797364,in training set
CC1=CCCCC1(C)C1(C)CC1,107.89059638977052,not in training set
O=CC1=CCCC1,107.64016275405888,in training set
O=C1CC(=O)C2(CC2)C1,107.59992389678956,in training set
CC(=O)OC1CCC1C,107.58509845733646,in training set
O=C(C#CCC#CO)CO,107.54453630447388,not in training set
CC1(O)CCC1(C)C1CO1,107.52319736480712,not in training set
CC1(C2(O)CCC2)CO1,107.51854209899899,in training set
CC(C)OC1CO1,107.48557443618773,not in training set
O=C1CC12CCC2,107.47537498474122,not in training set
CC1(C2CC2)CCC1=O,107.41019325256346,in training set
CC(C)C1=CCC=CO1,107.40743780136108,not in training set
COCC(=O)C1=CCOC1,107.3665870666504,not in training set
CC(O)C1=CCCC=CC1,107.33397178649902,not in training set
CCC1(C)COC1C=O,107.3305233001709,in training set
CC1(C)CC1CCO,107.28281860351562,in training set
O=C(CO)C1=COCC1,107.256111907959,not in training set
OCCCCc1ccoc1,107.2537160873413,not in training set
CC(C)C1=COCC1C,107.2494686126709,not in training set
C1=CC2C=CC(C1)O2,107.19019441604618,in training set
COC1C(=O)OCC1CO,107.188592338562,not in training set
CCC12C(CO)CC1(C)C2O,107.18721942901612,not in training set
CC(C)C1=CCCC1,107.16793403625492,in training set
C#CCC1(C)C2COC21C,107.1599913597107,not in training set
CC1(C)C(=O)C1CCCO,107.11114978790283,not in training set
O=C1CC2CC1O2,107.10992364883423,in training set
CC1=CC=CC=CC1,107.08739948272705,in training set
CC1C23CC12C3,107.0644479751587,not in training set
CC1=CC2C=CC1(O)C2,107.0537990570068,in training set
CC(C)C1=CC=CCC=C1,107.0473349571228,not in training set
O=C1CC(=O)C12CCC2,107.0312147140503,not in training set
O=C1CC12C=CCC2,107.02295742034913,not in training set
CC1(O)C2C=CC3C(O2)C31,107.02239522933961,not in training set
CC(C)(C)C1(C)CCC12CCC2,107.00807838439941,not in training set
CC1(C=O)CCC1,107.00594902038574,in training set
O=CC#CC(=O)C1CC(O)O1,106.97330417633057,not in training set
CC1(C)CC2CC21,106.90849742889402,in training set
O=C1C=CC2(CO2)C1,106.90287189483642,in training set
CC(C)C12OCC1C2=O,106.87401943206787,not in training set
CC12CCCC1(C=O)O2,106.8620397567749,in training set
O=C1CC=CC12CC2,106.86043128967282,in training set
CC1=CC2OC3CC1C23,106.84318428039555,in training set
CC(O)C12OCC1C2=O,106.84224662780763,not in training set
CC#CC(C)C1CC1O,106.82882881164554,in training set
OC#CCCO,106.82639293670655,not in training set
O=C1CC=C2CC=CC12,106.7861391067505,in training set
CC1=CC(=O)CC12CC2,106.72773284912113,in training set
O=C1CCCC1=O,106.67370796203613,in training set
CC1C=C2CC=CC2C1,106.65638694763187,in training set
C#CCCC1CC1(C)C,106.63503837585455,in training set
CC(=O)C1CC=CC12CO2,106.63068962097168,not in training set
CCC12OCC1(C)C2CO,106.61103286743163,not in training set
C1=CC2CCC=C2C1,106.5188596725464,in training set
CC1(C=O)CC=CC2OC21,106.43789033889772,not in training set
CC1=CCCC(CO)=CC1,106.39827909469605,not in training set
CCC1(O)C23CC12C3,106.34565143585203,not in training set
CC1C(CCO)C1(C)O,106.33913288116455,in training set
COCC1C(C)C1(C)O,106.26859912872318,in training set
OC1CC=C2CCC21,106.23533897399902,in training set
CC(O)C1(CO)CO1,106.20673484802246,in training set
CC1(C)CCCO1,106.18934860229493,in training set
O=C1C=CC2(CC2)C1,106.18762416839597,in training set
CCC#CC=O,106.16028957366942,in training set
CC12CCC(C1)C2=O,106.13850612640383,in training set
O=CC12CCC1O2,106.07940311431884,in training set
CCC1CCC1(C)C,106.07520256042486,in training set
CC12C3C=CC(O3)C1C2O,106.00238103866576,not in training set
O=CC1C=CC2(CCC2=O)O1,105.98780937194825,not in training set
CC(=O)C1CC=CC12CC2,105.93654937744142,not in training set
CC1C=CCCC12OC2=O,105.93327445983888,not in training set
CC1CC=CC12COC2(C)C,105.92526645660399,not in training set
CC(C=O)C1(C=O)CCC1,105.91774921417237,not in training set
O=C1C2CCC1C2O,105.89918098449706,in training set
CC(C)C1(C(C)C)CCO1,105.82173824310303,not in training set
CC(C=O)C1(C)CCC1,105.77267894744875,in training set
C1=CCC(C2CC2)=CC1,105.75945672988891,not in training set
CC#CCC1CC1(C)O,105.73381042480469,in training set
CC1=CCC2(CO2)C1,105.69357633590698,in training set
CC(=O)CC1C23CC12C3,105.68627586364745,not in training set
CC1(CC=O)CC1,105.65991744995117,in training set
CC1CC1(C)C1(O)CCCC1,105.65448246002198,not in training set
COC(O)CC1CC1OC,105.62254695892332,not in training set
CC1CC23C=CC(C2)C13,105.59224710464477,in training set
CC(C)C1(C=O)CCO1,105.58921852111816,in training set
CCC(C)CO,105.56467533111572,in training set
COCC1OC1(C)C,105.55765323638914,in training set
C1=C2CCC2CC1,105.54842281341553,in training set
CC#CCC1CC1(C)C,105.54239692687989,in training set
CC12CC(=O)C(C1)C2,105.50622406005859,in training set
CCCC1(C)COC1(C)C,105.47347030639648,not in training set
C#CC1C=CC2(CCC2=O)O1,105.44223766326905,not in training set
CC1(O)C(=O)C1CCCO,105.43990612030028,not in training set
CC(=O)C1C/C=C\C=C/COC1,105.434521484375,not in training set
CC1(C)CC=CC2CC21,105.39162158966063,in training set
CC1(C2(C)CO2)CCCO1,105.38957500457764,not in training set
O=C1CCCC2(C1)CC2=O,105.34625988006593,not in training set
O=C1C/C=C\CCCC1,105.33386878967285,in training set
O=C1CCC23CC(=O)C12C3,105.28857917785643,not in training set
CC(=O)C1(C)CC12CCC2,105.27784214019775,not in training set
CC(O)C1(C)CC2(CCC2=O)C1,105.27507629394532,not in training set
COC(C)C1CC1,105.25968694686891,in training set
O=C1CCCC(O)CC1,105.25641956329346,in training set
CC#CCCCc1ccoc1,105.2458501815796,not in training set
O=C1CC2=C(CCC2)C1,105.21016759872435,in training set
CC1(C)COC1,105.18050613403321,in training set
O=C1CC=C2CCC2C1,105.15735321044922,in training set
O=C1CC2CC=CCC12,105.14986629486084,in training set
C#CCC1CC=CC1CO,105.1300850868225,not in training set
COC1C23CC12C3,105.09469509124757,not in training set
O=C1CCC/C=C\CO1,105.07070198059081,in training set
CC1=CCC2CC2(C)C1,105.0406925201416,in training set
CC1(C2CC2)OC1CO,105.0247011184692,in training set
O=C1CCCOC(=O)C1,105.01847667694092,in training set
O=C1OC2C=CCCC12,104.96703777313232,in training set
CCC(C)C1CC1(O)O,104.93025245666503,not in training set
O=CCC12OCC1C2O,104.92349338531494,in training set
CC1OC1C1(C)CC1,104.9071870803833,in training set
O=C1CCCCCC(=O)C1,104.90102043151856,not in training set
CC1(C2(C)CC2)[CH-]CCC1,104.87802963256836,not in training set
O=CC1OCC2C(=O)C12,104.85947999954223,not in training set
O=C1CC2CCC=CC12,104.8504539489746,in training set
O=CC1(C2CC2)CO1,104.81269989013673,in training set
O=C1CCC=CC12CC2,104.74708585739135,in training set
CCC1C2(C)COC12CC,104.68519897460936,not in training set
COC#CCC1CC1(C)C,104.63299236297607,not in training set
CC(C)CC1CC1=O,104.63121585845948,not in training set
C1=CC23CCC2(C1)O3,104.57552261352538,in training set
O=C1CC12CCOC2=O,104.56862468719483,not in training set
OCC1OC2C=CC1CC2,104.55948028564454,not in training set
O=C1C=CCC12CC2,104.55330562591553,in training set
CC1=CCC(=O)C2(CC2)C1,104.54995422363282,not in training set
O=C1[CH-]C2=C(CCC2)C1,104.54754676818847,not in training set
CC1(C)OC2(CCC2)C1=O,104.44219284057618,not in training set
CC(C)C1=CC=COC1,104.40863733291626,not in training set
CC1=CCC2(CC2)C1,104.37632484436035,in training set
CC1(C2=CCCC=CC2)CC1,104.37392950057983,not in training set
O=C1CC/C=C\CCC1,104.37052354812622,in training set
OC12[CH-]CC3C14CC324,104.35946378707887,not in training set
CC1(C2(C)CCC2)CCC1,104.29539890289306,not in training set
CC1(C2(C)C34CC32O4)C[CH-]C1,104.2804799079895,not in training set
CC1(C)CC2(CCO2)C1=O,104.2745574951172,not in training set
CC(C)(O)C1(C)CCCCCO1,104.2656219482422,not in training set
COC1=CC(=O)C2CC2C1,104.26202392578126,not in training set
CC(C)OC1CC1,104.19997110366825,in training set
CC1OC2C=CCCC12,104.19581880569457,in training set
CC1(O)CC2C=CC(C2)O1,104.17702846527101,not in training set
CC1C=CC23CCC12O3,104.10840311050416,in training set
O=C1CCC(=O)C(CO)CO1,104.10414123535156,not in training set
C1=CC23CCC2(C1)C3,104.06917724609376,in training set
C1=CC2=C(C1)OCC2,104.06138229370119,not in training set
O=C1CC2(CCO2)C1,104.05596828460693,in training set
CC1(C)CC12CCC2,104.04398307800298,in training set
CC1(C2CCC2)CC1O,104.0121433258057,in training set
CC1=CC2CCC2C1,104.00730304718017,in training set
CC1(C)CCC1,103.97601108551025,in training set
C1CC1C1CO1,103.95546684265138,in training set
CCC(=O)C1(C)CCCCC1,103.93123073577883,not in training set
CC1=CCC2CC2C1,103.91312885284424,in training set
CC1C2COC12C(=O)O,103.90812110900879,not in training set
OC(O)C12CC13C=COC3=CO2,103.90242385864256,not in training set
O=C1C=CC23COC12C3,103.89568061828612,in training set
CC#CC(O)C#CCC,103.87299423217773,in training set
COC1(C)CCC1,103.80943908691407,in training set
OCC1OC2C=CCC1C2,103.7836971282959,not in training set
COCC1(C)C23CC12C3,103.78061943054199,not in training set
CC1(C2(C)CCOC2)CC1,103.77028045654298,not in training set
O=CC12OC1CC(=O)C2=O,103.74716682434084,not in training set
O=CC1(C2CC2)CCC1(O)O,103.69585323333739,not in training set
OC12CCCC=C1CC2,103.68660364151,in training set
OC12CCC3C14CC324,103.65941467285155,not in training set
CC(O)C(O)CC1(C)CC1,103.63119659423828,not in training set
CC1(C2(C)CCO2)CCC1,103.59062423706054,not in training set
O=C(CCO)C1CCO1,103.56781501770018,in training set
CC(C)C(C)C1CO1,103.5408800125122,in training set
C1=CCC2(C1)CC2,103.52495622634888,in training set
CCOC(=O)C12COC1C2,103.51955375671386,not in training set
CCC1CC1(O)C1CCC1=O,103.50311145782472,not in training set
CC(C)C1CC12CC=CC2,103.49686622619629,not in training set
CC1(C)OCC12CC2,103.49302120208745,in training set
CC1C=CCCC2OC12,103.49055719375612,in training set
O=COC12CC1C1OC1(O)C2,103.4759698867798,not in training set
CCOC(=O)C12[CH-]C1C(C)C2,103.42621021270752,not in training set
CC(O)C1(C)CCC1,103.42535667419438,in training set
C1=CC2CC(CC1)O2,103.42365922927854,in training set
CC1(C#CCO)CC1,103.34778823852542,in training set
C1=C2CCCC2OC1,103.33980741500855,in training set
C1=C2CCOC2CC1,103.31433601379393,in training set
CC(O)C12OCC1C2O,103.28487510681153,in training set
O=COC12OCC1C2CO,103.27798271179199,not in training set
OCC1CC2C=CCCC21,103.26143884658812,not in training set
CC1CC2C(C=O)C12CO,103.2416181564331,not in training set
C1=CC2CCC1CO2,103.23145637512208,in training set
OC12CCC3C1CC32,103.21553297042846,in training set
CC(C)C1=CCC2=C1COC2,103.08922653198243,not in training set
C1=C2[CH-]CC2OC1,103.06114177703857,not in training set
CC1(C)CC2CC=CCC21,103.05656442642211,not in training set
CC(C)C12CC=CCC1C2,103.04790010452271,not in training set
CC1CC2CCC=C12,103.0053924560547,in training set
C1=CC2(CC1)CC2,102.99362964630127,in training set
CC1OCC2=CCCC21,102.9769772529602,in training set
CC1CC2C=CC(C2)C1O,102.93848342895508,not in training set
CC1=CC2(CC1)CC2,102.93563327789307,in training set
CC1C=CCC2COC12,102.89186592102051,in training set
CC1(C)C=CC2CC1C2,102.8887992858887,in training set
O=C1CCCCC(O)O1,102.88274421691894,not in training set
O=CCC(=O)C1COCO1,102.84650764465331,not in training set
C1=CC2=C(C1)C[CH-]C2,102.8251901626587,not in training set
CC1(C)CCC=C2CCC21,102.71374473571777,not in training set
CC(=O)C1OCC12CC2,102.71124897003179,in training set
CC1(C)CCCOC(=O)C1,102.70659160614012,not in training set
COC(=O)C1(C)CCC12CC2,102.64494342803954,not in training set
CC1(O)OCC(=O)OC12CC2,102.61300163269044,not in training set
O=C1C2OC1C1CC1C2O,102.60450105667114,not in training set
COC1(C)CCC12CC2,102.60070228576662,in training set
O=C1CC2C3C(O)CC1C23,102.5785707473755,not in training set
C#CC(C)C12CC1CC2C,102.52166423797608,not in training set
OC1C2CCC1C1OC21,102.47984628677368,in training set
OC1C=CCCC12CC2,102.47613897323609,in training set
O=C1CCCCCC1,102.4357439994812,in training set
OCC1C2C=CCCC1C2,102.4214144706726,not in training set
CC12CC(C1)C1(O)CC21,102.36557273864744,in training set
CC1=CC23CCC2(C1)C3,102.3548550605774,in training set
O=COCC12CC1OC2O,102.35299339294433,not in training set
O=C1CCC2CCC12,102.32445955276489,in training set
CC1(C)CC1CCC=O,102.30140705108643,in training set
COCC1CC1(C)C,102.29669055938722,in training set
CC(=O)C1/C=C\CCCCC1,102.2806427001953,not in training set
O=C1CC2CCC1O2,102.25139598846435,in training set
O=C1CC23CCC12C(=O)O3,102.2497772216797,not in training set
CCCC(=O)C1CC1,102.24315357208248,in training set
CCC1C23CC12C3,102.24029483795165,not in training set
OCC1C=CCCC2CC12,102.23374195098879,not in training set
C#CC1(C)OC(=O)C2(CCC2)O1,102.20032539367676,not in training set
CCC(=O)C1(C)CCCOC1,102.18412113189699,not in training set
CC12OC1C1(CO)CC12,102.18189907073975,in training set
O=C1C2OC3CC3C1C2O,102.15551700592042,not in training set
O=C1CC2=C(CCC2)O1,102.15107364654541,not in training set
CC(=O)C1(C)CCC2(CC2)C1,102.15092811584474,not in training set
CC12CC3CC1C3C2=O,102.13255958557129,in training set
CCC1=C2CCC2OC1,102.08205127716064,in training set
CC1CCC2=CCCC21,102.07908697128296,in training set
CC(=O)CC12OC1C1[CH-]C12CO,102.05898571014404,not in training set
CC1CCC1C1OC1(C)O,102.02647762298585,not in training set
CCC12C3CC1(O)CC32,102.01925010681151,in training set
CC1(C)CCOC(=O)CC1,102.0053653717041,not in training set
CC1(C)CCC2=C1CCC2,101.99788398742677,not in training set
CC(O)C1OC1CCO,101.97787990570068,in training set
CC1(C)CC1CCOC=O,101.97233867645264,not in training set
CC1(C)COCC2(CO2)C1=O,101.96634120941162,not in training set
OCC1CC2C=CCC2C1,101.96170873641967,not in training set
C1=CC2=C(C1)CCC2,101.95266847610473,not in training set
CC1OCC1(C)C1CC1,101.90823802947999,in training set
C1=C2CCCC2CC1,101.90636157989499,in training set
CC1(C=O)CCCC1,101.87493286132813,in training set
OCCC12CC3C14CC324,101.86158065795898,not in training set
O=C1/C=C\CCCCC1,101.84601783752443,in training set
CCC1CC1(C)CC,101.83979225158684,in training set
CC1C2CC=CCC1C2,101.8316195487976,in training set
CC1C(CCCO)C1(C)O,101.78947067260742,not in training set
C1=C2COCC2CC1,101.73985815048215,in training set
C1=C2CCC2CCC1,101.71322450637818,in training set
CC1C=CCCC2CC12,101.709743309021,in training set
C#CC1CC2C=CC(C1)C2,101.69086847305297,not in training set
O=CC1OC2C=CCC1C2,101.62641801834107,not in training set
O=C1C2CC3CC3C1C2O,101.62090339660644,not in training set
O=C1CCC12COC2,101.61244058609007,in training set
O=C1C(O)C2C3COC1C32,101.5807876586914,not in training set
CC1(C)CC2CCC=C2O1,101.53391609191895,not in training set
CC1(O)CC1CC1CC1,101.53028907775878,in training set
CC(O)C1CC2=COCC21,101.52629528045655,not in training set
CC1(C)/C=C\CCCOC1,101.50542736053467,not in training set
CC(=O)C1(C)CC2(CCC2)O1,101.48872318267821,not in training set
CC1CCC1C1CC1(C)O,101.45869884490966,not in training set
CC1CC2(C=CCC2)O1,101.44241170883177,in training set
O=C1C2OC3CC3C1O2,101.40012092590331,not in training set
O=C1OCCCCO1,101.37460556030274,in training set
O=C(CO)C1C23C4OC2C413,101.3636095046997,not in training set
COC1(C(C)C)CCC1,101.32742252349853,in training set
CC(C)COC(C)O,101.30663852691649,not in training set
CC(C)C1=COCCC=C1,101.27785921096802,not in training set
CC12CCC=C1CCC2,101.27464513778688,in training set
O=C1CCOC12CC2,101.27048320770264,in training set
O=C1CC2CC1(CCO)O2,101.26520309448242,not in training set
COC1CC12C=CCC2,101.26412420272825,in training set
CC12CC=CCCC1C2,101.2600193977356,in training set
OC1(C2(O)CCC2)CCC1,101.24889163970947,not in training set
O=C1CCCOC(=O)O1,101.22483062744139,not in training set
O=CC1C=CC=CCC1,101.2103747367859,in training set
CC1CCC(C)(C2(C)CC2)C1,101.19781112670898,not in training set
CC(O)C1CC(=O)C2(CC2)C1,101.19186611175536,not in training set
CC12CCCC=C1CC2,101.16629867553712,in training set
CCC1(C)CO1,101.14248733520505,in training set
CC(=O)C1C2CC3C2C31,101.13746700286862,in training set
CC1(C(=O)O)CCC12CC2,101.12349758148193,not in training set
CC(O)C1(C2CC2)CO1,101.09030513763423,in training set
O=C(CCO)C12CCC1C2,101.05900402069094,not in training set
CC1OC2[CH-]C(O)C(O)C12,101.04816551208496,not in training set
CC1(C2CO2)CC(O)CO1,100.99910240173341,not in training set
COC12CCOC1OC2=O,100.99823932647706,not in training set
OCC1CC2C=CCC1C2,100.98612461090087,not in training set
CC(=O)C(C)CCCCO,100.92160720825197,not in training set
O=C1CC12CCCO2,100.88907184600829,not in training set
O=CC1OCC2OC12,100.88470315933226,in training set
O=CCCC(=O)C1CCO1,100.84592933654785,not in training set
O=C1C2OCC3OC1C32,100.81166257858276,in training set
O=C1CC2(C1)C1COC12,100.81079778671264,in training set
O=C1/C=C\CCCOC1,100.81053819656373,in training set
COC1(C)CC23CC(C2)C31,100.74244556427001,not in training set
O=CCC(=O)C1CCCO1,100.73925361633302,not in training set
O=C1CCC12CC1CC12,100.69421339035033,in training set
CCC1=CCCCC1,100.6828254699707,in training set
C1CC2=C(C1)CCC2,100.66802282333373,in training set
OC1=CCC2CCC=C12,100.6629780769348,not in training set
CC1(CO)CCC12C=CCC2,100.64355363845824,not in training set
CC12CCCC(C1)C2(C)O,100.63540039062501,not in training set
CC(C)C12C3CC1(C)CC32,100.61269302368163,not in training set
CC1OC12[CH-]C(CO)O2,100.55924739837646,not in training set
CCC(=O)C(C)C1CCC1,100.54173889160157,not in training set
CC1=CCCCC=C1,100.49027280807498,in training set
CC1OC2C3C=C(O)C1C32,100.48084211349486,not in training set
C1=CC2=CCCC2[CH-]1,100.43561544418336,not in training set
O=C(CO)C1C23C4CC2C413,100.42629299163819,not in training set
O=COC1COCC1CO,100.39398269653321,not in training set
CC12CCCC(C1)C2(O)O,100.39247188568115,not in training set
CCC1(C(C)O)CC1,100.38882160186769,in training set
CC1C=CCC12CCC2C,100.38171043395995,not in training set
CC1=C2CCCC2CC1,100.3627526283264,in training set
O=C1CCC12C1CCC12,100.34556732177734,in training set
CC1CCC12CCC2=O,100.33203582763672,in training set
CC(C)(C)C#CCCCCO,100.32624912261963,not in training set
CC1CC2=CCCCC21,100.31785554885865,in training set
CC1CCC2=C1CCC2,100.3140157699585,in training set
CC(O)C12C(O)C1C1CC12,100.3120059967041,not in training set
O=C1CCCCCO1,100.30967369079589,in training set
CC(CO)CC#CC=O,100.30167255401615,in training set
O=C1CCC12CCC2,100.30015659332275,in training set
O=CC12CC3(COC13)C2,100.29607839584351,not in training set
O=C(CO)C1=CCCCCC1,100.26161270141601,not in training set
OCCC12CC1(O)CCO2,100.24545974731447,not in training set
O=C1CC2COC1C2CO,100.23045787811279,not in training set
COC1(O)CC1C1CCO1,100.22203884124757,not in training set
CC1(C)CC2(CO2)C1,100.19720325469972,in training set
CC1=C2CCC2CCC1,100.14650802612306,in training set
OC1C2[CH-]CC1C21CC1,100.13179750442505,not in training set
O=C1C2CCC2C12CO2,100.11775856018068,in training set
O=C1CC23COC2C1C3,100.11356372833252,in training set
CCCC(=O)C1(O)CCCC1,100.0957763671875,not in training set
CC1CC=C2CCC2C1,100.09191856384274,in training set
O=C1CCOCOC1,100.00001039505004,in training set
O=C1C=COC12CCC2,99.99770336151123,not in training set
O=COC1CCOC1CO,99.99164619445801,not in training set
CC1CCC2CCC=C12,99.98627557754517,in training set
O=C1CC2C3CCC12C3,99.97465505599975,in training set
C#CC(C)C(C)C#CCOC(O)CC,99.96714019775392,not in training set
O=C1CC12CC1CCC12,99.9666025161743,not in training set
CC(C)(O)C#CCCCCO,99.9292510986328,not in training set
O=C1CC2(CCC2)C1=O,99.92609252929688,not in training set
CC1(O)CC1C1CCO1,99.9084758758545,in training set
CC(C)(C)C1CCCCCC1,99.87704277038574,not in training set
CC1=CCC2CCC=C12,99.87173290252689,in training set
CC1CC=C2C=CCC21,99.8311327934265,in training set
CC(C)OC1OCC1C,99.82904233932494,not in training set
O=CC1(C2CC2)CC1,99.8011137008667,in training set
COCC(=O)C1=CCCCC1,99.77513990402221,not in training set
CC(C1CO1)C1COC1(C)C,99.75594387054444,not in training set
O=C1CCCCOC1,99.74432983398437,in training set
O=COC12CC(CC1CO)O2,99.74377746582033,not in training set
CC1CCC(C)(C=O)C1,99.70763587951657,in training set
O=CC12CC(CO1)C2CO,99.70212459564209,not in training set
CC1(C2(C)CC2)CCCCC1,99.68061904907226,not in training set
CC1C(O)C2C3COC1C32,99.61386051177978,not in training set
O=C1CC12CCC(=C1CC1)O2,99.60165843963624,not in training set
CCC1CC=C2CCC21,99.5884768486023,in training set
O=C1CCC23CCC12C3,99.57934246063233,in training set
O=CC#CC1CC(O)C2OC12,99.55351839065551,not in training set
O=C1C2CCC1CC2,99.55162773132324,in training set
COC12CC3CC1C32,99.53910474777223,in training set
C1=C2CCC2C(C2CC2)C1,99.51891489028931,not in training set
O=C1C2(CC2)CC12CO2,99.51578521728517,in training set
CC1(C2(C)CC23CCC3)CC1,99.47831420898436,not in training set
C1CC2=C(CCO2)O1,99.45139207839965,not in training set
CC(=O)C1CC12OC1OC12,99.40009326934815,not in training set
CC1(C2(C)CCC23CC3)CO1,99.37855529785158,not in training set
CC12CCC3C1CC32,99.37490310668944,in training set
O=C1C2CCC1C21CO1,99.31573476791385,in training set
CC(C)C1(C=O)CCOC1,99.29101829528808,not in training set
CCC1=CC23CCC2(C1)C3,99.28654565811156,not in training set
CCC(C)CC1OC1(O)OC,99.21215133666992,not in training set
CC(C)C1=CCCC12CC2,99.19082794189454,not in training set
O=C1CC12CC1CC1C2,99.18535995483397,not in training set
CC1CC12CC1CC12,99.15575094223024,in training set
O=C1C2CC13OCCC23,99.14696130752563,not in training set
COC12CC=CCCC1C2,99.11563386917113,not in training set
CC12CCC(C1)O2,99.10412788391115,in training set
O=CC12CC1C1COC=C12,98.97820777893067,not in training set
OC12CCC(C1)C21CC1,98.92181396484375,in training set
COC1(C)CC1CCCO,98.91487960815431,not in training set
C1=CCC2(C3CC3)CC2C1,98.88844766616822,not in training set
CC1(C)CC1CCCO,98.87731971740725,in training set
O=CC1=CCC2OCC12,98.86580686569214,in training set
COC(C)C1OCC1C,98.85350246429438,in training set
CC1CC2=CCCC2C1,98.85124225616454,in training set
COC(C)C1(C)CCOC1,98.83774394989014,not in training set
O=C1CC2(CC2)C12CC2,98.74803171157836,in training set
COC1(C)C/C=C\CCCC1,98.73417205810547,not in training set
CC(C)C1CCO1,98.71690292358397,in training set
CCC1(O)C2OC13CCC23,98.66810722351076,not in training set
CC(C)C1(C)CC23CC(C2)C31,98.634112739563,not in training set
O=C1CCOCCO1,98.62655601501466,in training set
c1oc2c(c1C1CCC1)CCC2,98.60555486679077,not in training set
CCC1(O)CC1COC,98.59136486053465,in training set
COC1C=C2CCC2C1,98.58858814239501,in training set
O=C(O)C1CC12OC1OC12,98.56512403488159,not in training set
CC1(C)CC12OC1(CC1)CC2O,98.55496063232421,not in training set
COC1(C)CCOC1,98.54237613677978,in training set
CCC#CC12CC=CC1C2,98.5294708251953,not in training set
O=C1CCC2CCC=C12,98.51489086151123,in training set
CCCC1C(C)C1(C)C,98.4932790756226,in training set
O=C1CC23CCCC12C3,98.48590888977051,in training set
CC12C(=O)CCC13CC2C3,98.48098487854003,not in training set
C1CC(=C2CC2)CO1,98.46330585479735,not in training set
CC1(C)CC2(CO2)C12CC2,98.43812322616576,not in training set
O=C1C2CCC23CCC13,98.4305907249451,in training set
O=C(O)C1C2CC3C(O2)C31,98.40532312393188,not in training set
O=C1COCCCO1,98.38227424621581,in training set
CC1C=CCC12CCC2,98.36730051040654,in training set
CC12CC3CC(CC31)C2=O,98.36667242050171,not in training set
CC(=O)C1(C)CCC12CCC2,98.35905303955079,not in training set
OCC12CC1C13C=COC12C3,98.35610723495483,not in training set
O=C1OCC23CC(O2)C13,98.34783115386962,not in training set
O=C1C2CC3CCC13C2,98.31194334030151,in training set
CCC12CC3CC1C32,98.30965328216553,in training set
CC1(O)C2CCC2C12CO2,98.30834197998047,not in training set
CC1CCC1(C)C1CC1,98.30292949676513,in training set
O=CC12CC3OC1C3C2,98.29125385284425,in training set
CC1(O)CCCCCC1,98.26918926239013,in training set
O=C1CC2(C1)C1CC2C1,98.26182394027711,in training set
CC1(C)CCCC2(CC2)C1=O,98.25682830810547,not in training set
O=CC(=O)C12CCC(C1)C2,98.23776206970214,not in training set
CC1(C)C2CC2C12CC2,98.22672214508057,in training set
CCCC1=CCCC=CC1,98.21480741500855,not in training set
OCC1C2CCC1C1CC21,98.20982999801637,not in training set
CC(C)CC(C)C=O,98.20213985443115,in training set
O=CC1=CC2COC2C1,98.19711494445802,in training set
CCC1OC2C=CCCC21,98.14447383880616,not in training set
C1CC2=C(C1)OCC2,98.09421663284301,not in training set
CC1(C)CC2CC1C2,98.0783231735229,in training set
CC12CCC(=O)C1COC2,98.06787528991698,not in training set
CC(C)C12CC=CCCC1C2,98.06187572479249,not in training set
CC(=O)C1C2CC13OCC23,98.04294862747193,not in training set
CCC12C3CC4CC3C1C42,98.04278268814087,not in training set
CC1CCC12C13CC12C3,97.98377161025999,not in training set
CCCC1(C)C23CC12C3,97.95605087280273,not in training set
O=C(CO)C1CC12OC1CC12,97.94184808731079,not in training set
OCCCC12OC3C1CC32,97.915181350708,not in training set
CC1(C)COC12CCC2,97.83929615020753,in training set
O=C1CC2C1C21CCC1,97.80906400680541,in training set
CCC(=O)C1CCC12[CH-]C2,97.80761909484863,not in training set
CC(=O)OC12C3CC1C2C3,97.76772422790528,not in training set
O=C1C2CC(C2)C12CC2,97.75770196914672,in training set
CC1(C2CC3(CC3)CC2=O)CO1,97.70898685455322,not in training set
C1=CC2=CCCC2C1,97.68946266174316,in training set
COC(=O)C1CC12OC1OC12,97.68808059692383,not in training set
OCCC1C2COC12CO,97.67947921752929,not in training set
CC(C)CC(=O)CCCO,97.64375896453858,not in training set
CC12CCCCC(=O)C1C2,97.62365264892578,not in training set
CC1(C)CC2OCC2O1,97.61041584014893,in training set
COC12CC3(COC31)C2,97.57968826293946,not in training set
CC(C)C1(C)OC12CCOC2,97.5741936683655,not in training set
CC1(C2(C)CCC3(CO3)O2)CC1,97.48421077728271,not in training set
O=C1CCC2C(CO)C2CC1,97.46368703842163,not in training set
CC(O)CC1(C)CCC12CC2,97.44670085906982,not in training set
CC#CC12CC3CC1CC32,97.43163661956787,not in training set
O=C1CCC2CC(O)C(O2)C1O,97.42976770401002,not in training set
C1OCC2C3CC2C13,97.40278272628784,in training set
CC1=CCCCC12CC2,97.40007743835451,in training set
CCC(=O)C1CC2(CC2)C1,97.3681686401367,not in training set
C1=C\CCCO\C=C/1,97.27226390838622,not in training set
OCCCC1C2OCC12O,97.26965913772584,not in training set
O=CC1=CCC2CCC12,97.24375438690186,in training set
OC1(C2CCC2)CCC1,97.2432828903198,in training set
O=C1CCOC2C(CO)C2C1,97.21888313293458,not in training set
CC1(C)CCCC1,97.17264595031733,in training set
CC1C(C)(C)COCC12CO2,97.12715702056884,not in training set
CCCC(=O)C1OCC1C,97.12328338623047,not in training set
C1CC1C1C23CC12C3,97.07424926757812,not in training set
O=C1OC23CCC12CC3,97.05949687957765,in training set
CC1C=C2C=CCC2C1,97.02297153472901,in training set
CCC1(C)C2OC13OCC23,97.00482234954835,not in training set
CC1(O)CCC12CCC2,96.9802619934082,in training set
CC1(C)CC23CCCC12C3,96.97186336517335,not in training set
CC(C)(C)CC1(C)CCO1,96.96765537261962,not in training set
CC12CCOC(CC1=O)C2,96.9509906768799,not in training set
O=C1C2CC1C21CCC1,96.93722791671753,not in training set
O=C1CC2(CCCO)CC12,96.92698650360107,not in training set
C1CC23CCC2C1O3,96.92437963485713,in training set
COC1C=CCCC2OC12,96.9186622619629,not in training set
CC1(O)CC2CC3CCC321,96.89256067276003,not in training set
CC1CC1=C1CC(=O)CCCO1,96.84681634902955,not in training set
O=C1C23CCCC12CC3,96.79057550430296,not in training set
O=CC1=CCC2CC2C1,96.72546234130859,in training set
O=C(O)C1C2OC3(CC3)C21,96.70697956085205,not in training set
CC1(C)CCOC1,96.64228191375733,in training set
CCC(=O)C1CC12OC1OC12,96.63156900405883,not in training set
O=CC1COC(=O)C1CCCO,96.60784378051757,not in training set
CCC1C2CC=CCCC12,96.5846989631653,not in training set
CCC(=O)C1CCC12CC2,96.54660530090331,not in training set
O=C1CCCC2C(CO)C2C1,96.51901454925537,not in training set
CCCC(=O)C12COC1C2,96.49359245300295,not in training set
CC1C2CCC1C21[CH-]C1,96.47723121643065,not in training set
CCC1OC2C=CCC1C2,96.45333890914917,not in training set
CC1CC2=C(CCC2)C1,96.42256031036374,in training set
O=CC1=CCCC2CC12,96.39290637969971,in training set
CCC1OC=CC12CCC2=O,96.37955780029296,not in training set
CC1(C=O)CC2CC2CO1,96.36295480728151,not in training set
CC(=O)C1CC2(CCO2)C1,96.31277675628661,not in training set
CCC1C=C2CCC2C1,96.3035478591919,in training set
O=C1OC23CCC(C2)C13,96.27333965301517,in training set
CCC1(C)CC(C)(C)C1,96.2697156906128,in training set
CC(C)(C)CC1(C)CCC12CO2,96.23778953552245,not in training set
COC1CC=C2C=CCC21,96.23034439086913,not in training set
COC1(C)CCCC1,96.18265819549558,in training set
O=CC12CCCC3C14OC324,96.11968269348144,not in training set
COC12CCC(C1)C2C,96.1188159942627,in training set
CC1C(O)CC12CCC2,96.11101837158203,in training set
CC1(C)CC2(CC2)C1,96.09495010375976,in training set
CCC1=C2CCCC2CC1,96.08763160705567,not in training set
O=C(CO)C12CC1[CH-]C=CC1CC12,96.07450809478759,not in training set
C1CC2(O1)C1CCC12,96.07163286209106,in training set
CC1(C)OC12CC1CCC12,96.05362520217895,not in training set
CC1C(C)(O)COCC12CC2,96.05202236175536,not in training set
O=C1CC2CCC1C2CCO,95.98819437026977,not in training set
CC(C)(C)C1(C)CCCC12CCCC2,95.92202510833741,not in training set
O=C(CCO)C12CCC(C1)C2,95.90384845733644,not in training set
CC1(C(=O)O)CCC12CCC2,95.89024887084962,not in training set
O=C1CC12CC1CC2C1,95.88015623092652,not in training set
O=C1C2CC3(CCC3)C12,95.86712656021118,not in training set
C/C=C(/O)C1(O)CCCCOC1,95.84143524169923,not in training set
CC1(C)C2CCC2C12CO2,95.82044982910156,not in training set
CC1CCC/C=C\CO1,95.73646812438966,in training set
OC1OC2(CC3CO3)OC12,95.71638078689575,not in training set
CC1(C=O)CCC12CCC2,95.69603080749512,not in training set
CC12CCCC(O1)C2C=O,95.6688563346863,not in training set
O=CC(=O)C1CC23CC(C2)C13,95.65619993209839,not in training set
O=C1CC2(CCCO2)C1,95.64411144256593,in training set
CC1(C2CC2)OC2CC21,95.58084526062011,in training set
CC12CCC(OC1)C2CO,95.54837932586669,not in training set
CC1(C2(C)CCC23CO3)CCC1,95.53027706146241,not in training set
CCCC1OC1(C)C,95.48217716217042,in training set
COC1CC2=COCC21,95.4199182510376,not in training set
CC1(C)CC2CC2CO1,95.41194286346439,in training set
C1=C2CCCCC2CC1,95.37708864212036,in training set
CC1(C)CC12C1CCC2O1,95.35665922164917,not in training set
COCC1C23C4OC2(O)C143,95.31770362854004,not in training set
C1CC2(CC3CC32)O1,95.28927536010742,in training set
C1CC23CCC2OC13,95.2521852493286,in training set
CC1(C(=O)O)CCCOCO1,95.24813652038574,not in training set
O=CC1=CCC2CC1C2,95.21286554336547,in training set
CC1(C)CCC2CC2O1,95.20417356491089,in training set
CC(C1=CC[CH-]C1)C1CC1,95.13460273742675,not in training set
OCC1CCOC1,95.09212818145754,in training set
O=C1CCC2CCCC12,95.02569570541382,in training set
CC1(C)C2CC(O2)C12CC2,95.00689992904663,not in training set
CC1C2CCC23COC13,94.97843198776243,in training set
CC1(C2CC2)CC2(CC2)CC1=O,94.91172466278076,not in training set
OCCCCC1=CCOC1,94.85848693847656,not in training set
O=CCC12C=CCC(C1)C2,94.83008546829222,not in training set
CC12CC1C1CCOC12C,94.8294143676758,not in training set
CC1(C)CCC12CCC2,94.74350566864013,in training set
CCC12CC3CC1CC2C3=O,94.70016984939575,not in training set
CCC12CCCC=C1CC2,94.68793497085571,not in training set
COC1CC2C=CCCC21,94.62067165374756,not in training set
CC12CCC3CC1C2O3,94.59410696029661,in training set
CC1C(C)(C)CCCC12CO2,94.39495830535888,not in training set
C1C2CC3(CC3)OC12,94.34691219329835,in training set
CC1(C)CC12CC1CC1C2,94.32983827590941,not in training set
O=COC12CC1C1CC2C1,94.32179651260375,not in training set
O=C1CC12CCC21CCO1,94.2242196083069,not in training set
C1CC2C1C21COC1,94.18529911041259,in training set
O=C1OC2CCOC1O2,94.15184974670409,not in training set
CCC1C=CCCC2CC12,94.15039033889771,not in training set
CC1C2CCC2C12CC2,94.14650163650512,in training set
O=C1CCCCCCO1,94.10196037292476,in training set
C1CC2(C1)C1CCC12,94.02772989273072,in training set
CC1CC2C1C21CCO1,94.02258529663087,in training set
O=C1C=CCC2(CC1)CC2,93.99898662567139,not in training set
C1CC2CC(O1)O2,93.98917903900147,not in training set
CC(=O)CC1CC23CC(C2)C13,93.98835153579711,not in training set
O=C(CO)CC1CCC12CO2,93.93289241790772,not in training set
C1CC2CCC1O2,93.93198099136353,in training set
CC1(C2OC3(CC3)CC2=O)CC1,93.89568004608155,not in training set
CC1CC2(CC2)CC12CC2(C)C,93.83840026855468,not in training set
OCC1C2CC=COC1C2,93.8200901031494,not in training set
CCC1CC2C=CCCC21,93.80779047012331,not in training set
CC1C2CCC23CCC13,93.7803973197937,in training set
CC1CC12CC1CCC12,93.76046209335325,in training set
C1=CCOCCC1,93.73008699417115,in training set
O=C1CCCCC12CC2,93.66505727767941,in training set
CC1(O)CCCC2COC21,93.63563232421875,not in training set
CC1CCC12C1CCC12,93.6073568344116,in training set
CC1(C2CC2CO)CCC1,93.60049247741699,not in training set
CC1C2C3CCCC2C13,93.54577713012691,in training set
CC1(C2CCO2)CC1,93.53413658142088,in training set
CC(=O)CC1(C)CCCC1,93.50472316741944,not in training set
CCC1OC2CC=C(C)C1C2,93.4846495628357,not in training set
CC1CCC23CCC12O3,93.48254985809328,in training set
CCCC(=O)C1CCC1,93.46567821502686,in training set
CCC1(C)CC1,93.4232109069824,in training set
CC(=O)C1CCC12CCC2,93.4081069946289,not in training set
CC12CC3C1CCCC32,93.36749992370602,in training set
CC(C)OC1CCC1C,93.34053697586059,in training set
COC1CC2CCC=CC21,93.33260803222655,not in training set
CC(C)C(C=O)CC1CC1,93.29966077804566,not in training set
O=C1CCCC2C(CCO)C2C1,93.27186889648439,not in training set
CC(=O)C1=CCCC12CCC2,93.26265830993653,not in training set
CC1(C)C2CCC3C(C2)C31,93.26097288131714,not in training set
CC1CC12COCC(C)(C=O)C2,93.13494653701783,not in training set
CC12CCCC1C1CC12,93.12536697387696,in training set
CC1(C)CCC2CCC21,93.10847396850586,in training set
CC(CO)C1C2CC1C2,93.08982124328614,in training set
COC12CC(C1)C1CC12,93.04836874008178,in training set
OCCCCC1=CCC=C1,93.00696105957033,not in training set
C1=C2CCC2CCO1,92.99762582778929,not in training set
COC(C)C1C=CCCC1,92.99338884353637,not in training set
CC(C)(O)OCCCCCO,92.98693885803222,not in training set
COC1OC12CCC2,92.95740146636965,not in training set
CC12CC3CCC1CC32,92.87947130203248,in training set
C1CC2(O1)C1CC2C1,92.82269926071167,in training set
O=CC1OCCCC(=O)C12CO2,92.78154315948487,not in training set
COC1(C)CC2CC2CO1,92.7424355506897,not in training set
CC1(C2(C)CCC23CC3)CCC1,92.66693515777588,not in training set
CC1(C)C2CC13CCCC23,92.6660509109497,not in training set
CC12CCC1CC1CC12,92.64975585937499,in training set
CC1(C)C2CC2C12CCC2,92.59928293228148,not in training set
CC(C)C1=CCCCC12CC2,92.57583894729615,not in training set
C1CC2CC1C21CC1,92.4417414665222,in training set
C1CC2(C1)CO2,92.42878828048705,in training set
C1CC23CCC2C1C3,92.41393718719479,in training set
CCC1(C)CCO1,92.34672317504882,in training set
C1CC12CCC21CO1,92.30765323638916,in training set
C1CC23CCC12CO3,92.29115896224978,in training set
CC1CC12CC1CCC12C,92.2826054573059,not in training set
CC(C)C12CC1C1CC2C1,92.26499395370485,not in training set
CC1CC2CC3[CH-]CC3C12,92.20195083618165,not in training set
CC(C=O)C1CCC(CO)C1,92.11809597015382,not in training set
C1=C2CCCC2CO1,92.05035371780394,not in training set
CC12CCC13CCC3C2,91.98424921035766,in training set
COCCC(=O)C1CC1,91.96143236160275,in training set
C#CC(C)C#CCOC,91.89454441070558,in training set
CC1C2CC13CCCC23,91.85406818389893,in training set
O=CCC12CCC1CC2,91.79298343658446,in training set
CC1CC1C1(C)CCC1,91.77217960357666,in training set
COC12CC(CO1)CO2,91.76641464233398,not in training set
O=CC12CC3CC(CC31)O2,91.76433296203614,not in training set
CC1(C)C2CC1C1(CC1)C2,91.721178150177,not in training set
O=CC12OC1CC1CCC12,91.71274700164794,not in training set
CC1C2CC1C21CCC1,91.70213174819948,in training set
CC1(C2CCC23CC3)CO1,91.69515571594239,not in training set
CC1CC2(C1)C1CCC12,91.669606590271,in training set
CCCC1C2C34CC23C14O,91.6662992477417,not in training set
CC1CC2CC12C1CC1,91.66461133956909,in training set
C1CC23COC2(C1)C3,91.56734447479248,in training set
CC1(C2(C)CO2)CCCOCC1,91.56579647064208,not in training set
CCC12CC3(C)CC1C2C3,91.56493053436279,not in training set
CC1CCC1(C)C1CCC1,91.47170810699464,not in training set
CC1(C2CCC2)CC1,91.46477890014653,in training set
C1COC1,91.46393728256224,in training set
CC(O)C1CC12CCOC2,91.44238624572755,not in training set
CC1C2CC3CCC31C2,91.43696441650391,in training set
CCC1CC2CCC=CC12,91.43470754623414,not in training set
OCC1(O)CC2CCC1CC2,91.42765712738037,not in training set
O=C1CCCCCCC1,91.41187210083008,in training set
CC1(O)CCCCCCC1,91.37111911773681,not in training set
CC(C=O)C1CCC12CC2,91.31724109649657,not in training set
CC(O)=CCCCCCO,91.28768501281738,not in training set
OCCC1C=CC2(CCC2)C1,91.24754123687742,not in training set
CC1(C2CC2)OCC12CC2,91.22233304977416,not in training set
C1CC2C1CCC21CO1,91.1870394706726,in training set
O=CC12C=COCC1CC2,91.13762731552124,not in training set
OC1CC2(CC3CC3)CC12,91.11327238082886,not in training set
CC1(C)C2CC1C21CCC1,91.10513687133789,not in training set
C1=CC2(CC2)CO1,91.10124282836915,not in training set
CC1(C)CC2COC2C1,91.05693511962892,in training set
CC#CCCC1CC1(C)C,91.04378166198731,not in training set
CC1COC2CC1C2C=O,91.0174033164978,not in training set
CCCC12C=CC3(C1)OC3(O)CC2,90.98601884841918,not in training set
CCC1(C)CCC12CC2,90.96263771057131,in training set
CC1CC2C1C21CCC1,90.9605188369751,in training set
CC1C2CC(C2)C12CC2,90.94767141342159,in training set
CCC(=O)C12CCC(CC1)C2,90.88246231079101,not in training set
CC1CC12CC1CC1C2,90.81724634170533,in training set
COC1C2CCC1(C)OC2,90.78723020553588,not in training set
O=C1C2CC3CCOCC132,90.70473833084107,not in training set
CC1(C2(O)CCCOCC2)CC1,90.55308990478517,not in training set
CC1(C2(O)CCCCCC2)COC1,90.51226739883423,not in training set
C1OC(C2CC2)O1,90.50378780364991,not in training set
CCC1CC2C=CC(C2)O1,90.47478561401368,not in training set
CC1CC2CC3C[CH-]C1C32,90.33686208724976,not in training set
O=CCCC1=CCC2CC2C1,90.19482307434082,not in training set
CC1CC12CCC21CC1,90.18466148376469,in training set
COC1=CCC2(CCC2)C1,90.1834711074829,not in training set
CC1CC23CCC12CC3,90.1769199371338,in training set
CC(C)C1CCC1,90.14898853302003,in training set
CC1CCC12C1CC2C1,90.00862846374514,in training set
CC1C23CCCC12CC3,89.91138668060303,in training set
CC(C)(O)CCCCCCO,89.84110660552979,not in training set
C1=CCCC2CC2[CH-]1,89.8300729751587,not in training set
CCC1C(=O)COCC12CC2,89.74631710052489,not in training set
COC1C=C2CCCC2C1,89.73239402770996,not in training set
C#CCCCCC1=CCC=C1,89.71435880661011,not in training set
CC(=O)C1(C)CCCCOCC1,89.70097026824952,not in training set
CC(C)C1(C)CCCOC1,89.60902080535888,not in training set
CC1(C)COCCCO1,89.55738697052003,in training set
CC(C)OC12CC1C1CC2O1,89.55438146591187,not in training set
O=CC12CC1CC1CCC12,89.46702585220336,not in training set
C1=C\COCCCC/1,89.37485971450806,in training set
CC1(C)CC12CCC1(CC1)C2,89.37103939056396,not in training set
C1=CCCC(C2CC2)=C1,89.26931066513063,not in training set
CCCC1CC1(C)C,89.22632751464843,in training set
CC1CCC23CC(C2)C13,89.18190116882323,in training set
CCC1=CCCC2(CC2)C1,89.15503330230712,not in training set
COC1C23CC12C31CCC1,89.11578369140625,not in training set
CC1(C2CCC2)CCO1,89.09422435760496,in training set
O=CC1C2CC13CCCC23,89.09114637374878,not in training set
CC1CC2CC1C1(C=O)CC21,89.0198341369629,not in training set
CC(C=O)C1CC23CC(C2)C13,88.96375064849853,not in training set
C1CC2C3COC2(C1)C3,88.91703424453736,in training set
C1=C\CCCCCC/1,88.90404176712039,in training set
CC1/C=C\CCCCC1,88.88630962371826,in training set
C1CC1C12CC3CC1C2C3,88.80631895065306,not in training set
C1=COC2CC2CC1,88.6652780532837,not in training set
CC1(C2(C)CC2)CCCOCC1,88.64135713577271,not in training set
CC(C)C12CCC3(CCC31)C2,88.54375982284546,not in training set
CC1CC(C)(O)CC2CCCC12,88.48255195617676,not in training set
CCCC1C23CC12C3,88.44863147735595,not in training set
O=CC12CC(C1)C21CCC1,88.40090627670288,not in training set
CC1(C)CCCCC1,88.39279251098631,in training set
CC1C2CC3(CCC3)C12,88.38995151519777,in training set
COCCC#CO,88.38576545715333,not in training set
CC1C/C=C\CCCC1,88.27508745193481,in training set
CCOC12C3CC1C2C3,88.24004755020141,in training set
CC(=O)CC12CCCCC1C2,88.18936290740967,not in training set
CC1(C2(O)CCCCCC2)CCO1,88.15151376724243,not in training set
O=CC1CC2(CC2)C12CC2,88.09899520874022,not in training set
CC(C)C12CC1C1CCCC12,87.97475652694703,not in training set
CC1C2CCCC3(CC13)O2,87.88070669174193,not in training set
C1CC2(CO2)CC12CO2,87.85898847579956,in training set
CCC1(C)CC=CCCC1,87.78246030807495,not in training set
COC12CC1CC1CCC12,87.76789112091063,not in training set
COC12CCCC1C1CC12,87.75248403549193,not in training set
CC1CC2(C1)C1CC2C1,87.69826498031614,in training set
OCC1C2CCCC13CC3C2,87.64970874786376,not in training set
O=C1CCC12CCCCO2,87.63889617919924,not in training set
COCC12CC=CCC1C2,87.57697429656983,not in training set
CC1CC12CCC1CCC12,87.54393224716188,not in training set
O=C1CCOC12CCCC2,87.52207956314088,not in training set
CC1C2CCOC1CO2,87.46947088241578,in training set
CCC12CCC3CC3C1C2,87.43141374588012,not in training set
O=C(CO)CC1CCCC1,87.32970113754271,not in training set
CC(=O)CC12CCC(C1)C2,87.32105350494383,not in training set
CCC1CC12CCC1(CC1=O)O2,87.27273225784302,not in training set
O=C(CCO)CC12CC(C1)C2,87.26433906555175,not in training set
COC1C2CCC23COC13,87.20808849334718,not in training set
CC1(C)CCC12CCCC2,87.16999244689941,not in training set
C1CC2CCC1C21CC1,87.1255844116211,in training set
CC12CC(C1)CC21CC1,86.81452932357787,in training set
C1CC23CCC2(CO1)O3,86.71982555389403,in training set
COCC1=CC=CC=CC1,86.70325460433959,not in training set
C1CC23CCC2(C1)C3,86.6789563179016,in training set
OC1(C2CCC2)CCC2(CC2)O1,86.58864946365355,not in training set
O=CC1(C2CC2)CCC1,86.56932191848753,in training set
CC(C)C1(C)CC2(CCC2)C1,86.52470169067384,not in training set
COC1CC2C3CC1CC32,86.49658880233766,not in training set
COC1OC12CCC1CC12,86.47014284133913,not in training set
COC1CC2CC13OCC23,86.44890222549438,not in training set
CC(C)C12CC1C1(CCC1)C2,86.33677015304565,not in training set
CCC1C2CC1C1CC2C1,86.31694021224975,not in training set
CC1(C2CC2)CCC1,86.2885087966919,in training set
COC1C2CCC3C(C2)C31,86.22536439895632,not in training set
CC1CC12CC1(CC1)C2,86.18883724212644,in training set
CC1(C=O)CCCCCCO1,86.04481840133667,not in training set
COC12CC(C1)C21CCC1,86.0229112625122,not in training set
COC1CC2CC13COC23,86.00847787857057,not in training set
CC1(C)COCC2(CO2)C1,86.0052911758423,not in training set
COC12CC1CC21CCC1,85.93859863281251,not in training set
O=C(O)C12CCC(CC1)CC2,85.89303035736084,not in training set
CCC1(C)CC12CCCC2,85.8891830444336,not in training set
COC1C2OC13CCCC23,85.85821981430053,not in training set
CC1CCC(C)(CC=O)C1,85.69997291564941,not in training set
OCC1CCCCC2OC12,85.53062324523925,not in training set
COC1CCC23CCC12O3,85.50370359420776,not in training set
C1=COC2(CC1)CC2,85.44600744247435,not in training set
CC1(C2(C)CC2)CCCCCCC1,85.3592571258545,not in training set
CC1(C=O)CCCCOC1,85.27357645034789,not in training set
COC1(C)CCCOC1,85.24771842956544,in training set
CC1(C2CCCCC2)CO1,85.15092029571532,not in training set
O=CCC1CCC1,85.11999130249023,in training set
COC1(C)CC2(COC2)C1,85.11354036331176,not in training set
COCC1=CCCCC12CO2,85.07094850540162,not in training set
C1CC23CC2(CO1)CO3,85.03496608734127,in training set
C1CCC23CCC2(C1)O3,85.00092115402222,in training set
CC12CCCC(O)C1CCC2,84.96741390228271,not in training set
CCC1C=CCC2CC1C2,84.94437294006349,not in training set
CC1CCOCC(=C2CC2)C1,84.91862754821776,not in training set
CC(C)OC1(C)OCCCCO1,84.85359888076782,not in training set
CCCCC(=O)C1CO1,84.66360912322999,in training set
C1CC23CCC2(C1)OC3,84.65804672241214,in training set
CC12CCC(C1)C2,84.63774185180662,in training set
COCC1(C)CCO1,84.53992614746095,in training set
COCCCOC(C)(C)O,84.42326774597169,not in training set
CC1(CO)CC1CCCCO,84.41413402557373,not in training set
CCCCC1C(C)C1(C)O,84.35673599243164,not in training set
CCCC(=O)C1CCCO1,84.14212074279786,not in training set
CC1CC23CCC2(C1)C3,84.1303095817566,in training set
C1COC23CCC2(C1)C3,84.08342247009277,in training set
COC1CC12CC1CCC12,84.04670820236207,not in training set
O=CC12CC3CC1CC2C3,84.01781291961669,not in training set
CC#CCCOC12COC1(C)O2,84.00625123977662,not in training set
CC1(O)CCCC12CCCC2,83.95407390594481,not in training set
COC1CC12CCC1CC12,83.90975904464723,not in training set
COC1C2CC2CC12CC2,83.90242795944212,not in training set
COC1CCC12CC1CC12,83.89742937088012,not in training set
COC1CC2CC13CCC23,83.83909587860109,not in training set
CCC12CCC1C1(CC1)C2,83.75724868774414,not in training set
CC1CC2(C)CCC1C2,83.75001029968264,in training set
C1CC23CCOC2(C1)C3,83.7442826271057,in training set
O=C1CCCOCCC1,83.58585138320925,in training set
CC1(C=O)CCCOCC1,83.55791711807251,not in training set
C1CCCCC1,83.53278102874755,in training set
COC1C2CC13CCCC23,83.48901376724243,not in training set
COC(C)CC(C)C,83.46411514282228,in training set
C1CCOC1,83.42631349563598,in training set
COCC#CC(C)C,83.39488763809206,in training set
CC(=O)C12CCCC(CC1)C2,83.37516002655029,not in training set
CCC1(C)CCC12CCC2,83.34493141174318,not in training set
CC1CC2CCC(=O)C1CC2,83.32831306457521,not in training set
C1=C\OCCCCC/1,83.19350175857545,not in training set
C1CC2CCC1C2,83.14264020919802,in training set
CC(C)C12CC3CC(C1)C2C3,83.11648778915406,not in training set
O=C1CC2CCCC1(CO)CC2,82.9967279434204,not in training set
OCC1C2CCCCCC12,82.9855170249939,not in training set
O=C(O)C12CCCC(CC1)C2,82.932147026062,not in training set
CCC12CCC(O)C1CCCO2,82.92505645751955,not in training set
C1CC2C3CCC2(C1)C3,82.86157894134521,in training set
COC1C2CC(C2)C12CC2,82.84207572937011,not in training set
CC(C)C1(C)CCCCOC1,82.71383991241454,not in training set
COC12CC(CC13CC3)C2,82.68520412445068,not in training set
CCC1(C)CC(C)C2(CC2)C1,82.68188610076905,not in training set
COC1C2CC1C1(CC1)C2,82.6802670478821,not in training set
O=C1CCCC12CCCC2,82.5686827659607,not in training set
COC(C)CC1CC1,82.51193714141846,in training set
CC1OCCCC2(C=O)CC12,82.43041286468507,not in training set
CCOCC12CC1(C)CO2,82.19326524734498,not in training set
CC(=O)CC12CCC(CC1)C2,82.1597686767578,not in training set
CC1(C2CC3(CC3)C2)CC1,82.15403089523316,not in training set
C1CC1C12CCC3(CCC31)C2,82.13130931854248,not in training set
O=C1CC12CCCCOC2,82.07200145721436,not in training set
COCC(=O)C12CCC(CC1)C2,82.0020432472229,not in training set
CC(C)CCCC(C)O,81.83540649414063,in training set
CC1C2OCCCCC12C,81.81942481994628,not in training set
CC1(C)CC2(CCC2)C1,81.78701095581053,in training set
CCC1CC12OCC21CC1,81.76438713073729,not in training set
CCC1CC2CC13CCC23,81.75076093673707,not in training set
COC12CC3CC1CC2C3,81.66606740951536,not in training set
COC1CCC23CCC12C3,81.63914880752563,not in training set
CC1CCC23CCCC12C3,81.6114323616028,not in training set
C1CC1C12CCC13CCC2C3,81.60887203216554,not in training set
CCC1CC23CCC2CC13,81.60219764709474,not in training set
CCC(=O)CC1CCCC1,81.43262672424316,not in training set
C1CCC2(CO2)OC1,81.34652051925659,not in training set
CC1(C2CC2)CCC2(CO2)C1,81.30781984329224,not in training set
OCCCCCC1=CCC=C1,81.30323371887208,not in training set
CCC1(C)CCC1,81.29633083343505,in training set
OCCCOC12CC(C1)O2,81.2548336982727,not in training set
O=CCC12CC3CCC1C2C3,81.25091190338135,not in training set
CC1CCCOC12CC2,81.219606590271,in training set
CCOCC12COC1(C)C2,81.15783843994141,not in training set
CC1(C)CCC1C1CCC1,81.0737201690674,not in training set
CC1CC1C12CCC13CCC2C3,80.89679346084594,not in training set
CC(O)C12CCCOCC1C2,80.83567876815796,not in training set
CC1CCCCC12CO2,80.83380689620975,in training set
CC(=O)C1CCCCCCC1,80.83009347915649,not in training set
COC1CC12CC1(CC1)C2,80.8070652961731,not in training set
COC(C)C12CCC13CCC2C3,80.78257179260252,not in training set
C1CC23CCC2(CO1)C3,80.69018630981446,in training set
COCC12C=CCCC1CC2,80.59656658172608,not in training set
C1CC2(C1)CCO2,80.4748384475708,in training set
CC1(CC=O)CCC2(CC2)C1,80.46429843902588,not in training set
O=COCCC12CC(C1)O2,80.4609899520874,not in training set
C1CC2(C1)CC2,80.44222917556763,in training set
CCC(=O)C12CCCCC(C1)C2,80.4229824066162,not in training set
COC1CC2CC3CCC321,80.37803821563722,not in training set
COCC1(C)CC12CCC2,80.2506365776062,not in training set
COCCC(=O)C1CCC1,80.17684507369994,not in training set
CC1(C)COC2CCC1CC2,79.81054391860962,not in training set
CC1(C2CC3(CC3)CO2)CC1,79.78406391143798,not in training set
CC1(C2CC2)CCOC1,79.77590999603271,in training set
C1CC12CCC1(CO1)C2,79.73342638015745,in training set
C1=CCC(C2CC2)C=C1,79.72392406463624,not in training set
COC1CC2CC3(CC3)C21,79.42262477874756,not in training set
COC1C2CC3(CCC3)C21,79.32163953781127,not in training set
OCC1CC2CCC1CC2,79.24582805633545,not in training set
C1CC23CC(C2)C3(C2CC2)C1,79.19253444671631,not in training set
COCC12CC3(COC13)C2,79.1666579246521,not in training set
CC#CCCCCCO,79.15350265502933,in training set
C1CC2CC1CC21CC1,79.04906740188599,in training set
COC1C/C=C\CCCC1,78.93521871566773,not in training set
COC(C)C1CCC(CO)C1,78.846626663208,not in training set
CC1(C)C[CH-]CCOC1,78.7178198814392,not in training set
COCC1C2CC1C2,78.41694259643555,in training set
OCCCCC1CC2CC12,78.25309038162233,not in training set
C1CCC23CCC2(C1)C3,78.13971462249756,in training set
CC1(C2=CCCCOC23CC3)CCC1,78.09388885498048,not in training set
CCC1CC12CC1CC1C2,77.99665460586547,not in training set
CC1(C)CCCCCC1,77.69822864532472,in training set
OCCCCC12CC(C1)O2,77.40567512512206,not in training set
CC1(C)CCC2OCCC2C1,77.38322162628174,not in training set
CC1(C2CCC2)CCC1,77.239462852478,in training set
CC1(C)COCC2(CCO2)C1,77.20306892395021,not in training set
OCC1CCCC2CCOC12,77.10821428298951,not in training set
COC1CC/C=C\CCC1,77.0152708053589,not in training set
OCCCCC12CCC1C2,76.98918170928955,not in training set
C1CC23CCCC2(C1)C3,76.94210767745969,in training set
COC1CC23CCC2(C1)C3,76.94148778915407,not in training set
COC1CC12CC1CC2C1,76.92936429977416,not in training set
C1CCOC(=C2CCC2)CC1,76.92582397460939,not in training set
COC(C)CC12CC3C(C1)C32,76.28066148757935,not in training set
CC(O)C12CCOCCC1CC2,76.27186994552612,not in training set
CCC1(C)CCCCC(C)O1,76.24840145111084,not in training set
CC(C)CC12CC3CC3C1C2,76.17862462997437,not in training set
CC(C)C12CCCCC(C1)O2,76.14675722122192,not in training set
CC1(C2CO2)CCCCCO1,76.07598266601563,not in training set
O=C1CCCCCOCC1,76.06238069534302,not in training set
CC1(C)CCCCOC1,76.04782419204712,in training set
C#CC#CCCOC,76.03035984039305,in training set
COCCC1CC1(C)C,75.89184074401855,in training set
C#CC#CCCCC,75.68491487503053,in training set
COCC12CC3CC1C2C3,75.62349138259887,not in training set
O=C1CCCC(CCCO)CC1,75.54437475204469,not in training set
CCC12CC(CC13CC3)C2,75.46361122131349,not in training set
O=CCCC12CC3CC1C3C2,75.36762695312501,not in training set
CC1(C2CCC3(CC3)C2)CC1,75.31687383651735,not in training set
CCC1CC2(C1)C1CC2C1,75.0991406440735,not in training set
OC1(C23CCCC(CC2)CC3)CC1,75.05906925201417,not in training set
COCC12CC(C)(C1)C2,75.02532444000244,in training set
O=C1CCOCCCOC1,74.9961007118225,not in training set
CCC(C)CC(OC)OC,74.47985076904297,not in training set
CC1(C)CCCOCC1,74.44030809402469,in training set
CC1(C2CC2)CCC2(CC2)C1,74.38805017471313,not in training set
O=C1CCCC2CC(C1)C2,74.30282630920411,not in training set
CCCC1C2CCC1C(=O)C2,74.19907007217407,not in training set
CCC(=O)CCC1CCC12CC2,73.95898437499999,not in training set
CCC1CC12CC1CC2C1,73.94419212341309,not in training set
CCC1(C)CCC2(CC2)C1,73.83280086517335,not in training set
OCCCCCCC12CC=CC1C2,73.79410867691038,not in training set
OCCCCOC12CC3CC3C1C2,73.21396875381468,not in training set
COCC12CCC1C1CC2C1,73.15848474502563,not in training set
CC1(C2CC23CCC3)CCC1,73.15043210983278,not in training set
O=C(C1CCC1)C12CCCCC1C2,73.11334953308106,not in training set
CC(=O)CC1CC2(CCC2)C1,72.8755027770996,not in training set
CCCC1(C)CCC23CCC12C3,72.85890073776244,not in training set
CC(C)CC12C=CCC(C1)C2,72.72881927490235,not in training set
CCCC12CCCC1C1CC12,72.70472679138184,not in training set
CCCCC(=O)C1CCO1,72.28820161819458,not in training set
CC(C)C1CCC2CC2C1,72.09622859954834,not in training set
CCCC1CC12CC1CC12,72.07072935104371,not in training set
CCCOC12C3CC1C2C3,71.91500148773193,not in training set
C1CCC2(CC1)CO2,71.21912508010865,in training set
C1CC12CCC1(CC1)C2,70.95112972259521,in training set
COCC1(C)CCC12CCC2,70.9414566040039,not in training set
CC(C)CC1(C)CC2(CC2)CO1,70.83278102874755,not in training set
CC1(C2CC2)CCCCCO1,70.54596672058106,not in training set
CCCC12CC1CCC21CC1,70.43466157913207,not in training set
CCC1(C)CC2(COC2)C1,70.1682996749878,not in training set
CC(C)C#CCCCOC=O,69.98209590911864,not in training set
OCCCC12CCC(C1)C2,69.74494161605836,not in training set
CCCCCC(C)C(C)(C)C,69.68701333999635,not in training set
CCC1/C=C\CCCCC1,69.3846471786499,not in training set
CC1CCCCCC12CC2C,69.34280576705932,not in training set
CCC1OC2CCC1CC2,69.18939018249512,not in training set
CC1(CC=O)CCCCOC1,68.92729425430298,not in training set
C1COC2(C1)CCCO2,68.90515365600587,in training set
CC12CCCC(CC1)CO2,68.32134227752687,not in training set
CCCC12CCC13CCC3C2,68.13280820846556,not in training set
CCCC12C=CCC(C1)C2,67.95775108337403,not in training set
CCC(C)CC(=O)CCOC,67.56645889282225,not in training set
CCCCC12CCC=CC1C2,67.09839601516722,not in training set
CC(C)C1CC2(COC2)C1,67.02431459426879,not in training set
CCCC12CC1CC21CCC1,66.82888822555543,not in training set
CC(C=O)C1CCCCOC1,66.72980451583862,not in training set
COC1(C)CCCCCCC1,66.05347137451172,not in training set
COCC12CC3CC1CC2C3,65.98284788131714,not in training set
CC1CC1C1(C)CCCOCC1,65.85515718460084,not in training set
OCCCCCC12CCC1C2,65.59322938919068,not in training set
COCC12CC(C1)C1(CC1)C2,65.25256357192993,not in training set
CC1(C)CCC2(CCCC2)C1,65.22734212875366,not in training set
CC#CCCOC12CCOC1O2,65.08408527374267,not in training set
CC(CCO)C1CCOC1,64.93797082901,not in training set
CCCOC12CC3CC3C1C2,64.89179859161376,not in training set
C1CCCCCC1,64.87456226348874,in training set
CCCC1(C)CC=CCCC1,64.77301445007325,not in training set
CC1(C23CCCC(CC2)CC3)COC1,64.76294126510619,not in training set
C1CC2CCC(C1)OC2,64.51316843032839,in training set
CCC1(C)CCCC2(CC2)C1,64.25799970626831,not in training set
CCCC1(C)CCC12CCC2,64.05870428085326,not in training set
CC1CCC2COCC1C2,63.94736938476563,not in training set
C1CC(C2CCO2)C1,63.52527256011964,in training set
CCC1CC2COCCC12,63.50340042114257,not in training set
OCCCCC1CCO1,63.419549846649176,in training set
OC1CCC1CCC1CC1,62.71964206695556,not in training set
C1COC2(C1)CCOC2,62.55961627960205,in training set
CCOC1CCC12CC2,62.22627544403076,in training set
COCC1(C)CCC2(CC2)C1,62.06429147720338,not in training set
CCC1CCCC2CCC12,62.057125186920175,not in training set
CCC(C)C12CCC(CC1)C2,61.916610622406004,not in training set
CC1(C2CC2)CCCOCC1,61.81859359741211,not in training set
CC1(OCCCCO)CCC1,61.770282173156744,not in training set
CC1CCCC12CCCC2,61.408452701568606,not in training set
CCC1(C)CCCC2(CC1)CC2,61.39097604751588,not in training set
COCCC12CC3CC1C2C3,61.07930841445923,not in training set
COCCC12CC(C1)C21CC1,61.076498126983644,not in training set
C1CC2(C1)CCC2,60.99010419845581,in training set
CCCCCC12CC1C1CC12,60.54750509262085,not in training set
O=CC12CCCC(CC1)CC2,60.47424755096436,not in training set
CC(C)CC12CC(C1)C2,60.4737455368042,in training set
CCOCCC1CC1(C)C,59.465776634216304,not in training set
CC1(CO)CCCCCCC1,59.39539861679077,not in training set
CCC1(C)CCCCOC1,59.22426872253418,not in training set
CC(C)CC12CCCC1CC2,58.703136348724364,not in training set
CC12CCCC(CC1)CC2,58.52788524627686,not in training set
CCCCC12COC1C2,58.402902507781974,in training set
C1CCC2(CC1)CC2,58.01463756561279,in training set
C1CCC2(C1)CCCO2,57.76915502548217,in training set
COCCC#CC(C)C,57.67145481109619,in training set
CCC1CCCCC12CC2,57.63048839569092,not in training set
COCOCC12CCC1C2,57.59133272171021,not in training set
CC1CCCCC(C(C)C)C1,57.43535223007202,not in training set
CC1(C2CCCCCCC2)CC1,57.0593638420105,not in training set
CCC1CCC12CCCC2,56.79148263931274,not in training set
C1CCCOCC1,56.65123186111452,in training set
OCCCCC1COC1,56.42529668807983,in training set
CC(C)OC1CCCOC(C)C1,56.36373405456543,not in training set
CCCCC12CC(C1)O2,56.34840040206909,not in training set
CC1CC(C2CC2)COCO1,54.99372186660767,not in training set
CC1CCC(C(C)C2CC2)C1,54.656445217132564,not in training set
C1CC2COCC(C1)C2,54.37137947082519,in training set
CCC1(C)CCCOCCC1,54.18202257156372,not in training set
CC(CCCCO)C1CC1,53.52393417358398,not in training set
CCC1CCC2CC(C1)C2,53.231976222991946,not in training set
CC(C)CC1(C)CCCCC1,53.02918758392334,not in training set
C1CCCCCCC1,52.70388765335085,in training set
COCC1(C)CCCC2(CC2)C1,52.47419786453247,not in training set
COCCC1CCC12CO2,52.21766204833985,not in training set
CCC1(C)CCCCCCC1,51.652287292480466,not in training set
OCCCCCC1CC1,51.59666347503662,in training set
CC(C)CC1CCC1,50.58837976455688,in training set
C1CCC2(C1)CCOC2,50.135244083404544,in training set
C#CCC(CC)CCCC,49.8137336730957,not in training set
CCCC1(C)CC(C)CCCO1,49.76204957962037,not in training set
COCCC1(C)CCC1,48.17081975936889,in training set
CC(C)(C)CCCCCCCO,47.90323715209961,not in training set
CC(C)CC1(C)CCCCCC1,47.79781932830811,not in training set
C1CCCOCCC1,46.89298458099366,in training set
CCCCCC1CC1(C)C,46.804848194122314,not in training set
CCCOCC(C)(C)CC,46.78755006790161,not in training set
COC(C)CCC1CC1,46.30527553558351,in training set
CCCOC1CCC12CC2,45.807645606994626,not in training set
CC1CCCCCC(C)CC1,45.12204389572143,not in training set
C1CCC2(C1)CCCC2,43.202604103088376,in training set
COCC1(C)CCCCCC1,42.9356448173523,not in training set
CCCCCCCC12C3CC1C2C3,41.4833293914795,not in training set
CCCCC1(C)CCC1,41.300944805145235,in training set
OCCCCCCC1CC1,41.00112199783326,not in training set
OCCCCCC1CCC1,40.65527257919312,not in training set
C1CCC(C2CC2)CC1,40.511301803588864,in training set
C#CC#CCCCCCC,40.51023330688476,not in training set
CCCCOC(C)C,40.263595390319836,in training set
CCOCCC1(C)COC1,40.19546394348145,not in training set
CC#CCCOC1CCCO1,40.02342948913574,not in training set
CCCC1(C)CCCCCC1,38.221657848358156,not in training set
CCCCCCC1CC1(C)C,38.080308532714845,not in training set
CCCCCC1(C)CCCO1,35.97939414978027,not in training set
COCCOCC(C)C,34.68907709121704,in training set
CCCCC1(C)CCCOCC1,34.3660530090332,not in training set
CCC#CCCOC,33.744104290008565,in training set
CCCOCC(C)C,32.152170562744146,in training set
O=CCCCC1CCC1,27.483851909637455,in training set
CCCC1CCCC1,25.96525716781616,in training set
CCCCCCOCCO,24.43091039657593,not in training set
CC#CCCCCCOC,19.43403425216675,not in training set
CCCCCC(C)CC(C)C,13.019143390655517,not in training set
CCCCCCC1CC1,8.321362686157224,in training set
CCCCCC1CCCC1,1.8247051239013672,not in training set
