COC1(C(C)C)CC1=O,116.62786521911622,not in training set
CCC1C(O)CC1(C)C,114.8692770004272,in training set
CCC1(C(C)C)CC1=O,113.67013130187988,not in training set
CCC(C(C)=O)C(C)C,113.60126895904546,in training set
COC12C(=O)C1CC2C,111.05720291137696,not in training set
CC1C2C(O)C1C2(C)C,109.5073072433472,in training set
CCC(C(C)C)C(C)O,108.67415637969971,in training set
CC12CC13C(=O)C#CC23,106.28376502990723,not in training set
CC12COC13C(=O)C3C2,104.92341594696045,not in training set
CC1C2COC13C(=O)C23,101.04435930252076,not in training set
CC1C2C3OCC2(C)C13,98.23527317047117,in training set
