{
    "debug": {
        "output": {
            "stages": {
                "stagesSize": "1",
                "stages_0": {
                    "treatObjective": "true",
                    "mapping": {
                        "fullStateMapping": "false",
                        "stateNameMapping": {
                            "stateNameMappingSize": "0"
                        }
                    },
                    "eso": {
                        "model": "C:\/dyosCESgitSTUDENTS_BUILD\/input\/FMI\/wobatchinactiveFmu",
                        "relativeFmuTolerance": "0.000000",
                        "type": "FMI"
                    },
                    "integrator": {
                        "durations": {
                            "durationsSize": "1",
                            "durations_0": {
                                "name": "durations",
                                "isOptimizationParameter": "true",
                                "lowerBound": "1000",
                                "upperBound": "1000",
                                "value": "1000",
                                "parameterType": "DURATION",
                                "parameterSensitivityType": "NO",
                                "lagrangeMultiplier": "0",
                                "grids": {
                                    "gridsSize": "1",
                                    "grids_0": {
                                        "numIntervals": "0",
                                        "duration": "0",
                                        "hasFreeDuration": "true",
                                        "isFixed": "false",
                                        "approximationType": "PIECEWISE_CONSTANT",
                                        "timePoints": "",
                                        "values": "1000",
                                        "lagrangeMultiplier": "0",
                                        "firstSensitivities": {
                                            "firstSensitivitiesSize": "17",
                                            "firstSensitivities_0": {
                                                "mapParamsCols": {
                                                    "mapParamsColsSize": "0"
                                                },
                                                "mapConstrRows": {
                                                    "mapConstrRowsSize": "1",
                                                    "mapConstrRows_0": "X7|0"
                                                },
                                                "values": {
                                                    "valuesSize": "1",
                                                    "values_0": ""
                                                }
                                            },
                                            "firstSensitivities_1": {
                                                "mapParamsCols": {
                                                    "mapParamsColsSize": "0"
                                                },
                                                "mapConstrRows": {
                                                    "mapConstrRowsSize": "1",
                                                    "mapConstrRows_0": "X7|0"
                                                },
                                                "values": {
                                                    "valuesSize": "1",
                                                    "values_0": ""
                                                }
                                            },
                                            "firstSensitivities_2": {
                                                "mapParamsCols": {
                                                    "mapParamsColsSize": "0"
                                                },
                                                "mapConstrRows": {
                                                    "mapConstrRowsSize": "1",
                                                    "mapConstrRows_0": "X7|0"
                                                },
                                                "values": {
                                                    "valuesSize": "1",
                                                    "values_0": ""
                                                }
                                            },
                                            "firstSensitivities_3": {
                                                "mapParamsCols": {
                                                    "mapParamsColsSize": "0"
                                                },
                                                "mapConstrRows": {
                                                    "mapConstrRowsSize": "1",
                                                    "mapConstrRows_0": "X7|0"
                                                },
                                                "values": {
                                                    "valuesSize": "1",
                                                    "values_0": ""
                                                }
                                            },
                                            "firstSensitivities_4": {
                                                "mapParamsCols": {
                                                    "mapParamsColsSize": "0"
                                                },
                                                "mapConstrRows": {
                                                    "mapConstrRowsSize": "1",
                                                    "mapConstrRows_0": "X7|0"
                                                },
                                                "values": {
                                                    "valuesSize": "1",
                                                    "values_0": ""
                                                }
                                            },
                                            "firstSensitivities_5": {
                                                "mapParamsCols": {
                                                    "mapParamsColsSize": "0"
                                                },
                                                "mapConstrRows": {
                                                    "mapConstrRowsSize": "1",
                                                    "mapConstrRows_0": "X7|0"
                                                },
                                                "values": {
                                                    "valuesSize": "1",
                                                    "values_0": ""
                                                }
                                            },
                                            "firstSensitivities_6": {
                                                "mapParamsCols": {
                                                    "mapParamsColsSize": "0"
                                                },
                                                "mapConstrRows": {
                                                    "mapConstrRowsSize": "1",
                                                    "mapConstrRows_0": "X7|0"
                                                },
                                                "values": {
                                                    "valuesSize": "1",
                                                    "values_0": ""
                                                }
                                            },
                                            "firstSensitivities_7": {
                                                "mapParamsCols": {
                                                    "mapParamsColsSize": "0"
                                                },
                                                "mapConstrRows": {
                                                    "mapConstrRowsSize": "1",
                                                    "mapConstrRows_0": "X7|0"
                                                },
                                                "values": {
                                                    "valuesSize": "1",
                                                    "values_0": ""
                                                }
                                            },
                                            "firstSensitivities_8": {
                                                "mapParamsCols": {
                                                    "mapParamsColsSize": "0"
                                                },
                                                "mapConstrRows": {
                                                    "mapConstrRowsSize": "1",
                                                    "mapConstrRows_0": "X7|0"
                                                },
                                                "values": {
                                                    "valuesSize": "1",
                                                    "values_0": ""
                                                }
                                            },
                                            "firstSensitivities_9": {
                                                "mapParamsCols": {
                                                    "mapParamsColsSize": "0"
                                                },
                                                "mapConstrRows": {
                                                    "mapConstrRowsSize": "1",
                                                    "mapConstrRows_0": "X7|0"
                                                },
                                                "values": {
                                                    "valuesSize": "1",
                                                    "values_0": ""
                                                }
                                            },
                                            "firstSensitivities_10": {
                                                "mapParamsCols": {
                                                    "mapParamsColsSize": "0"
                                                },
                                                "mapConstrRows": {
                                                    "mapConstrRowsSize": "1",
                                                    "mapConstrRows_0": "X7|0"
                                                },
                                                "values": {
                                                    "valuesSize": "1",
                                                    "values_0": ""
                                                }
                                            },
                                            "firstSensitivities_11": {
                                                "mapParamsCols": {
                                                    "mapParamsColsSize": "0"
                                                },
                                                "mapConstrRows": {
                                                    "mapConstrRowsSize": "1",
                                                    "mapConstrRows_0": "X7|0"
                                                },
                                                "values": {
                                                    "valuesSize": "1",
                                                    "values_0": ""
                                                }
                                            },
                                            "firstSensitivities_12": {
                                                "mapParamsCols": {
                                                    "mapParamsColsSize": "0"
                                                },
                                                "mapConstrRows": {
                                                    "mapConstrRowsSize": "1",
                                                    "mapConstrRows_0": "X7|0"
                                                },
                                                "values": {
                                                    "valuesSize": "1",
                                                    "values_0": ""
                                                }
                                            },
                                            "firstSensitivities_13": {
                                                "mapParamsCols": {
                                                    "mapParamsColsSize": "0"
                                                },
                                                "mapConstrRows": {
                                                    "mapConstrRowsSize": "1",
                                                    "mapConstrRows_0": "X7|0"
                                                },
                                                "values": {
                                                    "valuesSize": "1",
                                                    "values_0": ""
                                                }
                                            },
                                            "firstSensitivities_14": {
                                                "mapParamsCols": {
                                                    "mapParamsColsSize": "0"
                                                },
                                                "mapConstrRows": {
                                                    "mapConstrRowsSize": "1",
                                                    "mapConstrRows_0": "X7|0"
                                                },
                                                "values": {
                                                    "valuesSize": "1",
                                                    "values_0": ""
                                                }
                                            },
                                            "firstSensitivities_15": {
                                                "mapParamsCols": {
                                                    "mapParamsColsSize": "0"
                                                },
                                                "mapConstrRows": {
                                                    "mapConstrRowsSize": "1",
                                                    "mapConstrRows_0": "X7|0"
                                                },
                                                "values": {
                                                    "valuesSize": "1",
                                                    "values_0": ""
                                                }
                                            },
                                            "firstSensitivities_16": {
                                                "mapParamsCols": {
                                                    "mapParamsColsSize": "0"
                                                },
                                                "mapConstrRows": {
                                                    "mapConstrRowsSize": "3",
                                                    "mapConstrRows_0": "X7|0",
                                                    "mapConstrRows_1": "X8|1",
                                                    "mapConstrRows_2": "X9|2"
                                                },
                                                "values": {
                                                    "valuesSize": "3",
                                                    "values_0": "",
                                                    "values_1": "",
                                                    "values_2": ""
                                                }
                                            }
                                        }
                                    }
                                }
                            }
                        },
                        "parameters": {
                            "parametersSize": "2",
                            "parameters_0": {
                                "name": "FbinCur",
                                "isOptimizationParameter": "true",
                                "lowerBound": "0",
                                "upperBound": "5.7839999999999998",
                                "value": "0",
                                "parameterType": "PROFILE",
                                "parameterSensitivityType": "FULL",
                                "lagrangeMultiplier": "0",
                                "grids": {
                                    "gridsSize": "1",
                                    "grids_0": {
                                        "numIntervals": "8",
                                        "duration": "1000",
                                        "hasFreeDuration": "false",
                                        "isFixed": "false",
                                        "approximationType": "PIECEWISE_LINEAR",
                                        "timePoints": "0,0.125,0.25,0.375,0.5,0.625,0.75,0.875,1",
                                        "values": "5.7839999999999998,5.7839999999999998,5.7839999999999998,5.7839999999999998,3.7560002325823616,0,0,0,0",
                                        "lagrangeMultiplier": "-8.3537705674019023,-17.980007680113442,-18.35734330806266,-12.922747405254873,-2.8783349596858637e-11,21.534662954439835,57.240438625072422,107.73934197211902,74.265343286162249",
                                        "firstSensitivities": {
                                            "firstSensitivitiesSize": "17",
                                            "firstSensitivities_0": {
                                                "mapParamsCols": {
                                                    "mapParamsColsSize": "2",
                                                    "mapParamsCols_0": "0|0",
                                                    "mapParamsCols_1": "1|1"
                                                },
                                                "mapConstrRows": {
                                                    "mapConstrRowsSize": "1",
                                                    "mapConstrRows_0": "X7|0"
                                                },
                                                "values": {
                                                    "valuesSize": "1",
                                                    "values_0": "0,0"
                                                }
                                            },
                                            "firstSensitivities_1": {
                                                "mapParamsCols": {
                                                    "mapParamsColsSize": "2",
                                                    "mapParamsCols_0": "0|0",
                                                    "mapParamsCols_1": "1|1"
                                                },
                                                "mapConstrRows": {
                                                    "mapConstrRowsSize": "1",
                                                    "mapConstrRows_0": "X7|0"
                                                },
                                                "values": {
                                                    "valuesSize": "1",
                                                    "values_0": "-0.40491632355948037,-0.15190822357384826"
                                                }
                                            },
                                            "firstSensitivities_2": {
                                                "mapParamsCols": {
                                                    "mapParamsColsSize": "2",
                                                    "mapParamsCols_0": "0|0",
                                                    "mapParamsCols_1": "1|1"
                                                },
                                                "mapConstrRows": {
                                                    "mapConstrRowsSize": "1",
                                                    "mapConstrRows_0": "X7|0"
                                                },
                                                "values": {
                                                    "valuesSize": "1",
                                                    "values_0": "-0.32903069720788625,-0.4672783513825548"
                                                }
                                            },
                                            "firstSensitivities_3": {
                                                "mapParamsCols": {
                                                    "mapParamsColsSize": "3",
                                                    "mapParamsCols_0": "0|0",
                                                    "mapParamsCols_1": "1|1",
                                                    "mapParamsCols_2": "2|2"
                                                },
                                                "mapConstrRows": {
                                                    "mapConstrRowsSize": "1",
                                                    "mapConstrRows_0": "X7|0"
                                                },
                                                "values": {
                                                    "valuesSize": "1",
                                                    "values_0": "-0.18467053702978103,-0.65357382074620662,-0.11972270725561018"
                                                }
                                            },
                                            "firstSensitivities_4": {
                                                "mapParamsCols": {
                                                    "mapParamsColsSize": "3",
                                                    "mapParamsCols_0": "0|0",
                                                    "mapParamsCols_1": "1|1",
                                                    "mapParamsCols_2": "2|2"
                                                },
                                                "mapConstrRows": {
                                                    "mapConstrRowsSize": "1",
                                                    "mapConstrRows_0": "X7|0"
                                                },
                                                "values": {
                                                    "valuesSize": "1",
                                                    "values_0": "-0.10160313378698223,-0.59073148717125024,-0.4195202847951674"
                                                }
                                            },
                                            "firstSensitivities_5": {
                                                "mapParamsCols": {
                                                    "mapParamsColsSize": "4",
                                                    "mapParamsCols_0": "0|0",
                                                    "mapParamsCols_1": "1|1",
                                                    "mapParamsCols_2": "2|2",
                                                    "mapParamsCols_3": "3|3"
                                                },
                                                "mapConstrRows": {
                                                    "mapConstrRowsSize": "1",
                                                    "mapConstrRows_0": "X7|0"
                                                },
                                                "values": {
                                                    "valuesSize": "1",
                                                    "values_0": "-0.054837366300050247,-0.47163721774100781,-0.65282931408184985,-0.10109150184982452"
                                                }
                                            },
                                            "firstSensitivities_6": {
                                                "mapParamsCols": {
                                                    "mapParamsColsSize": "4",
                                                    "mapParamsCols_0": "0|0",
                                                    "mapParamsCols_1": "1|1",
                                                    "mapParamsCols_2": "2|2",
                                                    "mapParamsCols_3": "3|3"
                                                },
                                                "mapConstrRows": {
                                                    "mapConstrRowsSize": "1",
                                                    "mapConstrRows_0": "X7|0"
                                                },
                                                "values": {
                                                    "valuesSize": "1",
                                                    "values_0": "-0.030914409238259461,-0.39850262982725004,-0.66834467740293346,-0.36976128937671049"
                                                }
                                            },
                                            "firstSensitivities_7": {
                                                "mapParamsCols": {
                                                    "mapParamsColsSize": "5",
                                                    "mapParamsCols_0": "0|0",
                                                    "mapParamsCols_1": "1|1",
                                                    "mapParamsCols_2": "2|2",
                                                    "mapParamsCols_3": "3|3",
                                                    "mapParamsCols_4": "4|4"
                                                },
                                                "mapConstrRows": {
                                                    "mapConstrRowsSize": "1",
                                                    "mapConstrRows_0": "X7|0"
                                                },
                                                "values": {
                                                    "valuesSize": "1",
                                                    "values_0": "-0.024062826760210338,-0.36101931017236938,-0.61514466791800915,-0.60678281865364092,-0.08855907081653451"
                                                }
                                            },
                                            "firstSensitivities_8": {
                                                "mapParamsCols": {
                                                    "mapParamsColsSize": "5",
                                                    "mapParamsCols_0": "0|0",
                                                    "mapParamsCols_1": "1|1",
                                                    "mapParamsCols_2": "2|2",
                                                    "mapParamsCols_3": "3|3",
                                                    "mapParamsCols_4": "4|4"
                                                },
                                                "mapConstrRows": {
                                                    "mapConstrRowsSize": "1",
                                                    "mapConstrRows_0": "X7|0"
                                                },
                                                "values": {
                                                    "valuesSize": "1",
                                                    "values_0": "-0.030366989198393896,-0.35273138687806138,-0.59238823609429048,-0.67178192967871098,-0.34799581201174673"
                                                }
                                            },
                                            "firstSensitivities_9": {
                                                "mapParamsCols": {
                                                    "mapParamsColsSize": "6",
                                                    "mapParamsCols_0": "0|0",
                                                    "mapParamsCols_1": "1|1",
                                                    "mapParamsCols_2": "2|2",
                                                    "mapParamsCols_3": "3|3",
                                                    "mapParamsCols_4": "4|4",
                                                    "mapParamsCols_5": "5|5"
                                                },
                                                "mapConstrRows": {
                                                    "mapConstrRowsSize": "1",
                                                    "mapConstrRows_0": "X7|0"
                                                },
                                                "values": {
                                                    "valuesSize": "1",
                                                    "values_0": "-0.048376554414653973,-0.37056478115024427,-0.59731480794591529,-0.67361328910191021,-0.6208364666723889,-0.090441809316318345"
                                                }
                                            },
                                            "firstSensitivities_10": {
                                                "mapParamsCols": {
                                                    "mapParamsColsSize": "6",
                                                    "mapParamsCols_0": "0|0",
                                                    "mapParamsCols_1": "1|1",
                                                    "mapParamsCols_2": "2|2",
                                                    "mapParamsCols_3": "3|3",
                                                    "mapParamsCols_4": "4|4",
                                                    "mapParamsCols_5": "5|5"
                                                },
                                                "mapConstrRows": {
                                                    "mapConstrRowsSize": "1",
                                                    "mapConstrRows_0": "X7|0"
                                                },
                                                "values": {
                                                    "valuesSize": "1",
                                                    "values_0": "-0.077958027230079274,-0.41458633235836462,-0.63051425438387898,-0.70313656384784007,-0.74514597718603248,-0.3816320031049113"
                                                }
                                            },
                                            "firstSensitivities_11": {
                                                "mapParamsCols": {
                                                    "mapParamsColsSize": "7",
                                                    "mapParamsCols_0": "0|0",
                                                    "mapParamsCols_1": "1|1",
                                                    "mapParamsCols_2": "2|2",
                                                    "mapParamsCols_3": "3|3",
                                                    "mapParamsCols_4": "4|4",
                                                    "mapParamsCols_5": "5|5",
                                                    "mapParamsCols_6": "6|6"
                                                },
                                                "mapConstrRows": {
                                                    "mapConstrRowsSize": "1",
                                                    "mapConstrRows_0": "X7|0"
                                                },
                                                "values": {
                                                    "valuesSize": "1",
                                                    "values_0": "-0.11244290075632743,-0.46814803164870555,-0.67273829146950914,-0.74071399333938182,-0.78426448331602716,-0.70653066424781363,-0.10068768110127398"
                                                }
                                            },
                                            "firstSensitivities_12": {
                                                "mapParamsCols": {
                                                    "mapParamsColsSize": "7",
                                                    "mapParamsCols_0": "0|0",
                                                    "mapParamsCols_1": "1|1",
                                                    "mapParamsCols_2": "2|2",
                                                    "mapParamsCols_3": "3|3",
                                                    "mapParamsCols_4": "4|4",
                                                    "mapParamsCols_5": "5|5",
                                                    "mapParamsCols_6": "6|6"
                                                },
                                                "mapConstrRows": {
                                                    "mapConstrRowsSize": "1",
                                                    "mapConstrRows_0": "X7|0"
                                                },
                                                "values": {
                                                    "valuesSize": "1",
                                                    "values_0": "-0.14449185430576394,-0.51439526371172417,-0.70535628707184472,-0.76750159824229547,-0.81016471610860341,-0.83731918898291413,-0.41911794750039466"
                                                }
                                            },
                                            "firstSensitivities_13": {
                                                "mapParamsCols": {
                                                    "mapParamsColsSize": "8",
                                                    "mapParamsCols_0": "0|0",
                                                    "mapParamsCols_1": "1|1",
                                                    "mapParamsCols_2": "2|2",
                                                    "mapParamsCols_3": "3|3",
                                                    "mapParamsCols_4": "4|4",
                                                    "mapParamsCols_5": "5|5",
                                                    "mapParamsCols_6": "6|6",
                                                    "mapParamsCols_7": "7|7"
                                                },
                                                "mapConstrRows": {
                                                    "mapConstrRowsSize": "1",
                                                    "mapConstrRows_0": "X7|0"
                                                },
                                                "values": {
                                                    "valuesSize": "1",
                                                    "values_0": "-0.17269360720513272,-0.55174647437585778,-0.72785075233585683,-0.78362361124730384,-0.82394885339452617,-0.85157380520208814,-0.75144015697908007,-0.10810668256861909"
                                                }
                                            },
                                            "firstSensitivities_14": {
                                                "mapParamsCols": {
                                                    "mapParamsColsSize": "8",
                                                    "mapParamsCols_0": "0|0",
                                                    "mapParamsCols_1": "1|1",
                                                    "mapParamsCols_2": "2|2",
                                                    "mapParamsCols_3": "3|3",
                                                    "mapParamsCols_4": "4|4",
                                                    "mapParamsCols_5": "5|5",
                                                    "mapParamsCols_6": "6|6",
                                                    "mapParamsCols_7": "7|7"
                                                },
                                                "mapConstrRows": {
                                                    "mapConstrRowsSize": "1",
                                                    "mapConstrRows_0": "X7|0"
                                                },
                                                "values": {
                                                    "valuesSize": "1",
                                                    "values_0": "-0.19706927213536016,-0.58085648291058578,-0.74144220921858006,-0.79064340176941283,-0.82784192147454416,-0.85329860862330131,-0.8645298729789036,-0.44477774412815335"
                                                }
                                            },
                                            "firstSensitivities_15": {
                                                "mapParamsCols": {
                                                    "mapParamsColsSize": "9",
                                                    "mapParamsCols_0": "0|0",
                                                    "mapParamsCols_1": "1|1",
                                                    "mapParamsCols_2": "2|2",
                                                    "mapParamsCols_3": "3|3",
                                                    "mapParamsCols_4": "4|4",
                                                    "mapParamsCols_5": "5|5",
                                                    "mapParamsCols_6": "6|6",
                                                    "mapParamsCols_7": "7|7",
                                                    "mapParamsCols_8": "8|8"
                                                },
                                                "mapConstrRows": {
                                                    "mapConstrRowsSize": "1",
                                                    "mapConstrRows_0": "X7|0"
                                                },
                                                "values": {
                                                    "valuesSize": "1",
                                                    "values_0": "-0.21780496742049568,-0.60242571162246694,-0.74714137531431712,-0.78975048042319951,-0.82340725593601849,-0.84529060096900266,-0.85260820550239014,-0.78898267855626192,-0.11749640850433968"
                                                }
                                            },
                                            "firstSensitivities_16": {
                                                "mapParamsCols": {
                                                    "mapParamsColsSize": "9",
                                                    "mapParamsCols_0": "0|0",
                                                    "mapParamsCols_1": "1|1",
                                                    "mapParamsCols_2": "2|2",
                                                    "mapParamsCols_3": "3|3",
                                                    "mapParamsCols_4": "4|4",
                                                    "mapParamsCols_5": "5|5",
                                                    "mapParamsCols_6": "6|6",
                                                    "mapParamsCols_7": "7|7",
                                                    "mapParamsCols_8": "8|8"
                                                },
                                                "mapConstrRows": {
                                                    "mapConstrRowsSize": "3",
                                                    "mapConstrRows_0": "X7|0",
                                                    "mapConstrRows_1": "X8|1",
                                                    "mapConstrRows_2": "X9|2"
                                                },
                                                "values": {
                                                    "valuesSize": "3",
                                                    "values_0": "-0.23467884704558467,-0.61651327935659594,-0.74543858943393093,-0.78163122659617879,-0.81159843788948438,-0.8292748562747233,-0.82940004232133702,-0.88735887366007471,-0.48061048951180874",
                                                    "values_1": "0.062499999999999861,0.12500000000000022,0.12499999999999992,0.12499999999992407,0.12499999999991954,0.1250000000000201,0.12500000000000061,0.12499999999999964,0.062499999999999972",
                                                    "values_2": "-94.351174357522808,-191.81943473747515,-191.19192486463339,-183.84783630019703,-170.92508918088097,-149.39042699870424,-113.68465228807803,-63.185749076044317,-11.197202101726074"
                                                }
                                            }
                                        }
                                    }
                                }
                            },
                            "parameters_1": {
                                "name": "TwCur",
                                "isOptimizationParameter": "true",
                                "lowerBound": "0.02",
                                "upperBound": "0.10000000000000001",
                                "value": "0",
                                "parameterType": "PROFILE",
                                "parameterSensitivityType": "FULL",
                                "lagrangeMultiplier": "0",
                                "grids": {
                                    "gridsSize": "1",
                                    "grids_0": {
                                        "numIntervals": "8",
                                        "duration": "1000",
                                        "hasFreeDuration": "false",
                                        "isFixed": "false",
                                        "approximationType": "PIECEWISE_LINEAR",
                                        "timePoints": "0,0.125,0.25,0.375,0.5,0.625,0.75,0.875,1",
                                        "values": "0.039807640191489087,0.10000000000000001,0.045273053282364709,0.038521636181759876,0.10000000000000001,0.037389078553055746,0.02,0.084184695543870591,0.10000000000000001",
                                        "lagrangeMultiplier": "4.2976761543032301e-09,-19.852103714675252,2.7019327938191506e-09,4.7865240972753173e-09,-22.395963175804884,5.2700202922203283e-09,7.9198116115183499,-6.0457787533787199e-09,-1.5876121658646103",
                                        "firstSensitivities": {
                                            "firstSensitivitiesSize": "17",
                                            "firstSensitivities_0": {
                                                "mapParamsCols": {
                                                    "mapParamsColsSize": "2",
                                                    "mapParamsCols_0": "0|9",
                                                    "mapParamsCols_1": "1|10"
                                                },
                                                "mapConstrRows": {
                                                    "mapConstrRowsSize": "1",
                                                    "mapConstrRows_0": "X7|0"
                                                },
                                                "values": {
                                                    "valuesSize": "1",
                                                    "values_0": "0,0"
                                                }
                                            },
                                            "firstSensitivities_1": {
                                                "mapParamsCols": {
                                                    "mapParamsColsSize": "2",
                                                    "mapParamsCols_0": "0|9",
                                                    "mapParamsCols_1": "1|10"
                                                },
                                                "mapConstrRows": {
                                                    "mapConstrRowsSize": "1",
                                                    "mapConstrRows_0": "X7|0"
                                                },
                                                "values": {
                                                    "valuesSize": "1",
                                                    "values_0": "10.787424122587247,3.6925535168581507"
                                                }
                                            },
                                            "firstSensitivities_2": {
                                                "mapParamsCols": {
                                                    "mapParamsColsSize": "2",
                                                    "mapParamsCols_0": "0|9",
                                                    "mapParamsCols_1": "1|10"
                                                },
                                                "mapConstrRows": {
                                                    "mapConstrRowsSize": "1",
                                                    "mapConstrRows_0": "X7|0"
                                                },
                                                "values": {
                                                    "valuesSize": "1",
                                                    "values_0": "14.105085563975353,14.860580495722338"
                                                }
                                            },
                                            "firstSensitivities_3": {
                                                "mapParamsCols": {
                                                    "mapParamsColsSize": "3",
                                                    "mapParamsCols_0": "0|9",
                                                    "mapParamsCols_1": "1|10",
                                                    "mapParamsCols_2": "2|11"
                                                },
                                                "mapConstrRows": {
                                                    "mapConstrRowsSize": "1",
                                                    "mapConstrRows_0": "X7|0"
                                                },
                                                "values": {
                                                    "valuesSize": "1",
                                                    "values_0": "14.086095031933334,26.491099126796019,3.8402058612280183"
                                                }
                                            },
                                            "firstSensitivities_4": {
                                                "mapParamsCols": {
                                                    "mapParamsColsSize": "3",
                                                    "mapParamsCols_0": "0|9",
                                                    "mapParamsCols_1": "1|10",
                                                    "mapParamsCols_2": "2|11"
                                                },
                                                "mapConstrRows": {
                                                    "mapConstrRowsSize": "1",
                                                    "mapConstrRows_0": "X7|0"
                                                },
                                                "values": {
                                                    "valuesSize": "1",
                                                    "values_0": "14.247552880463831,31.039721450975971,15.652733273661124"
                                                }
                                            },
                                            "firstSensitivities_5": {
                                                "mapParamsCols": {
                                                    "mapParamsColsSize": "4",
                                                    "mapParamsCols_0": "0|9",
                                                    "mapParamsCols_1": "1|10",
                                                    "mapParamsCols_2": "2|11",
                                                    "mapParamsCols_3": "3|12"
                                                },
                                                "mapConstrRows": {
                                                    "mapConstrRowsSize": "1",
                                                    "mapConstrRows_0": "X7|0"
                                                },
                                                "values": {
                                                    "valuesSize": "1",
                                                    "values_0": "14.38256499754138,31.731029856084557,28.128429306847259,3.8878004178761154"
                                                }
                                            },
                                            "firstSensitivities_6": {
                                                "mapParamsCols": {
                                                    "mapParamsColsSize": "4",
                                                    "mapParamsCols_0": "0|9",
                                                    "mapParamsCols_1": "1|10",
                                                    "mapParamsCols_2": "2|11",
                                                    "mapParamsCols_3": "3|12"
                                                },
                                                "mapConstrRows": {
                                                    "mapConstrRowsSize": "1",
                                                    "mapConstrRows_0": "X7|0"
                                                },
                                                "values": {
                                                    "valuesSize": "1",
                                                    "values_0": "14.390423341880744,32.084208195674343,33.116832110979161,15.85219768411884"
                                                }
                                            },
                                            "firstSensitivities_7": {
                                                "mapParamsCols": {
                                                    "mapParamsColsSize": "5",
                                                    "mapParamsCols_0": "0|9",
                                                    "mapParamsCols_1": "1|10",
                                                    "mapParamsCols_2": "2|11",
                                                    "mapParamsCols_3": "3|12",
                                                    "mapParamsCols_4": "4|13"
                                                },
                                                "mapConstrRows": {
                                                    "mapConstrRowsSize": "1",
                                                    "mapConstrRows_0": "X7|0"
                                                },
                                                "values": {
                                                    "valuesSize": "1",
                                                    "values_0": "14.327321077007928,32.230740344037457,34.044205478448184,28.57037943116142,3.9026549997287669"
                                                }
                                            },
                                            "firstSensitivities_8": {
                                                "mapParamsCols": {
                                                    "mapParamsColsSize": "5",
                                                    "mapParamsCols_0": "0|9",
                                                    "mapParamsCols_1": "1|10",
                                                    "mapParamsCols_2": "2|11",
                                                    "mapParamsCols_3": "3|12",
                                                    "mapParamsCols_4": "4|13"
                                                },
                                                "mapConstrRows": {
                                                    "mapConstrRowsSize": "1",
                                                    "mapConstrRows_0": "X7|0"
                                                },
                                                "values": {
                                                    "valuesSize": "1",
                                                    "values_0": "14.303654744753443,32.435478538269983,34.941591447215991,34.189745154664806,16.065504028373841"
                                                }
                                            },
                                            "firstSensitivities_9": {
                                                "mapParamsCols": {
                                                    "mapParamsColsSize": "6",
                                                    "mapParamsCols_0": "0|9",
                                                    "mapParamsCols_1": "1|10",
                                                    "mapParamsCols_2": "2|11",
                                                    "mapParamsCols_3": "3|12",
                                                    "mapParamsCols_4": "4|13",
                                                    "mapParamsCols_5": "5|14"
                                                },
                                                "mapConstrRows": {
                                                    "mapConstrRowsSize": "1",
                                                    "mapConstrRows_0": "X7|0"
                                                },
                                                "values": {
                                                    "valuesSize": "1",
                                                    "values_0": "14.362087046024497,32.81014488399763,35.972334459609698,36.162640997832696,29.530836868691519,3.9485236668420556"
                                                }
                                            },
                                            "firstSensitivities_10": {
                                                "mapParamsCols": {
                                                    "mapParamsColsSize": "6",
                                                    "mapParamsCols_0": "0|9",
                                                    "mapParamsCols_1": "1|10",
                                                    "mapParamsCols_2": "2|11",
                                                    "mapParamsCols_3": "3|12",
                                                    "mapParamsCols_4": "4|13",
                                                    "mapParamsCols_5": "5|14"
                                                },
                                                "mapConstrRows": {
                                                    "mapConstrRowsSize": "1",
                                                    "mapConstrRows_0": "X7|0"
                                                },
                                                "values": {
                                                    "valuesSize": "1",
                                                    "values_0": "14.545151412272542,33.45895018866198,37.271163324898708,38.341591460677236,36.380515563843339,16.472594298862397"
                                                }
                                            },
                                            "firstSensitivities_11": {
                                                "mapParamsCols": {
                                                    "mapParamsColsSize": "7",
                                                    "mapParamsCols_0": "0|9",
                                                    "mapParamsCols_1": "1|10",
                                                    "mapParamsCols_2": "2|11",
                                                    "mapParamsCols_3": "3|12",
                                                    "mapParamsCols_4": "4|13",
                                                    "mapParamsCols_5": "5|14",
                                                    "mapParamsCols_6": "6|15"
                                                },
                                                "mapConstrRows": {
                                                    "mapConstrRowsSize": "1",
                                                    "mapConstrRows_0": "X7|0"
                                                },
                                                "values": {
                                                    "valuesSize": "1",
                                                    "values_0": "14.676366712350525,33.978904975678986,38.398624336207661,40.293487499664593,39.283612349301848,30.492958612977265,3.9696370974921984"
                                                }
                                            },
                                            "firstSensitivities_12": {
                                                "mapParamsCols": {
                                                    "mapParamsColsSize": "7",
                                                    "mapParamsCols_0": "0|9",
                                                    "mapParamsCols_1": "1|10",
                                                    "mapParamsCols_2": "2|11",
                                                    "mapParamsCols_3": "3|12",
                                                    "mapParamsCols_4": "4|13",
                                                    "mapParamsCols_5": "5|14",
                                                    "mapParamsCols_6": "6|15"
                                                },
                                                "mapConstrRows": {
                                                    "mapConstrRowsSize": "1",
                                                    "mapConstrRows_0": "X7|0"
                                                },
                                                "values": {
                                                    "valuesSize": "1",
                                                    "values_0": "14.592704345547709,33.986721900864069,38.908486058001216,41.535587827918839,41.396026121228537,37.180372005813027,16.401467539004969"
                                                }
                                            },
                                            "firstSensitivities_13": {
                                                "mapParamsCols": {
                                                    "mapParamsColsSize": "8",
                                                    "mapParamsCols_0": "0|9",
                                                    "mapParamsCols_1": "1|10",
                                                    "mapParamsCols_2": "2|11",
                                                    "mapParamsCols_3": "3|12",
                                                    "mapParamsCols_4": "4|13",
                                                    "mapParamsCols_5": "5|14",
                                                    "mapParamsCols_6": "6|15",
                                                    "mapParamsCols_7": "7|16"
                                                },
                                                "mapConstrRows": {
                                                    "mapConstrRowsSize": "1",
                                                    "mapConstrRows_0": "X7|0"
                                                },
                                                "values": {
                                                    "valuesSize": "1",
                                                    "values_0": "14.333408836278693,33.566469637416084,38.87993165373129,42.131630345354644,42.763889419963824,39.39218412789473,29.889864613492687,3.9384534905745494"
                                                }
                                            },
                                            "firstSensitivities_14": {
                                                "mapParamsCols": {
                                                    "mapParamsColsSize": "8",
                                                    "mapParamsCols_0": "0|9",
                                                    "mapParamsCols_1": "1|10",
                                                    "mapParamsCols_2": "2|11",
                                                    "mapParamsCols_3": "3|12",
                                                    "mapParamsCols_4": "4|13",
                                                    "mapParamsCols_5": "5|14",
                                                    "mapParamsCols_6": "6|15",
                                                    "mapParamsCols_7": "7|16"
                                                },
                                                "mapConstrRows": {
                                                    "mapConstrRowsSize": "1",
                                                    "mapConstrRows_0": "X7|0"
                                                },
                                                "values": {
                                                    "valuesSize": "1",
                                                    "values_0": "13.938340195195096,32.811305542421842,38.421088505887965,42.201000004058926,43.51667771057717,40.911613447406808,35.925094054588449,16.172514689077456"
                                                }
                                            },
                                            "firstSensitivities_15": {
                                                "mapParamsCols": {
                                                    "mapParamsColsSize": "9",
                                                    "mapParamsCols_0": "0|9",
                                                    "mapParamsCols_1": "1|10",
                                                    "mapParamsCols_2": "2|11",
                                                    "mapParamsCols_3": "3|12",
                                                    "mapParamsCols_4": "4|13",
                                                    "mapParamsCols_5": "5|14",
                                                    "mapParamsCols_6": "6|15",
                                                    "mapParamsCols_7": "7|16",
                                                    "mapParamsCols_8": "8|17"
                                                },
                                                "mapConstrRows": {
                                                    "mapConstrRowsSize": "1",
                                                    "mapConstrRows_0": "X7|0"
                                                },
                                                "values": {
                                                    "valuesSize": "1",
                                                    "values_0": "13.434412365988672,31.785139876239544,37.608538680314403,41.831289703721758,43.752149799760289,41.852052329979017,37.621109592474099,29.278700003722481,3.9172613532763303"
                                                }
                                            },
                                            "firstSensitivities_16": {
                                                "mapParamsCols": {
                                                    "mapParamsColsSize": "9",
                                                    "mapParamsCols_0": "0|9",
                                                    "mapParamsCols_1": "1|10",
                                                    "mapParamsCols_2": "2|11",
                                                    "mapParamsCols_3": "3|12",
                                                    "mapParamsCols_4": "4|13",
                                                    "mapParamsCols_5": "5|14",
                                                    "mapParamsCols_6": "6|15",
                                                    "mapParamsCols_7": "7|16",
                                                    "mapParamsCols_8": "8|17"
                                                },
                                                "mapConstrRows": {
                                                    "mapConstrRowsSize": "3",
                                                    "mapConstrRows_0": "X7|0",
                                                    "mapConstrRows_1": "X8|1",
                                                    "mapConstrRows_2": "X9|2"
                                                },
                                                "values": {
                                                    "valuesSize": "3",
                                                    "values_0": "12.848763175112893,30.550249581490753,36.511544125247624,41.094363733486553,43.541512127250542,42.284808762018351,38.733222835015859,34.865830390256349,16.01521397543415",
                                                    "values_1": "0,0,0,0,0,0,0,0,0",
                                                    "values_2": "69.509412119802221,129.62924238575641,70.953569738682774,-6.5546892705992121e-05,-22.396020456040468,-4.234526342350442e-05,7.9197861316526534,-1.2709995114934536e-05,-1.5876144927782359"
                                                }
                                            }
                                        }
                                    }
                                }
                            }
                        },
                        "states": {
                            "statesSize": "10",
                            "states_0": {
                                "name": "X1",
                                "esoIndex": "0",
                                "grid": {
                                    "timePoints": "0,62.5,125,187.5,250,312.5,375,437.5,500,562.5,625,687.5,750,812.5,875,937.5,1000",
                                    "values": "1,0.83167493249437374,0.69333849709392292,0.5811824860680187,0.49006067982254226,0.41574893901476534,0.35461997748756202,0.30596553680852101,0.26784744025300739,0.23839175269091159,0.21695042778909462,0.20002152384589847,0.18501489498364812,0.17181473676100575,0.16000549743128387,0.14924569622452769,0.13940571039230837"
                                }
                            },
                            "states_1": {
                                "name": "X2",
                                "esoIndex": "1",
                                "grid": {
                                    "timePoints": "0,62.5,125,187.5,250,312.5,375,437.5,500,562.5,625,687.5,750,812.5,875,937.5,1000",
                                    "values": "0,0.13703188867894572,0.21805982081000347,0.26654103402887891,0.29575042512063399,0.31442810592817699,0.32756570413752795,0.33332114819787129,0.3289162648505719,0.31258515782235263,0.28279289446159073,0.24870324419448586,0.21910361214240665,0.19376618541555105,0.17174303509864788,0.15228656841471155,0.13508834662791186"
                                }
                            },
                            "states_2": {
                                "name": "X3",
                                "esoIndex": "2",
                                "grid": {
                                    "timePoints": "0,62.5,125,187.5,250,312.5,375,437.5,500,562.5,625,687.5,750,812.5,875,937.5,1000",
                                    "values": "0,0.028877587768100482,0.06957744736246009,0.098166286428716498,0.11162787013024292,0.11337788431308767,0.10792220179843051,0.09951841775192409,0.089771177572930932,0.079769081222030247,0.070429166915989841,0.061447289112580711,0.052981062060192201,0.045520982302790107,0.038876216860216493,0.032879177180768653,0.027591071267611362"
                                }
                            },
                            "states_3": {
                                "name": "X4",
                                "esoIndex": "3",
                                "grid": {
                                    "timePoints": "0,62.5,125,187.5,250,312.5,375,437.5,500,562.5,625,687.5,750,812.5,875,937.5,1000",
                                    "values": "0,0.00080309745524422211,0.0062627135539977475,0.017528993174759366,0.032576339060583936,0.048677914919582385,0.06402587847571975,0.078198241966662446,0.092063396644651241,0.10612969180577971,0.12047413654739487,0.13337578635030911,0.14332205034152029,0.15066638924860404,0.15596258917195427,0.15959759907983637,0.16183003220019856"
                                }
                            },
                            "states_4": {
                                "name": "X5",
                                "esoIndex": "4",
                                "grid": {
                                    "timePoints": "0,62.5,125,187.5,250,312.5,375,437.5,500,562.5,625,687.5,750,812.5,875,937.5,1000",
                                    "values": "0,0.0016087143876260498,0.012619864736642368,0.035667271929561616,0.067085481219099435,0.10152036023325417,0.13517754941116841,0.16703655076969987,0.19903673105615757,0.23260532145772472,0.26831026615704906,0.30263175880486587,0.33181776518452116,0.35609230219294918,0.37652012416731001,0.39391345512167059,0.40862992703083156"
                                }
                            },
                            "states_5": {
                                "name": "X6",
                                "esoIndex": "5",
                                "grid": {
                                    "timePoints": "0,62.5,125,187.5,250,312.5,375,437.5,500,562.5,625,687.5,750,812.5,875,937.5,1000",
                                    "values": "0,3.7792157063997587e-06,0.00014165644297033043,0.00091392837006432515,0.0028992046468976256,0.0062467955911344741,0.010688688689593183,0.015960100252836226,0.022364906616557153,0.030518906733896421,0.041042989547227751,0.053820279110208376,0.067760496706059062,0.082139285497447284,0.096892418688936707,0.11207738539683258,0.12745479389948619"
                                }
                            },
                            "states_6": {
                                "name": "X7",
                                "esoIndex": "6",
                                "grid": {
                                    "timePoints": "0,62.5,125,187.5,250,312.5,375,437.5,500,562.5,625,687.5,750,812.5,875,937.5,1000",
                                    "values": "65,61.293539022913059,60.132617093530754,59.999999190931668,59.99999915413192,60.042255021892231,60.145147556574507,60.64704552660978,61.931577716822524,63.640873238545531,65.425071056970808,67.096571440448287,68.436409066751182,69.743933159859949,71.370540349348119,73.166979032534456,74.954777819142819"
                                }
                            },
                            "states_7": {
                                "name": "X8",
                                "esoIndex": "7",
                                "grid": {
                                    "timePoints": "0,62.5,125,187.5,250,312.5,375,437.5,500,562.5,625,687.5,750,812.5,875,937.5,1000",
                                    "values": "2,2.3615000000000417,2.7230000000000429,3.0845000000000633,3.4460000000000854,3.8075000000000889,4.1690000000000795,4.4988125036339062,4.7652500145350434,4.9413125254399421,5.0000000290798017,5.0000000290798017,5.0000000290798017,5.0000000290798017,5.0000000290798017,5.0000000290798017,5.0000000290798017"
                                }
                            },
                            "states_8": {
                                "name": "X9",
                                "esoIndex": "8",
                                "grid": {
                                    "timePoints": "0,62.5,125,187.5,250,312.5,375,437.5,500,562.5,625,687.5,750,812.5,875,937.5,1000",
                                    "values": "0,-11.011862110832194,-99.040723438727383,-314.14525124403588,-652.589260600633,-1078.0593303974322,-1553.4641733675614,-2048.5305330360184,-2556.0169699289017,-3057.3833188118606,-3514.5264699460481,-3894.4188337037617,-4189.0056099013054,-4408.2436095692137,-4568.1820657947483,-4680.0780805946852,-4751.3386198685566"
                                }
                            },
                            "states_9": {
                                "name": "Tw",
                                "esoIndex": "9",
                                "grid": {
                                    "timePoints": "0,62.5,125,187.5,250,312.5,375,437.5,500,562.5,625,687.5,750,812.5,875,937.5,1000",
                                    "values": "0.039807640191489087,0.069903820095744376,0.099999999999999964,0.072636526641182475,0.045273053282364792,0.041897344732062296,0.038521636181759848,0.069260818090883594,0.099999999999999853,0.068694539276528174,0.037389078553055718,0.028694539276527889,0.019999999999999893,0.052092347771935436,0.084184695543870938,0.092092347771935229,0.099999999999999867"
                                }
                            }
                        },
                        "adjoints": {
                            "adjointsSize": "10",
                            "adjoints_0": {
                                "timePoints": "0,62.5,125,187.5,250,312.5,375,437.5,500,562.5,625,687.5,750,812.5,875,937.5,1000",
                                "values": "0,0,0,0,0,0,0,0,0,0,0,0,0,0,0,0,0"
                            },
                            "adjoints_1": {
                                "timePoints": "0,62.5,125,187.5,250,312.5,375,437.5,500,562.5,625,687.5,750,812.5,875,937.5,1000",
                                "values": "0,0,0,0,0,0,0,0,0,0,0,0,0,0,0,0,0"
                            },
                            "adjoints_2": {
                                "timePoints": "0,62.5,125,187.5,250,312.5,375,437.5,500,562.5,625,687.5,750,812.5,875,937.5,1000",
                                "values": "0,0,0,0,0,0,0,0,0,0,0,0,0,0,0,0,0"
                            },
                            "adjoints_3": {
                                "timePoints": "0,62.5,125,187.5,250,312.5,375,437.5,500,562.5,625,687.5,750,812.5,875,937.5,1000",
                                "values": "0,0,0,0,0,0,0,0,0,0,0,0,0,0,0,0,0"
                            },
                            "adjoints_4": {
                                "timePoints": "0,62.5,125,187.5,250,312.5,375,437.5,500,562.5,625,687.5,750,812.5,875,937.5,1000",
                                "values": "0,0,0,0,0,0,0,0,0,0,0,0,0,0,0,0,0"
                            },
                            "adjoints_5": {
                                "timePoints": "0,62.5,125,187.5,250,312.5,375,437.5,500,562.5,625,687.5,750,812.5,875,937.5,1000",
                                "values": "0,0,0,0,0,0,0,0,0,0,0,0,0,0,0,0,0"
                            },
                            "adjoints_6": {
                                "timePoints": "0,62.5,125,187.5,250,312.5,375,437.5,500,562.5,625,687.5,750,812.5,875,937.5,1000",
                                "values": "0,0,0,0,0,0,0,0,0,0,0,0,0,0,0,0,0"
                            },
                            "adjoints_7": {
                                "timePoints": "0,62.5,125,187.5,250,312.5,375,437.5,500,562.5,625,687.5,750,812.5,875,937.5,1000",
                                "values": "0,0,0,0,0,0,0,0,0,0,0,0,0,0,0,0,0"
                            },
                            "adjoints_8": {
                                "timePoints": "0,62.5,125,187.5,250,312.5,375,437.5,500,562.5,625,687.5,750,812.5,875,937.5,1000",
                                "values": "0,0,0,0,0,0,0,0,0,0,0,0,0,0,0,0,0"
                            },
                            "adjoints_9": {
                                "timePoints": "0,62.5,125,187.5,250,312.5,375,437.5,500,562.5,625,687.5,750,812.5,875,937.5,1000",
                                "values": "0,0,0,0,0,0,0,0,0,0,0,0,0,0,0,0,0"
                            }
                        }
                    },
                    "optimizer": {
                        "objective": {
                            "name": "X9",
                            "lowerBound": "-1.0000000000000001e+300",
                            "upperBound": "1.0000000000000001e+300",
                            "constraintType": "POINT",
                            "grids": {
                                "gridsSize": "1",
                                "grids_0": {
                                    "timePoints": "1",
                                    "values": "-4751.3386198685566",
                                    "lagrangeMultiplier": "1"
                                }
                            }
                        },
                        "nonlinearConstraints": {
                            "nonlinearConstraintsSize": "2",
                            "nonlinearConstraints_0": {
                                "name": "X7",
                                "lowerBound": "60",
                                "upperBound": "90",
                                "constraintType": "PATH",
                                "grids": {
                                    "gridsSize": "1",
                                    "grids_0": {
                                        "timePoints": "0,0.0625,0.125,0.1875,0.25,0.3125,0.375,0.4375,0.5,0.5625,0.625,0.6875,0.75,0.8125,0.875,0.9375,1",
                                        "values": "65,61.293539022913059,60.132617093530754,59.999999190931668,59.99999915413192,60.042255021892231,60.145147556574507,60.64704552660978,61.931577716822524,63.640873238545531,65.425071056970808,67.096571440448287,68.436409066751182,69.743933159859949,71.370540349348119,73.166979032534456,74.954777819142819",
                                        "lagrangeMultiplier": "-2.0300696378419735e-11,2.0819467304752003e-09,-1.3975491866205517e-09,-0.46507772559408062,-4.418886080831169,2.8982465304320795e-09,6.3168623751161368e-10,-3.6975909471788498e-09,-5.8571745347194125e-10,3.6534810935921821e-09,1.0555879880071449e-09,-3.114965093659619e-09,-2.1247017871477553e-09,6.4474922110640144e-10,1.0756477177793562e-09,-5.0210504500714e-10,-3.6256257005557424e-09"
                                    }
                                }
                            },
                            "nonlinearConstraints_1": {
                                "name": "X8",
                                "lowerBound": "0",
                                "upperBound": "5",
                                "constraintType": "ENDPOINT",
                                "grids": {
                                    "gridsSize": "1",
                                    "grids_0": {
                                        "timePoints": "1",
                                        "values": "5.0000000290798017",
                                        "lagrangeMultiplier": "1367.4007252206652"
                                    }
                                }
                            }
                        },
                        "linearConstraints": {
                            "linearConstraintsSize": "0"
                        }
                    }
                }
            },
            "totalEndTimeLowerBound": "-1.0000000000000001e+300",
            "totalEndTimeUpperBound": "1.0000000000000001e+300",
            "runningMode": "SINGLE_SHOOTING",
            "integratorOutput": {
                "integratorType": "NIXE",
                "integrationOrder": "FIRST_FORWARD"
            },
            "solutionTime": "1.2591600000000001",
            "optimizerOutput": {
                "optimizerType": "IPOPT",
                "globalConstraints": {
                    "globalConstraintsSize": "0"
                },
                "linearConstraints": {
                    "linearConstraintsSize": "0"
                },
                "resultFlag": "OK",
                "intermConstrVio": "0",
                "secondOrder": {
                    "indicesHessian": {
                        "indicesHessianSize": "0"
                    },
                    "values": {
                        "valuesSize": "0"
                    },
                    "compositeAdjoints": {
                        "compositeAdjointsSize": "0"
                    }
                }
            }
        }
    }
}
