{
    "debug": {
        "input": {
            "stages": {
                "stagesSize": "1",
                "stages_0": {
                    "treatObjective": "true",
                    "mapping": {
                        "fullStateMapping": "false",
                        "stateNameMapping": {
                            "stateNameMappingSize": "0"
                        }
                    },
                    "eso": {
                        "model": "penicillin",
                        "type": "JADE"
                    },
                    "integrator": {
                        "duration": {
                            "name": "",
                            "lowerBound": "-1.0000000000000001e+300",
                            "upperBound": "1.0000000000000001e+300",
                            "value": "40",
                            "parameterType": "DURATION",
                            "parameterSensitivityType": "NO",
                            "grids": {
                                "gridsSize": "0"
                            }
                        },
                        "parameters": {
                            "parametersSize": "1",
                            "parameters_0": {
                                "name": "u",
                                "lowerBound": "0",
                                "upperBound": "10",
                                "value": "0",
                                "parameterType": "PROFILE",
                                "parameterSensitivityType": "FULL",
                                "grids": {
                                    "gridsSize": "1",
                                    "grids_0": {
                                        "numIntervals": "5",
                                        "duration": "0",
                                        "hasFreeDuration": "false",
                                        "approximationType": "PIECEWISE_CONSTANT",
                                        "timePoints": "0,0.20000000000000001,0.40000000000000002,0.59999999999999998,0.80000000000000004,1",
                                        "values": "1,0,1,0,1",
                                        "adapt": {
                                            "adaptType": "WAVELET",
                                            "maxAdaptSteps": "1",
                                            "adaptWave": {
                                                "maxRefinementLevel": "10",
                                                "minRefinementLevel": "3",
                                                "horRefinementDepth": "1",
                                                "verRefinementDepth": "1",
                                                "etres": "1e-08",
                                                "epsilon": "0.90000000000000002"
                                            }
                                        }
                                    }
                                }
                            }
                        },
                        "plotGridResolution": "1"
                    },
                    "optimizer": {
                        "objective": {
                            "name": "P",
                            "lowerBound": "-1.0000000000000001e+300",
                            "upperBound": "1.0000000000000001e+300",
                            "timePoint": "0",
                            "lagrangeMultiplier": "0",
                            "constraintType": "ENDPOINT"
                        },
                        "constraints": {
                            "constraintsSize": "1",
                            "constraints_0": {
                                "name": "X",
                                "lowerBound": "0",
                                "upperBound": "10",
                                "timePoint": "0",
                                "lagrangeMultiplier": "0",
                                "constraintType": "PATH"
                            }
                        },
                        "structureDetection": {
                            "maxStructureSteps": "0"
                        }
                    }
                }
            },
            "totalEndTimeLowerBound": "-1.0000000000000001e+300",
            "totalEndTimeUpperBound": "1.0000000000000001e+300",
            "runningMode": "SINGLE_SHOOTING",
            "integratorInput": {
                "integratorOptions": {
                    "integratorOptionsSize": "0"
                },
                "integratorType": "IDAS",
                "integrationOrder": "FIRST_FORWARD",
                "daeInit": {
                    "daeInitializationType": "BLOCK",
                    "linSolver": {
                        "solverType": "KLU"
                    },
                    "nonLinSolver": {
                        "solverType": "CMINPACK",
                        "tolerance": "1e-10"
                    },
                    "maximumErrorTolerance": "1e-10"
                }
            },
            "optimizerInput": {
                "optimizerOptions": {
                    "optimizerOptionsSize": "0"
                },
                "optimizationMode": "Maximize",
                "optimizerType": "SNOPT",
                "adaptationOptions": {
                    "adaptationThreshold": "0.01",
                    "intermConstraintViolationTolerance": "0.10000000000000001",
                    "numOfIntermPoints": "4",
                    "adaptiveStrategy": "NOADAPTATION"
                },
                "globalConstraints": {
                    "globalConstraintsSize": "0"
                }
            }
        }
    }
}
