AcceptGap; iterations; time_master; time_subproblem; time_feasPt; CoopPotentialPercent
0.002; 4; 1.24899995; 2.14299989; 0.824999988; 85.9481214
0.001; 24; 2.53299999; 5.57600021; 0.717000008; 89.402551
0.0005; 45; 3.91300011; 8.96199989; 0.873000026; 95.626516
0.0002; 111; 7.55100012; 17.9650002; 0.834999979; 98.1526718
0.0001; 175; 10.9540005; 25.4580002; 0.856999993; 98.9570178
5e-05; 306; 20.0400009; 41.2789993; 0.737999976; 99.5256896
2e-05; 308; 19.3700008; 40.5470009; 0.709999979; 99.9236969
