t; nomPriceB5; nomPlPowB5; integrPriceB5; integrPlPowB5; integrT_in_B5; disagg_price_bus5; PlPowB5; disaggT_in_B5; nomPriceB7; nomPlPowB7; integrPriceB7; integrPlPowB7; integrT_in_B7; disagg_price_bus7; PlPowB7; disaggT_in_B7; nomPriceB8; nomPlPowB8; integrPriceB8; integrPlPowB8; integrT_in_B8; disagg_price_bus8; PlPowB8; disaggT_in_B8;  initFeasThres; finalFeasThres; accept_gap; iterations; CPUmaster; CPUsubproblem; CPUfeasPt; finalDetectGap; nomCongestionCost; intCongestionCost; disaggCongestionCost; Objective; nomImprovPercent; CoopPotentialPercent; nominalCost; integratedCost
1; 10.52; 32.802; 10.52; 28.0972472; 80; 10.52; 28.0972472; 80; 10.52; 31.7; 10.52; 27.1533057; 80; 10.52; 27.1533057; 80; 10.52; 6.498; 10.52; 5.56599939; 80; 10.52; 5.56599939; 80; 355; 355; 0.0005; 47; 7.46700001; 12.4659996; 0.755999982; 0.000494334488; 3.62547128e-10; 1.05588991e-10; 2.48097382e-09; 1804903.71; 0.484780178; 94.3665934; 1813696.15; 1804378.83
2; 10.52; 32.802; 10.52; 23.4394284; 80; 10.52; 23.4394284; 80; 10.52; 31.7; 10.52; 22.6519688; 80; 10.52; 22.6519688; 80; 10.52; 6.498; 10.52; 4.64329631; 80; 10.52; 4.64329631; 80; 
3; 10.52; 32.802; 10.52; 23.4394284; 80; 10.52; 23.4394284; 80; 10.52; 31.7; 10.52; 22.6519688; 80; 10.52; 27.6413988; 80; 10.52; 6.498; 10.52; 4.64329631; 80; 10.52; 4.64329631; 80; 
4; 10.52; 32.802; 10.52; 23.4394284; 80; 10.52; 30.6470407; 80; 10.52; 31.7; 10.52; 22.6519688; 80; 10.52; 28.1513654; 80; 10.52; 6.498; 10.52; 4.64329631; 80; 10.52; 7.42738891; 76.3109751; 
5; 10.52; 32.802; 10.52; 23.4394284; 80; 10.52; 30.5751384; 80; 10.52; 31.7; 10.52; 22.6519688; 80; 10.52; 31.0116425; 80; 10.52; 6.498; 10.52; 4.64329631; 80; 10.52; 9.44353617; 75; 
6; 10.52; 32.802; 10.52; 23.4394284; 80; 10.52; 37.3306801; 75; 10.52; 31.7; 10.52; 22.6519688; 80; 10.52; 30.3796188; 80; 10.52; 6.498; 10.52; 4.64329631; 80; 10.52; 6.66682744; 80; 
7; 10.52; 32.802; 10.52; 23.4394284; 80; 10.52; 47.536854; 75; 10.52; 31.7; 10.52; 22.6519688; 80; 10.52; 22.6519688; 80; 10.52; 6.498; 10.52; 4.64329631; 80; 10.52; 6.42437536; 79.696911; 
8; 10.52; 32.802; 10.52; 34.5479206; 80; 10.52; 35.6554021; 80; 10.52; 31.7; 10.52; 29.8101939; 80; 10.52; 32.5609439; 80; 10.52; 6.498; 10.52; 5.49935399; 80; 10.52; 8.45596249; 75; 
9; 10.52; 32.802; 10.52; 34.5124445; 80; 10.52; 28.5129435; 80; 10.52; 31.7; 10.52; 36.3293235; 80; 10.52; 40.1594312; 77.8060743; 10.52; 6.498; 10.52; 6.42281471; 80; 10.52; 6.67220715; 80; 
10; 10.52; 32.802; 10.52; 23.5140178; 80; 14.22; 30.9614014; 80; 10.52; 31.7; 10.52; 29.1767615; 80; 14.22; 30.2725191; 80; 10.52; 6.498; 10.52; 5.56599944; 80; 14.22; 4.64329631; 80; 
11; 14.59; 32.802; 14.59; 23.4394284; 80; 12.1581; 27.8294868; 80; 14.59; 31.7; 14.59; 22.6519688; 80; 12.1581; 22.6519688; 80; 14.59; 6.498; 14.59; 4.64329631; 80; 12.1581; 4.64329631; 80; 
12; 15.5475; 32.802; 15.3761538; 23.4394284; 80; 15.2786077; 23.4394284; 80; 15.5475; 31.7; 15.3761538; 22.6519688; 80; 15.2786077; 22.6519688; 80; 15.5475; 6.498; 15.3761538; 4.64329631; 80; 15.2786077; 4.64329631; 80; 
13; 15.5475; 32.802; 15.3761538; 23.4394284; 80; 15.2786077; 23.4394284; 80; 15.5475; 31.7; 15.3761538; 22.6519688; 80; 15.2786077; 22.6519688; 80; 15.5475; 6.498; 15.3761538; 4.64329631; 80; 15.2786077; 4.64329631; 80; 
14; 15.5475; 32.802; 15.3761538; 23.4394284; 80; 15.2786077; 23.4394284; 80; 15.5475; 31.7; 15.3761538; 22.6519688; 80; 15.2786077; 22.6519688; 80; 15.5475; 6.498; 15.3761538; 4.64329631; 80; 15.2786077; 4.64329631; 80; 
15; 15.5475; 32.802; 15.3761538; 23.4394284; 80; 15.2786077; 23.4394284; 80; 15.5475; 31.7; 15.3761538; 22.6519688; 80; 15.2786077; 22.6519688; 80; 15.5475; 6.498; 15.3761538; 4.64329631; 80; 15.2786077; 4.64329631; 80; 
16; 15.5475; 32.802; 15.3761538; 23.4394284; 80; 15.2786077; 23.4394284; 80; 15.5475; 31.7; 15.3761538; 22.6519688; 80; 15.2786077; 22.6519688; 80; 15.5475; 6.498; 15.3761538; 4.64329631; 80; 15.2786077; 4.64329631; 80; 
17; 15.5475; 32.802; 15.3761538; 23.4394284; 80; 15.2786077; 23.4394284; 80; 15.5475; 31.7; 15.3761538; 22.6519688; 80; 15.2786077; 22.6519688; 80; 15.5475; 6.498; 15.3761538; 4.64329631; 80; 15.2786077; 4.64329631; 80; 
18; 15.5475; 32.802; 15.3761538; 23.4394284; 80; 15.2786077; 23.4394284; 80; 15.5475; 31.7; 15.3761538; 22.6519688; 80; 15.2786077; 22.6519688; 80; 15.5475; 6.498; 15.3761538; 4.64329631; 80; 15.2786077; 4.64329631; 80; 
19; 15.5475; 32.802; 15.3761538; 23.4394284; 80; 15.2786077; 23.4394284; 80; 15.5475; 31.7; 15.3761538; 22.6519688; 80; 15.2786077; 22.6519688; 80; 15.5475; 6.498; 15.3761538; 4.64329631; 80; 15.2786077; 4.64329631; 80; 
20; 15.5475; 32.802; 15.3761538; 23.4394284; 80; 15.2786077; 23.4394284; 80; 15.5475; 31.7; 15.3761538; 22.6519688; 80; 15.2786077; 22.6519688; 80; 15.5475; 6.498; 15.3761538; 4.64329631; 80; 15.2786077; 4.64329631; 80; 
21; 15.5475; 32.802; 15.3761538; 23.4394284; 80; 15.2786077; 23.4394284; 80; 15.5475; 31.7; 15.3761538; 22.6519688; 80; 15.2786077; 22.6519688; 80; 15.5475; 6.498; 15.3761538; 4.64329631; 80; 15.2786077; 4.64329631; 80; 
22; 15.5475; 32.802; 15.3761538; 23.4394284; 80; 15.2786077; 23.4394284; 80; 15.5475; 31.7; 15.3761538; 22.6519688; 80; 15.2786077; 22.6519688; 80; 15.5475; 6.498; 15.3761538; 4.64329631; 80; 15.2786077; 4.64329631; 80; 
23; 15.5475; 32.802; 15.3761538; 23.4394284; 80; 15.2786077; 23.4394284; 80; 15.5475; 31.7; 15.3761538; 22.6519688; 80; 15.2786077; 22.6519688; 80; 15.5475; 6.498; 15.3761538; 4.64329631; 80; 15.2786077; 4.64329631; 80; 
24; 15.5475; 32.802; 15.3761538; 23.4394284; 80; 15.2786077; 23.4394284; 80; 15.5475; 31.7; 15.3761538; 22.6519688; 80; 15.2786077; 22.6519688; 80; 15.5475; 6.498; 15.3761538; 4.64329631; 80; 15.2786077; 4.64329631; 80; 
25; 17.81; 32.802; 16.6238462; 23.4394284; 80; 16.7213923; 23.4394284; 80; 17.81; 31.7; 16.6238462; 22.6519688; 80; 16.7213923; 22.6519688; 80; 17.81; 6.498; 16.6238462; 4.64329631; 80; 16.7213923; 4.64329631; 80; 
26; 16; 32.802; 16; 23.4394284; 80; 16; 23.4394284; 80; 16; 31.7; 16; 22.6519688; 80; 16; 22.6519688; 80; 16; 6.498; 16; 4.64329631; 80; 16; 4.64329631; 80; 
27; 16; 32.802; 16; 23.4394284; 80; 16; 23.4394284; 80; 16; 31.7; 16; 22.6519688; 80; 16; 22.6519688; 80; 16; 6.498; 16; 4.64329631; 80; 16; 4.64329631; 80; 
28; 16; 32.802; 16; 23.4394284; 80; 16; 23.4394284; 80; 16; 31.7; 16; 22.6519688; 80; 16; 22.6519688; 80; 16; 6.498; 16; 4.64329631; 80; 16; 4.64329631; 80; 
29; 16; 32.802; 16; 23.4394284; 80; 16; 23.4394284; 80; 16; 31.7; 16; 22.6519688; 80; 16; 22.6519688; 80; 16; 6.498; 16; 4.64329631; 80; 16; 4.64329631; 80; 
30; 16; 32.802; 16; 23.4394284; 80; 16; 23.4394284; 80; 16; 31.7; 16; 22.6519688; 80; 16; 22.6519688; 80; 16; 6.498; 16; 4.64329631; 80; 16; 4.64329631; 80; 
31; 16; 32.802; 16; 23.4394284; 80; 16; 23.4394284; 80; 16; 31.7; 16; 22.6519688; 80; 16; 22.6519688; 80; 16; 6.498; 16; 4.64329631; 80; 16; 4.64329631; 80; 
32; 16; 32.802; 16; 23.4394284; 80; 16; 23.4394284; 80; 16; 31.7; 16; 22.6519688; 80; 16; 22.6519688; 80; 16; 6.498; 16; 4.64329631; 80; 16; 4.64329631; 80; 
33; 16; 32.802; 16; 23.4394284; 80; 16; 23.4394284; 80; 16; 31.7; 16; 22.6519688; 80; 16; 22.6519688; 80; 16; 6.498; 16; 4.64329631; 80; 16; 4.64329631; 80; 
34; 16; 32.802; 16; 23.4394284; 80; 16; 23.4394284; 80; 16; 31.7; 16; 22.6519688; 80; 16; 22.6519688; 80; 16; 6.498; 16; 4.64329631; 80; 16; 4.64329631; 80; 
35; 16; 32.802; 16; 23.4394284; 80; 16; 23.4394284; 80; 16; 31.7; 16; 22.6519688; 80; 16; 22.6519688; 80; 16; 6.498; 16; 4.64329631; 80; 16; 4.64329631; 80; 
36; 16; 32.802; 16; 23.4394284; 80; 16; 23.4394284; 80; 16; 31.7; 16; 22.6519688; 80; 16; 22.6519688; 80; 16; 6.498; 16; 4.64329631; 80; 16; 4.64329631; 80; 
37; 20.4725; 32.802; 18.7134503; 23.4394284; 80; 18.7134503; 23.4394284; 80; 20.4725; 31.7; 18.7134503; 22.6519688; 80; 18.7134503; 22.6519688; 80; 20.4725; 6.498; 18.7134503; 4.64329631; 80; 18.7134503; 4.64329631; 80; 
38; 20.4725; 32.802; 18.7134503; 23.4394284; 80; 18.7134503; 23.4394284; 80; 20.4725; 31.7; 18.7134503; 22.6519688; 80; 18.7134503; 22.6519688; 80; 20.4725; 6.498; 18.7134503; 4.64329631; 80; 18.7134503; 4.64329631; 80; 
39; 20.7; 32.802; 18.7134503; 23.4394284; 80; 18.7134503; 23.4394284; 80; 20.7; 31.7; 18.7134503; 22.6519688; 80; 18.7134503; 22.6519688; 80; 20.7; 6.498; 18.7134503; 4.64329631; 80; 18.7134503; 4.64329631; 80; 
40; 20.7; 32.802; 20.7; 23.4394284; 80; 18.7134503; 23.4394284; 80; 20.7; 31.7; 20.7; 22.6519688; 80; 18.7134503; 22.6519688; 80; 20.7; 6.498; 20.7; 4.64329631; 80; 18.7134503; 4.64329631; 80; 
41; 20.4725; 32.802; 18.7134503; 23.4394284; 80; 18.7134503; 23.4394284; 80; 20.4725; 31.7; 18.7134503; 22.6519688; 80; 18.7134503; 22.6519688; 80; 20.4725; 6.498; 18.7134503; 4.64329631; 80; 18.7134503; 4.64329631; 80; 
42; 20.4725; 32.802; 18.7134503; 23.4394284; 80; 18.7134503; 23.4394284; 80; 20.4725; 31.7; 18.7134503; 22.6519688; 80; 18.7134503; 22.6519688; 80; 20.4725; 6.498; 18.7134503; 4.64329631; 80; 18.7134503; 4.64329631; 80; 
43; 13.4015; 32.802; 12.9127485; 31.3284002; 80; 17.1416059; 27.8737083; 80; 13.4015; 31.7; 12.9127485; 27.1986633; 80; 17.1416059; 36.2339533; 77.3581266; 13.4015; 6.498; 12.9127485; 5.57529697; 80; 17.1416059; 6.93092882; 80; 
44; 4.67685; 32.802; 6.32194144; 39.7789349; 79.4580696; 6.32194144; 33.4400422; 79.7865868; 4.67685; 31.7; 6.32194144; 36.3786447; 80; 6.32194144; 46.4319015; 75; 4.67685; 6.498; 6.32194144; 7.45337832; 79.9850363; 6.32194144; 7.7530723; 78.3844978; 
45; 5.47; 32.802; 7.39408356; 42.5772346; 75; 7.39408356; 41.5748208; 75; 5.47; 31.7; 7.39408356; 42.1237941; 75; 7.39408356; 36.2210932; 75; 5.47; 6.498; 7.39408356; 8.62776823; 75; 7.39408356; 7.8927025; 75; 
46; 4.67685; 32.802; 6.32194144; 44.7384583; 75; 6.32194144; 46.550554; 75; 4.67685; 31.7; 6.32194144; 43.2447663; 75; 6.32194144; 39.5394151; 75; 4.67685; 6.498; 6.32194144; 8.85793171; 75; 6.32194144; 9.13670854; 75; 
47; 4.67685; 32.802; 7.39408356; 44.7623288; 75; 7.39408356; 44.6551169; 75; 4.67685; 31.7; 7.39408356; 43.2693165; 75; 7.39408356; 46.4286277; 75; 4.67685; 6.498; 7.39408356; 8.86300636; 75; 7.39408356; 7.95006383; 75; 
48; 4.67685; 32.802; 4.67685; 44.7715245; 75; 4.67685; 44.6658213; 75; 4.67685; 31.7; 4.67685; 43.2788745; 75; 4.67685; 42.3198519; 76.0540399; 4.67685; 6.498; 4.67685; 8.86500898; 75; 4.67685; 8.36793859; 75; 
49; 4.67685; 32.802; 4.67685; 44.7751511; 75; 4.67685; 44.2855969; 75.4361173; 4.67685; 31.7; 4.67685; 43.2827939; 75; 4.67685; 42.3317589; 75; 4.67685; 6.498; 4.67685; 8.86586258; 75; 4.67685; 9.23532768; 75; 
50; 4.67685; 32.802; 4.67685; 44.7743552; 75; 4.67685; 41.3971708; 78.3132214; 4.67685; 31.7; 4.67685; 43.2822117; 75; 4.67685; 43.2143146; 75; 4.67685; 6.498; 4.67685; 8.86578758; 75; 4.67685; 8.82864515; 75; 
51; 4.67685; 32.802; 4.67685; 44.7717788; 75; 4.67685; 41.8183068; 75; 4.67685; 31.7; 4.67685; 43.2798548; 75; 4.67685; 36.1634406; 75; 4.67685; 6.498; 4.67685; 8.86534934; 75; 4.67685; 8.82750012; 75; 
52; 4.67685; 32.802; 4.67685; 44.7677267; 75; 4.67685; 44.6987298; 75; 4.67685; 31.7; 4.67685; 43.2760395; 75; 4.67685; 39.4835267; 75; 4.67685; 6.498; 4.67685; 8.86461269; 75; 4.67685; 8.82608043; 75; 
53; 4.67685; 32.802; 4.67685; 44.7625143; 75; 4.67685; 44.6996654; 75; 4.67685; 31.7; 4.67685; 43.2710861; 75; 4.67685; 46.4037927; 75; 4.67685; 6.498; 4.67685; 8.86364249; 75; 4.67685; 8.82444199; 75; 
54; 4.67685; 32.802; 4.67685; 44.7562958; 75; 4.67685; 44.6960969; 75; 4.67685; 31.7; 4.67685; 43.265152; 75; 4.67685; 41.5741968; 75; 4.67685; 6.498; 4.67685; 8.86247099; 75; 4.67685; 8.82261176; 75; 
55; 5.47; 32.802; 5.47; 44.7491469; 75; 5.47; 44.6895559; 75; 5.47; 31.7; 5.47; 43.2583148; 75; 5.47; 42.3118402; 75; 5.47; 6.498; 5.47; 8.86111405; 75; 5.47; 8.82060309; 75; 
56; 5.47; 32.802; 5.47; 44.7411068; 75; 5.47; 44.6810745; 75; 5.47; 31.7; 5.47; 43.2506141; 75; 5.47; 43.8568418; 75; 5.47; 6.498; 5.47; 8.85957978; 75; 5.47; 8.81842289; 75; 
57; 5.47; 32.802; 5.47; 44.7321971; 75; 5.47; 44.6712354; 75; 5.47; 31.7; 5.47; 43.2420717; 75; 5.47; 37.3999259; 75; 5.47; 6.498; 5.47; 8.85787266; 75; 5.47; 7.94873394; 75; 
58; 5.47; 32.802; 5.47; 44.7224313; 75; 5.47; 44.6603158; 75; 5.47; 31.7; 5.47; 43.2327011; 75; 5.47; 40.0873017; 75; 5.47; 6.498; 5.47; 8.85599546; 75; 5.47; 8.35542661; 75; 
59; 5.47; 32.802; 5.47; 44.7118191; 75; 5.47; 44.6484494; 75; 5.47; 31.7; 5.47; 43.2225119; 75; 5.47; 45.6967918; 75; 5.47; 6.498; 5.47; 8.85395013; 75; 5.47; 9.20520601; 75; 
60; 5.47; 32.802; 5.47; 44.7003683; 75; 5.47; 44.6357025; 75; 5.47; 31.7; 5.47; 43.2115116; 75; 5.47; 40.9231394; 75; 5.47; 6.498; 5.47; 8.85173823; 75; 5.47; 8.80361223; 75; 
61; 5.47; 32.802; 5.47; 44.6880857; 75; 5.47; 44.6221092; 75; 5.47; 31.7; 5.47; 43.199707; 75; 5.47; 41.9155132; 75; 5.47; 6.498; 5.47; 8.84936114; 75; 5.47; 8.80064595; 75; 
62; 5.47; 32.802; 5.47; 44.6749778; 75; 5.47; 44.607689; 75; 5.47; 31.7; 5.47; 43.1871043; 75; 5.47; 42.253647; 75; 5.47; 6.498; 5.47; 8.84682015; 75; 5.47; 8.61994165; 75; 
63; 5.47; 32.802; 5.47; 44.6610508; 75; 5.47; 43.8681858; 75; 5.47; 31.7; 5.47; 43.1737096; 75; 5.47; 42.08111; 75; 5.47; 6.498; 5.47; 8.84411648; 75; 5.47; 7.84591032; 75; 
64; 5.47; 32.802; 5.47; 44.6463109; 75; 5.47; 44.1938496; 75; 5.47; 31.7; 5.47; 43.1595287; 75; 5.47; 43.7784249; 75; 5.47; 6.498; 5.47; 8.84125137; 75; 5.47; 8.42015999; 75; 
65; 5.47; 32.802; 5.47; 44.6307639; 75; 5.47; 44.8888483; 75; 5.47; 31.7; 5.47; 43.1445675; 75; 5.47; 35.6215236; 75; 5.47; 6.498; 5.47; 8.83822598; 75; 5.47; 9.17478375; 75; 
66; 5.47; 32.802; 5.47; 44.614416; 75; 5.47; 44.5382381; 75; 5.47; 31.7; 5.47; 43.1288317; 75; 5.47; 39.0672309; 75; 5.47; 6.498; 5.47; 8.83504151; 75; 5.47; 8.77817355; 75; 
67; 5.47; 32.802; 5.47; 44.5972728; 75; 5.47; 44.5198475; 75; 5.47; 31.7; 5.47; 43.1123269; 75; 5.47; 46.2629461; 75; 5.47; 6.498; 5.47; 8.83169913; 75; 5.47; 8.17224169; 75; 
68; 4.67685; 32.802; 5.47; 44.5793403; 75; 4.67685; 40.4943636; 75; 4.67685; 31.7; 5.47; 43.0950589; 75; 4.67685; 42.8701982; 75; 4.67685; 6.498; 5.47; 8.82819998; 75; 4.67685; 8.32124269; 75; 
69; 4.67685; 32.802; 4.67685; 44.5606243; 75; 4.67685; 41.4508064; 75; 4.67685; 31.7; 4.67685; 43.0770332; 75; 4.67685; 42.8512333; 75; 4.67685; 6.498; 4.67685; 8.82454522; 75; 4.67685; 8.97062073; 75; 
70; 4.67685; 32.802; 4.67685; 44.5411304; 75; 4.67685; 45.7987559; 75; 4.67685; 31.7; 4.67685; 43.0582554; 75; 4.67685; 40.7560729; 75; 4.67685; 6.498; 4.67685; 8.820736; 75; 4.67685; 8.81828182; 75; 
71; 4.67685; 32.802; 4.67685; 44.5208645; 75; 4.67685; 44.8334781; 75; 4.67685; 31.7; 4.67685; 43.038731; 75; 4.67685; 41.7148063; 75; 4.67685; 6.498; 4.67685; 8.81677345; 75; 4.67685; 8.2801741; 75; 
72; 4.67685; 32.802; 4.67685; 44.4998321; 75; 2.97879845; 36.7195513; 75; 4.67685; 31.7; 4.67685; 43.0184655; 75; 2.97879845; 43.7334533; 75; 4.67685; 6.498; 4.67685; 8.81265868; 75; 2.97879845; 6.92741118; 75; 
73; 4.67685; 32.802; 4.67685; 44.478039; 75; 4.67685; 40.3162248; 75; 4.67685; 31.7; 4.67685; 42.9974642; 75; 4.67685; 42.7573627; 75; 4.67685; 6.498; 4.67685; 8.80839283; 75; 4.67685; 8.12939832; 75; 
74; 4.67685; 32.802; 4.67685; 44.4554906; 75; 4.67685; 47.8327551; 75; 4.67685; 31.7; 4.67685; 42.9757327; 75; 4.67685; 41.6865943; 75; 4.67685; 6.498; 4.67685; 8.80397699; 75; 4.67685; 9.45141351; 75; 
75; 4.67685; 32.802; 4.67685; 44.4321926; 75; 4.67685; 42.4945579; 75; 4.67685; 31.7; 4.67685; 42.9532763; 75; 4.67685; 42.1578546; 75; 4.67685; 6.498; 4.67685; 8.79941226; 75; 4.67685; 8.63974985; 75; 
76; 4.67685; 32.802; 4.67685; 44.4081503; 75; 4.67685; 43.3128433; 75; 4.67685; 31.7; 4.67685; 42.9301003; 75; 4.67685; 43.1640833; 75; 4.67685; 6.498; 4.67685; 8.79469975; 75; 4.67685; 8.64850848; 75; 
77; 4.67685; 32.802; 4.67685; 44.3833694; 75; 4.67685; 45.0435601; 75; 4.67685; 31.7; 4.67685; 42.9062099; 75; 4.67685; 42.6211319; 75; 4.67685; 6.498; 4.67685; 8.78984052; 75; 4.67685; 8.73815937; 75; 
78; 9.43575; 32.802; 10.89; 36.6839836; 80; 11.088707; 34.9042453; 80; 9.43575; 31.7; 10.89; 32.7223221; 80; 11.088707; 39.8763617; 75; 9.43575; 6.498; 10.89; 7.63695522; 80; 11.088707; 8.06792254; 75.3860626; 
79; 9.43575; 32.802; 10.89; 35.5019419; 78.1990788; 9.48084452; 24.5601396; 80; 9.43575; 31.7; 10.89; 31.3573783; 80; 9.48084452; 41.1771061; 75; 9.43575; 6.498; 10.89; 7.77954137; 75; 9.48084452; 6.26842499; 75; 
80; 9.43575; 32.802; 10.89; 32.6065113; 80; 11.088707; 23.4394284; 80; 9.43575; 31.7; 10.89; 31.2705341; 80; 11.088707; 33.8235461; 75; 9.43575; 6.498; 10.89; 6.8347562; 80; 11.088707; 4.89038004; 80; 
81; 9.43575; 32.802; 10.89; 23.4394284; 80; 11.088707; 23.4394284; 80; 9.43575; 31.7; 10.89; 22.6519688; 80; 11.088707; 22.6519688; 78.0111791; 9.43575; 6.498; 10.89; 4.64329631; 80; 11.088707; 4.64329631; 80; 
82; 9.43575; 32.802; 10.89; 23.4394284; 77.558491; 11.088707; 23.884981; 77.8020352; 9.43575; 31.7; 10.89; 22.6519688; 77.5831872; 11.088707; 25.9953914; 75.1614537; 9.43575; 6.498; 10.89; 4.64329631; 77.5138005; 11.088707; 4.64329631; 78.1695137; 
83; 8.06756625; 32.802; 9.31095; 37.4935689; 75; 9.48084452; 31.5842561; 75; 8.06756625; 31.7; 9.31095; 35.6971277; 75; 9.48084452; 39.5440223; 77.2618853; 8.06756625; 6.498; 9.31095; 6.33487015; 75; 9.48084452; 6.15708335; 75; 
84; 8.06756625; 32.802; 10.89; 48.9004992; 75; 9.48084452; 41.1597483; 75; 8.06756625; 31.7; 10.89; 44.069091; 75; 9.48084452; 39.4034712; 75; 8.06756625; 6.498; 10.89; 9.10208779; 75; 9.48084452; 8.92607457; 75; 
85; 8.06756625; 32.802; 9.31095; 45.3645936; 75; 9.48084452; 45.7585871; 75; 8.06756625; 31.7; 9.31095; 42.5756865; 75; 9.48084452; 31.8335809; 75; 8.06756625; 6.498; 9.31095; 9.46992418; 75; 9.48084452; 7.39961511; 75; 
86; 8.06756625; 32.802; 9.31095; 38.2708735; 80; 9.48084452; 45.203695; 75.9064522; 8.06756625; 31.7; 9.31095; 38.5903097; 80; 9.48084452; 29.5339872; 75; 8.06756625; 6.498; 9.31095; 7.62495287; 80; 9.48084452; 5.99443963; 80; 
87; 9.194135; 32.802; 10.51715; 28.9243874; 80; 11.088707; 32.9048856; 80; 9.194135; 31.7; 10.51715; 31.7000005; 80; 11.088707; 33.2858313; 80; 9.194135; 6.498; 10.51715; 6.4980001; 80; 11.088707; 6.64322619; 75; 
88; 13.32; 32.802; 10.89; 24.5149726; 80; 11.088707; 23.4394284; 75.7258816; 13.32; 31.7; 10.89; 27.153306; 80; 11.088707; 32.1688253; 75; 13.32; 6.498; 10.89; 5.56599944; 80; 11.088707; 5.29895504; 76.78594; 
89; 13.32; 32.802; 10.89; 23.4394284; 80; 11.088707; 23.4394284; 80; 13.32; 31.7; 10.89; 22.6519688; 80; 11.088707; 22.6519688; 80; 13.32; 6.498; 10.89; 4.64329631; 80; 11.088707; 4.64329631; 80; 
90; 13.32; 32.802; 10.89; 23.4394284; 80; 11.088707; 23.4394284; 80; 13.32; 31.7; 10.89; 22.6519688; 80; 11.088707; 22.6519688; 77.9956981; 13.32; 6.498; 10.89; 4.64329631; 80; 11.088707; 4.64329631; 78.3498398; 
91; 13.32; 32.802; 10.89; 23.4394284; 80; 11.088707; 23.4394284; 80; 13.32; 31.7; 10.89; 22.6519688; 80; 11.088707; 22.6519688; 80; 13.32; 6.498; 10.89; 4.64329631; 80; 11.088707; 4.64329631; 78.8347412; 
92; 13.32; 32.802; 10.89; 23.4394284; 80; 11.088707; 23.4394284; 80; 13.32; 31.7; 10.89; 22.6519688; 80; 11.088707; 22.6519688; 80; 13.32; 6.498; 10.89; 4.64329631; 80; 11.088707; 4.64329631; 80; 
93; 13.32; 32.802; 10.89; 23.4394284; 80; 11.088707; 23.4394284; 80; 13.32; 31.7; 10.89; 22.6519688; 80; 11.088707; 22.6519688; 78.0828001; 13.32; 6.498; 10.89; 4.64329631; 80; 11.088707; 4.64329631; 80; 
94; 13.32; 32.802; 10.89; 23.4394284; 80; 11.088707; 23.4394284; 78.3911402; 13.32; 31.7; 10.89; 22.6519688; 80; 11.088707; 22.6519688; 80; 13.32; 6.498; 10.89; 4.64329631; 80; 11.088707; 4.64329631; 78.0023931; 
95; 13.32; 32.802; 10.89; 23.4394284; 80; 11.088707; 23.4394284; 79.1080487; 13.32; 31.7; 10.89; 22.6519688; 80; 11.088707; 22.6519688; 80; 13.32; 6.498; 10.89; 4.64329631; 80; 11.088707; 4.64329631; 80; 
96; 13.32; 32.802; 16; 37.4935689; 75; 15.551293; 37.4935689; 77.3020768; 13.32; 31.7; 16; 36.2339533; 77.0659672; 15.551293; 27.0395726; 75; 13.32; 6.498; 16; 7.42738891; 75; 15.551293; 7.42738891; 75; 
