t; nomPriceB5; nomPlPowB5; integrPriceB5; integrPlPowB5; integrT_in_B5; disagg_price_bus5; PlPowB5; disaggT_in_B5;  initFeasThres; finalFeasThres; accept_gap; iterations; CPUmaster; CPUsubproblem; CPUfeasPt; finalDetectGap; nomCongestionCost; intCongestionCost; disaggCongestionCost; Objective; nomImprovPercent; CoopPotentialPercent; nominalCost; integratedCost
1; 13.32; 71; 10.52; 60.8165523; 80; 10.52; 60.8165523; 80; 35.5; 6.48699966; 5e-05; 225; 13.9359999; 30.3600006; 0.749000013; 4.81317061e-05; 232380.919; 33832.7919; 31786.6076; 1816323.52; 15.173261; 99.9764754; 2141215.78; 1816247.08
2; 13.32; 71; 16.12; 66.0938793; 80; 16.12; 66.0938793; 80; 
3; 13.32; 71; 16.12; 65.9406578; 80; 16.12; 76.4306072; 80; 
4; 13.32; 71; 16.12; 51.4260892; 80; 16.12; 61.725107; 80; 
5; 13.32; 71; 16.12; 65.6566306; 80; 16.12; 59.730305; 80; 
6; 13.32; 71; 17.7861988; 81.4352202; 80; 16.12; 71.322627; 80; 
7; 13.32; 71; 16.12; 68.8543434; 80; 16.12; 64.1033234; 80; 
8; 13.32; 71; 16.12; 69.4629257; 80; 16.12; 69.4626828; 80; 
9; 13.32; 71; 16.12; 67.6292688; 80; 19.7520216; 68.084067; 80; 
10; 13.32; 71; 18.8538012; 50.7346935; 80; 16.8879784; 50.7346935; 80; 
11; 39.15; 71; 30.1; 50.7346935; 80; 30.1; 50.7346935; 80; 
12; 39.15; 71; 30.1; 50.7346935; 80; 30.1; 50.7346935; 80; 
13; 39.15; 71; 30.1; 50.7346935; 80; 30.1; 50.7346935; 80; 
14; 39.15; 71; 30.1; 50.7346935; 80; 30.1; 50.7346935; 80; 
15; 36.65; 71; 30.1; 50.7346935; 80; 30.1; 50.7346935; 80; 
16; 39.15; 71; 30.1; 50.7346935; 80; 30.1; 50.7346935; 80; 
17; 39.15; 71; 30.1; 50.7346935; 80; 30.1; 50.7346935; 80; 
18; 39.15; 71; 30.1; 50.7346935; 80; 30.1; 50.7346935; 80; 
19; 39.15; 71; 30.1; 50.7346935; 80; 30.1; 50.7346935; 80; 
20; 39.15; 71; 30.1; 50.7346935; 80; 30.1; 50.7346935; 80; 
21; 39.15; 71; 30.1; 50.7346935; 80; 30.1; 50.7346935; 80; 
22; 39.15; 71; 30.1; 50.7346935; 80; 30.1; 50.7346935; 80; 
23; 39.15; 71; 30.1; 50.7346935; 80; 30.1; 50.7346935; 80; 
24; 39.15; 71; 30.1; 50.7346935; 80; 30.1; 50.7346935; 80; 
25; 255.566746; 71; 47.0097866; 50.7346935; 80; 44.2433776; 50.7346935; 80; 
26; 218.509568; 71; 47.0097866; 50.7346935; 80; 44.2433776; 50.7346935; 80; 
27; 255.566746; 71; 47.0097866; 50.7346935; 80; 44.2433776; 50.7346935; 80; 
28; 255.566746; 71; 47.0097866; 50.7346935; 80; 44.2433776; 50.7346935; 80; 
29; 255.566746; 71; 21.8636976; 50.7346935; 80; 21.6547491; 50.7346935; 80; 
30; 25.0072091; 71; 21.8636976; 50.7346935; 80; 21.6547491; 50.7346935; 80; 
31; 25.0072091; 71; 21.8636976; 50.7346935; 80; 21.6547491; 50.7346935; 80; 
32; 25.0072091; 71; 21.8636976; 50.7346935; 80; 21.6547491; 50.7346935; 80; 
33; 25.0072091; 71; 21.8636976; 50.7346935; 80; 21.6547491; 50.7346935; 80; 
34; 25.0072091; 71; 21.8636976; 50.7346935; 80; 21.6547491; 50.7346935; 80; 
35; 25.0072091; 71; 21.8636976; 50.7346935; 80; 21.6547491; 50.7346935; 80; 
36; 25.0072091; 71; 21.8636976; 50.7346935; 80; 21.6547491; 50.7346935; 80; 
37; 29.2481977; 71; 25.5715762; 50.7346935; 80; 25.327192; 50.7346935; 80; 
38; 29.2481977; 71; 25.5715762; 50.7346935; 80; 25.327192; 50.7346935; 80; 
39; 29.2481977; 71; 25.5715762; 50.7346935; 80; 25.327192; 50.7346935; 80; 
40; 29.2481977; 71; 25.5715762; 50.7346935; 80; 25.327192; 50.7346935; 80; 
41; 29.2481977; 71; 25.5715762; 50.7346935; 80; 25.327192; 50.7346935; 80; 
42; 29.2481977; 71; 25.5715762; 50.7346935; 80; 25.327192; 50.7346935; 80; 
43; 29.2481977; 71; 25.5715762; 50.7346935; 80; 25.327192; 50.7346935; 80; 
44; 29.2481977; 71; 13.2951678; 51.565733; 80; 21.6547491; 52.2092799; 80; 
45; 6.30720906; 71; 15.5499038; 67.4119288; 80; 25.327192; 67.1550443; 80; 
46; 5.47; 71; 13.2951678; 79.006082; 80; 9.60621144; 79.0058391; 80; 
47; 5.47; 71; 13.2951678; 79.649995; 80; 9.60621144; 79.649995; 80; 
48; 5.47; 71; 13.2951678; 89.4180393; 75.5356706; 9.60621144; 88.9906931; 75.4349519; 
49; 5.47; 71; 15.5499038; 96.340589; 75; 11.235335; 96.7059699; 75; 
50; 5.47; 71; 5.47; 97.4111221; 75; 5.47; 97.3768725; 75; 
51; 5.47; 71; 5.47; 97.4348965; 75; 5.47; 97.4682728; 75; 
52; 5.47; 71; 5.47; 97.4447693; 75; 5.47; 97.4410378; 75; 
53; 5.47; 71; 5.47; 97.4452702; 75; 5.47; 97.4408397; 75; 
54; 5.47; 71; 5.47; 97.4407701; 75; 5.47; 97.4363614; 75; 
55; 5.47; 71; 5.47; 97.4329806; 75; 5.47; 97.1637868; 75.1403235; 
56; 5.47; 71; 5.47; 97.4225602; 75; 5.47; 97.1574491; 75; 
57; 5.47; 71; 5.47; 97.4099028; 75; 5.47; 97.3812757; 75.0146274; 
58; 5.47; 71; 5.47; 97.395201; 75; 5.47; 97.069197; 75.1390157; 
59; 5.47; 71; 5.47; 97.3785527; 75; 5.47; 97.101709; 75; 
60; 5.47; 71; 5.47; 97.3600111; 75; 5.47; 97.2981302; 75; 
61; 5.47; 71; 5.47; 97.3396086; 75; 5.47; 97.301009; 75; 
62; 5.47; 71; 5.47; 97.3173673; 75; 5.47; 97.360554; 75; 
63; 5.47; 71; 7.28660826; 97.2933049; 75; 6.39766082; 97.0578267; 75.1277079; 
64; 5.47; 71; 7.28660826; 97.2674366; 75; 6.39766082; 97.0301857; 75.0030266; 
65; 6.39766082; 71; 7.28660826; 97.2397765; 75; 6.39766082; 97.0569885; 75.0986622; 
66; 6.39766082; 71; 7.28660826; 97.2103383; 75; 6.39766082; 96.9234341; 75; 
67; 6.39766082; 71; 7.28660826; 97.1791352; 75; 6.39766082; 97.0330906; 75; 
68; 5.47; 71; 7.28660826; 97.1461801; 75; 6.39766082; 97.0068842; 75; 
69; 5.47; 71; 7.28660826; 97.111486; 75; 6.39766082; 97.0374394; 75; 
70; 5.47; 71; 6.23005006; 97.0750657; 75; 5.47; 97.1303319; 75; 
71; 5.47; 71; 6.23005006; 97.0369319; 75; 5.47; 97.0736647; 75; 
72; 5.47; 71; 6.23005006; 96.9970971; 75; 5.47; 96.3440028; 75.2360027; 
73; 5.47; 71; 6.23005006; 96.9555738; 75; 5.47; 96.4138072; 75; 
74; 5.47; 71; 6.23005006; 96.9123744; 75; 5.47; 96.7042821; 75.1737351; 
75; 5.47; 71; 6.23005006; 96.8675111; 75; 5.47; 96.5236571; 75.0217021; 
76; 5.47; 71; 6.23005006; 96.8209963; 75; 5.47; 96.7433878; 75.0330232; 
77; 8.07204466; 71; 7.28660826; 84.3291274; 80; 16; 84.0968949; 80; 
78; 17.3550271; 71; 16; 61.3066776; 80; 16; 61.1247833; 80; 
79; 17.3550271; 71; 16; 50.7346935; 80; 16; 51.1503021; 80; 
80; 17.3550271; 71; 16; 50.7346935; 80; 16; 51.1508518; 80; 
81; 17.3550271; 71; 16; 50.7346935; 80; 16; 51.2057528; 80; 
82; 17.3550271; 71; 16; 53.6624486; 77.4395459; 16; 55.8889545; 76.3852533; 
83; 16; 71; 16; 62.8958798; 75; 16; 64.0716115; 75; 
84; 14.8385482; 71; 15.1232165; 88.8636214; 75; 14.3970175; 89.7594348; 75; 
85; 14.8385482; 71; 16; 105.386494; 75; 16; 106.282307; 75; 
86; 14.8385482; 71; 13.68; 99.4670376; 75; 13.68; 98.2665393; 75; 
87; 14.8385482; 71; 16; 94.242701; 75; 16; 95.1385144; 75; 
88; 14.8385482; 71; 14.4367835; 83.3441524; 80; 16; 84.2399658; 80; 
89; 14.8385482; 71; 13.68; 68.2233762; 80; 13.8946784; 69.1191896; 75; 
90; 14.8385482; 71; 13.68; 63.6228033; 80; 13.68; 64.7508492; 80; 
91; 17.3550271; 71; 16; 58.0827972; 80; 16; 59.9011387; 80; 
92; 17.3550271; 71; 16; 53.2177162; 80; 14.9483041; 54.3457621; 80; 
93; 17.3550271; 71; 16; 53.1929458; 80; 16; 52.2701854; 80; 
94; 17.3550271; 71; 16; 50.7346935; 80; 16; 51.556541; 78.0845847; 
95; 17.3550271; 71; 16; 50.7346935; 80; 16; 51.7413038; 80; 
96; 17.3550271; 71; 25.4; 81.1549111; 77.2217754; 25.4; 76.7521995; 75; 
