t; nomPriceB5; nomPlPowB5; integrPriceB5; integrPlPowB5; integrT_in_B5; disagg_price_bus5; PlPowB5; disaggT_in_B5; nomPriceB10; nomPlPowB10; integrPriceB10; integrPlPowB10; integrT_in_B10; disagg_price_bus10; PlPowB10; disaggT_in_B10; nomPriceB9; nomPlPowB9; integrPriceB9; integrPlPowB9; integrT_in_B9; disagg_price_bus9; PlPowB9; disaggT_in_B9; nomPriceB19; nomPlPowB19; integrPriceB19; integrPlPowB19; integrT_in_B19; disagg_price_bus19; PlPowB19; disaggT_in_B19;  initFeasThres; finalFeasThres; accept_gap; iterations; CPUmaster; CPUsubproblem; CPUfeasPt; finalDetectGap; nomCongestionCost; intCongestionCost; disaggCongestionCost; Objective; nomImprovPercent; CoopPotentialPercent; nominalCost; integratedCost
1; 10.52; 35.5; 10.52; 30.4082761; 80; 10.52; 30.505577; 80; 10.52; 97.5; 10.52; 83.515688; 80; 10.52; 83.515688; 80; 10.52; 87.5; 10.52; 74.9499764; 80; 10.52; 74.9802713; 80; 10.52; 90.5; 10.52; 77.5196899; 80; 10.52; 77.5196899; 80; 311; 14.8118885; 0.0001; 2560; 1612.28003; 524.018005; 0.651000023; 9.90971582e-05; 2.59862188e-10; 6.1010226e-10; 1.34970663e-09; 1812620.1; 1.83052679; 99.5104911; 1846419.3; 1812453.84
2; 10.52; 35.5; 10.52; 25.3673467; 80; 10.52; 25.7856156; 80; 10.52; 97.5; 10.52; 73.0808887; 80; 10.52; 70.5580276; 80; 10.52; 87.5; 10.52; 75.0751747; 80; 10.52; 72.0904474; 80; 10.52; 90.5; 10.52; 77.6491807; 80; 10.52; 82.864125; 80; 
3; 10.52; 35.5; 10.52; 25.3673467; 80; 10.52; 26.0777033; 80; 10.52; 97.5; 10.52; 73.0468709; 80; 10.52; 70.6031586; 80; 10.52; 87.5; 10.52; 74.949977; 80; 10.52; 71.9685583; 80; 10.52; 90.5; 10.52; 77.5196905; 80; 10.52; 84.6341154; 80; 
4; 10.52; 35.5; 10.52; 30.4590709; 80; 10.52; 27.1067858; 80; 10.52; 97.5; 10.52; 69.6708819; 80; 10.52; 69.7636188; 80; 10.52; 87.5; 10.52; 72.2240717; 80; 10.52; 72.761902; 80; 10.52; 90.5; 10.52; 64.6688699; 80; 10.52; 67.2785405; 80; 
5; 10.52; 35.5; 10.52; 30.4082764; 80; 10.52; 29.474528; 80; 10.52; 97.5; 10.52; 69.6708819; 80; 10.52; 72.3879992; 80; 10.52; 87.5; 10.52; 75.015369; 80; 10.52; 83.3104935; 80; 10.52; 90.5; 10.52; 77.6491807; 80; 10.52; 66.2209046; 80; 
6; 10.52; 35.5; 10.52; 25.3673467; 80; 10.52; 28.2557016; 80; 10.52; 97.5; 10.52; 69.6708819; 80; 10.52; 77.9336762; 80; 10.52; 87.5; 10.52; 80.2652872; 80; 10.52; 94.3511907; 80; 10.52; 90.5; 10.52; 90.5000013; 80; 10.52; 65.9311904; 80; 
7; 10.52; 35.5; 10.52; 25.3673467; 80; 10.52; 25.9556089; 80; 10.52; 97.5; 10.52; 69.6708819; 80; 10.52; 75.292769; 80; 10.52; 87.5; 10.52; 84.4020904; 80; 10.52; 85.5700975; 80; 10.52; 90.5; 10.52; 77.5196905; 80; 10.52; 71.4963468; 80; 
8; 10.52; 35.5; 10.52; 30.4590709; 80; 10.52; 25.9641444; 80; 10.52; 97.5; 10.52; 69.6708819; 80; 10.52; 69.7465073; 80; 10.52; 87.5; 10.52; 69.5983728; 80; 10.52; 65.4111283; 80; 10.52; 90.5; 10.52; 78.4550124; 80; 10.52; 88.4163704; 80; 
9; 10.52; 35.5; 10.52; 30.4082764; 80; 10.52; 27.9619698; 80; 10.52; 97.5; 10.52; 69.6708819; 80; 10.52; 69.8099374; 80; 10.52; 87.5; 10.52; 65.0489414; 80; 10.52; 64.2153557; 80; 10.52; 90.5; 10.52; 78.3174834; 80; 10.52; 82.8131327; 80; 
10; 10.52; 35.5; 10.8938462; 25.3673467; 80; 14.1813333; 27.7807199; 80; 10.52; 97.5; 10.8938462; 69.6708819; 80; 14.1813333; 69.8006076; 80; 10.52; 87.5; 10.8938462; 65.0237644; 80; 14.1813333; 63.4384293; 80; 10.52; 90.5; 10.8938462; 64.6688699; 80; 14.1813333; 65.6066252; 80; 
11; 15.4738462; 35.5; 14.2161538; 25.3673467; 80; 14.1813333; 25.3673467; 80; 15.4738462; 97.5; 14.2161538; 69.6708819; 80; 14.1813333; 69.6724521; 80; 15.4738462; 87.5; 14.2161538; 62.5251504; 80; 14.1813333; 62.6721489; 80; 15.4738462; 90.5; 14.2161538; 64.6688699; 80; 14.1813333; 65.2819001; 80; 
12; 15.4738462; 35.5; 14.2161538; 25.3673467; 80; 14.1813333; 25.8219266; 80; 15.4738462; 97.5; 14.2161538; 69.6708819; 80; 14.1813333; 69.6708819; 80; 15.4738462; 87.5; 14.2161538; 62.5251504; 80; 14.1813333; 63.5526514; 80; 15.4738462; 90.5; 14.2161538; 64.6688699; 80; 14.1813333; 65.2757846; 80; 
13; 15.4738462; 35.5; 14.2161538; 25.3673467; 80; 14.1813333; 25.9229534; 80; 15.4738462; 97.5; 14.2161538; 69.6708819; 80; 14.1813333; 69.6807382; 80; 15.4738462; 87.5; 14.2161538; 62.5251504; 80; 14.1813333; 63.5424012; 80; 15.4738462; 90.5; 14.2161538; 64.6688699; 80; 14.1813333; 65.4433027; 80; 
14; 15.4738462; 35.5; 14.2161538; 25.3673467; 80; 14.1813333; 26.3039975; 80; 15.4738462; 97.5; 14.2161538; 69.6708819; 80; 14.1813333; 69.6806399; 80; 15.4738462; 87.5; 14.2161538; 62.5251504; 80; 14.1813333; 62.5251504; 80; 15.4738462; 90.5; 14.2161538; 64.6688699; 80; 14.1813333; 65.9450171; 80; 
15; 15.4738462; 35.5; 14.2161538; 25.3673467; 80; 14.1813333; 26.3258416; 80; 15.4738462; 97.5; 14.2161538; 69.6708819; 80; 14.1813333; 69.7123411; 80; 15.4738462; 87.5; 14.2161538; 62.5251504; 80; 14.1813333; 63.1149624; 80; 15.4738462; 90.5; 14.2161538; 64.6688699; 80; 14.1813333; 65.7179664; 80; 
16; 15.4738462; 35.5; 14.2161538; 25.3673467; 80; 14.1813333; 26.3282061; 80; 15.4738462; 97.5; 14.2161538; 69.6708819; 80; 14.1813333; 69.7718002; 80; 15.4738462; 87.5; 14.2161538; 62.5251504; 80; 14.1813333; 63.1090785; 80; 15.4738462; 90.5; 14.2161538; 64.6688699; 80; 14.1813333; 65.6022292; 80; 
17; 15.4738462; 35.5; 14.2161538; 25.3673467; 80; 14.1813333; 26.1866398; 80; 15.4738462; 97.5; 14.2161538; 69.6708819; 80; 14.1813333; 69.7301573; 80; 15.4738462; 87.5; 14.2161538; 62.5251504; 80; 14.1813333; 62.5251504; 80; 15.4738462; 90.5; 14.2161538; 64.6688699; 80; 14.1813333; 65.0689919; 80; 
18; 15.4738462; 35.5; 14.2161538; 25.3673467; 80; 14.1813333; 25.3673467; 80; 15.4738462; 97.5; 14.2161538; 69.6708819; 80; 14.1813333; 69.7048906; 80; 15.4738462; 87.5; 14.2161538; 62.5251504; 80; 14.1813333; 62.529554; 80; 15.4738462; 90.5; 14.2161538; 64.6688699; 80; 14.1813333; 64.6787682; 80; 
19; 15.4738462; 35.5; 14.2161538; 25.3673467; 80; 14.1813333; 25.3673467; 80; 15.4738462; 97.5; 14.2161538; 69.6708819; 80; 14.1813333; 69.7045514; 80; 15.4738462; 87.5; 14.2161538; 62.5251504; 80; 14.1813333; 62.6011605; 80; 15.4738462; 90.5; 14.2161538; 64.6688699; 80; 14.1813333; 65.2782178; 80; 
20; 15.4738462; 35.5; 14.2161538; 25.3673467; 80; 14.1813333; 25.3673467; 80; 15.4738462; 97.5; 14.2161538; 69.6708819; 80; 14.1813333; 69.6784848; 80; 15.4738462; 87.5; 14.2161538; 62.5251504; 80; 14.1813333; 62.8417531; 80; 15.4738462; 90.5; 14.2161538; 64.6688699; 80; 14.1813333; 65.2721391; 80; 
21; 15.4738462; 35.5; 14.2161538; 25.3673467; 80; 14.1813333; 25.3673467; 80; 15.4738462; 97.5; 14.2161538; 69.6708819; 80; 14.1813333; 69.678409; 80; 15.4738462; 87.5; 14.2161538; 62.5251504; 80; 14.1813333; 63.777888; 80; 15.4738462; 90.5; 14.2161538; 64.6688699; 80; 14.1813333; 64.9670233; 80; 
22; 15.4738462; 35.5; 14.2161538; 25.3673467; 80; 14.1813333; 25.7025119; 80; 15.4738462; 97.5; 14.2161538; 69.6708819; 80; 14.1813333; 69.7273209; 80; 15.4738462; 87.5; 14.2161538; 62.5251504; 80; 14.1813333; 63.5246009; 80; 15.4738462; 90.5; 14.2161538; 64.6688699; 80; 14.1813333; 65.5353422; 80; 
23; 15.4738462; 35.5; 14.2161538; 25.3673467; 80; 14.1813333; 25.839469; 80; 15.4738462; 97.5; 14.2161538; 69.6708819; 80; 14.1813333; 69.7304732; 80; 15.4738462; 87.5; 14.2161538; 62.5251504; 80; 14.1813333; 62.5251504; 80; 15.4738462; 90.5; 14.2161538; 64.6688699; 80; 14.1813333; 65.7631895; 80; 
24; 15.4738462; 35.5; 14.2161538; 25.3673467; 80; 14.1813333; 25.5062477; 80; 15.4738462; 97.5; 14.2161538; 69.6708819; 80; 14.1813333; 69.6908436; 80; 15.4738462; 87.5; 14.2161538; 62.5251504; 80; 14.1813333; 62.8349808; 80; 15.4738462; 90.5; 14.2161538; 64.6688699; 80; 14.1813333; 65.1923209; 80; 
25; 17.0523077; 35.5; 13.68; 25.3673467; 80; 13.68; 25.3673467; 80; 17.0523077; 97.5; 13.68; 69.6708819; 80; 13.68; 69.687003; 80; 17.0523077; 87.5; 13.68; 62.5251504; 80; 13.68; 63.0434436; 80; 17.0523077; 90.5; 13.68; 64.6688699; 80; 13.68; 64.6688699; 80; 
26; 16; 35.5; 13.68; 25.3673467; 80; 13.68; 25.3673467; 80; 16; 97.5; 13.68; 69.6708819; 80; 13.68; 69.6959212; 80; 16; 87.5; 13.68; 62.5251504; 80; 13.68; 62.7345937; 80; 16; 90.5; 13.68; 64.6688699; 80; 13.68; 64.8043071; 80; 
27; 16; 35.5; 13.68; 25.3673467; 80; 13.68; 25.3673467; 80; 16; 97.5; 13.68; 69.6708819; 80; 13.68; 69.71101; 80; 16; 87.5; 13.68; 62.5251504; 80; 13.68; 62.5251504; 80; 16; 90.5; 13.68; 64.6688699; 80; 13.68; 64.802956; 80; 
28; 16; 35.5; 13.68; 25.3673467; 80; 13.68; 25.3673467; 80; 16; 97.5; 13.68; 69.6708819; 80; 13.68; 69.7037182; 80; 16; 87.5; 13.68; 62.5251504; 80; 13.68; 62.6790737; 80; 16; 90.5; 13.68; 64.6688699; 80; 13.68; 65.0731784; 80; 
29; 16; 35.5; 13.68; 25.3673467; 80; 13.68; 25.3673467; 80; 16; 97.5; 13.68; 69.6708819; 80; 13.68; 69.6883565; 80; 16; 87.5; 13.68; 62.5251504; 80; 13.68; 62.6775382; 80; 16; 90.5; 13.68; 64.6688699; 80; 13.68; 65.069145; 80; 
30; 16; 35.5; 13.68; 25.3673467; 80; 13.68; 25.3673467; 80; 16; 97.5; 13.68; 69.6708819; 80; 13.68; 69.6955415; 80; 16; 87.5; 13.68; 62.5251504; 80; 13.68; 62.5251504; 80; 16; 90.5; 13.68; 64.6688699; 80; 13.68; 64.8745714; 80; 
31; 16; 35.5; 13.68; 25.3673467; 80; 13.68; 25.4028817; 80; 16; 97.5; 13.68; 69.6708819; 80; 13.68; 69.6952955; 80; 16; 87.5; 13.68; 62.5251504; 80; 13.68; 62.6350764; 80; 16; 90.5; 13.68; 64.6688699; 80; 13.68; 65.0747666; 80; 
32; 16; 35.5; 13.68; 25.3673467; 80; 13.68; 25.4025272; 80; 16; 97.5; 13.68; 69.6708819; 80; 13.68; 69.6992109; 80; 16; 87.5; 13.68; 62.5251504; 80; 13.68; 62.6339797; 80; 16; 90.5; 13.68; 64.6688699; 80; 13.68; 64.8690995; 80; 
33; 16; 35.5; 13.68; 25.3673467; 80; 13.68; 25.3673467; 80; 16; 97.5; 13.68; 69.6708819; 80; 13.68; 69.6989283; 80; 16; 87.5; 13.68; 62.5251504; 80; 13.68; 62.6800914; 80; 16; 90.5; 13.68; 64.6688699; 80; 13.68; 64.6688699; 80; 
34; 16; 35.5; 13.68; 25.3673467; 80; 13.68; 25.7111971; 80; 16; 97.5; 13.68; 69.6708819; 80; 13.68; 69.6708819; 80; 16; 87.5; 13.68; 62.5251504; 80; 13.68; 63.0071798; 80; 16; 90.5; 13.68; 64.6688699; 80; 13.68; 64.6688699; 80; 
35; 16; 35.5; 13.68; 25.3673467; 80; 13.68; 25.8907197; 80; 16; 97.5; 13.68; 69.6708819; 80; 13.68; 69.6708819; 80; 16; 87.5; 13.68; 62.5251504; 80; 13.68; 62.8505061; 80; 16; 90.5; 13.68; 64.6688699; 80; 13.68; 64.6688699; 80; 
36; 18.1338462; 35.5; 16; 25.3673467; 80; 16; 25.5484744; 80; 18.1338462; 97.5; 16; 69.6708819; 80; 16; 69.6708819; 80; 18.1338462; 87.5; 16; 62.5251504; 80; 16; 62.5251504; 80; 18.1338462; 90.5; 16; 64.6688699; 80; 16; 64.6688699; 80; 
37; 20.7; 35.5; 16; 25.3673467; 80; 16; 25.76693; 80; 20.7; 97.5; 16; 69.6708819; 80; 16; 69.6708819; 80; 20.7; 87.5; 16; 62.5251504; 80; 16; 62.5251504; 80; 20.7; 90.5; 16; 64.6688699; 80; 16; 64.6688699; 80; 
38; 20.7; 35.5; 16; 25.3673467; 80; 16; 25.7629438; 80; 20.7; 97.5; 16; 69.6708819; 80; 16; 69.7059032; 80; 20.7; 87.5; 16; 62.5251504; 80; 16; 62.610027; 80; 20.7; 90.5; 16; 64.6688699; 80; 16; 64.8825874; 80; 
39; 20.7; 35.5; 16; 25.3673467; 80; 16; 25.3673467; 80; 20.7; 97.5; 16; 69.6708819; 80; 16; 69.7055538; 80; 20.7; 87.5; 16; 62.5251504; 80; 16; 62.6091803; 80; 20.7; 90.5; 16; 64.6688699; 80; 16; 64.8804553; 80; 
40; 20.7; 35.5; 16; 25.3673467; 80; 16; 25.3673467; 80; 20.7; 97.5; 16; 69.6708819; 80; 16; 69.6853652; 80; 20.7; 87.5; 16; 62.5251504; 80; 16; 62.5251504; 80; 20.7; 90.5; 16; 64.6688699; 80; 16; 64.6688699; 80; 
41; 20.7; 35.5; 16; 25.3673467; 80; 16; 25.3898767; 80; 20.7; 97.5; 16; 69.6708819; 80; 16; 69.6852207; 80; 20.7; 87.5; 16; 62.5251504; 80; 16; 62.6628229; 80; 20.7; 90.5; 16; 64.6688699; 80; 16; 64.6688699; 80; 
42; 20.7; 35.5; 16; 25.3673467; 80; 16; 25.4947323; 80; 20.7; 97.5; 16; 69.6708819; 80; 16; 69.6708819; 80; 20.7; 87.5; 16; 62.5251504; 80; 16; 62.6614495; 80; 20.7; 90.5; 16; 64.6688699; 80; 16; 64.8334941; 80; 
43; 10.04; 35.5; 16; 30.4590709; 80; 16; 26.5945666; 80; 10.04; 97.5; 16; 69.6708819; 80; 16; 69.7127046; 80; 10.04; 87.5; 16; 72.0655837; 80; 16; 85.7984107; 80; 10.04; 90.5; 16; 74.7165432; 80; 16; 64.8895526; 80; 
44; 5.47; 35.5; 8.77084871; 30.4082764; 80; 13.68; 26.9835482; 80; 5.47; 97.5; 8.77084871; 69.6708819; 80; 13.68; 89.8428401; 80; 5.47; 87.5; 8.77084871; 84.5204336; 80; 13.68; 86.2154629; 80; 5.47; 90.5; 8.77084871; 84.2238505; 80; 13.68; 65.8654398; 80; 
45; 5.47; 35.5; 10.2583026; 36.9712348; 80; 16; 26.3687116; 80; 5.47; 97.5; 10.2583026; 69.6708819; 80; 16; 114.775854; 80; 5.47; 87.5; 10.2583026; 95.7390084; 80; 16; 65.3824944; 80; 5.47; 90.5; 10.2583026; 100.096513; 80; 16; 96.1860528; 80; 
46; 5.47; 35.5; 8.77084871; 41.9471998; 80; 6.21643759; 37.1806899; 80; 5.47; 97.5; 8.77084871; 83.6551946; 80; 6.21643759; 113.336825; 80; 5.47; 87.5; 8.77084871; 98.6395147; 80; 6.21643759; 65.0811654; 80; 5.47; 90.5; 8.77084871; 103.306591; 80; 6.21643759; 112.032975; 80; 
47; 5.47; 35.5; 8.77084871; 38.1209954; 80; 6.21643759; 41.755105; 80; 5.47; 97.5; 8.77084871; 111.830494; 80; 6.21643759; 107.09497; 80; 5.47; 87.5; 8.77084871; 96.2606775; 80; 6.21643759; 98.0462427; 77.7602141; 5.47; 90.5; 8.77084871; 97.3191853; 80; 6.21643759; 96.7181895; 80; 
48; 5.47; 35.5; 8.77084871; 39.9554517; 80; 6.21643759; 42.3387626; 75.8233015; 5.47; 97.5; 8.77084871; 128.62458; 75.3355647; 6.21643759; 108.520594; 79.5818055; 5.47; 87.5; 8.77084871; 97.9255835; 80; 6.21643759; 115.00708; 79.4809249; 5.47; 90.5; 8.77084871; 102.092141; 79.9979003; 6.21643759; 103.229866; 77.2129799; 
49; 5.47; 35.5; 10.2583026; 43.9575772; 75; 7.27068724; 46.7184732; 75.4068417; 5.47; 97.5; 10.2583026; 121.228568; 75; 7.27068724; 121.701895; 75; 5.47; 87.5; 10.2583026; 108.524354; 75; 7.27068724; 101.058402; 75; 5.47; 90.5; 10.2583026; 112.249836; 75; 7.27068724; 116.20956; 75; 
50; 5.47; 35.5; 5.47; 48.6886782; 75; 5.47; 47.3195591; 75; 5.47; 97.5; 5.47; 127.307617; 75; 5.47; 133.60095; 75; 5.47; 87.5; 5.47; 120.184292; 75; 5.47; 115.975948; 75; 5.47; 90.5; 5.47; 124.304507; 75; 5.47; 123.588636; 75; 
51; 5.47; 35.5; 5.47; 48.7189256; 75; 5.47; 49.3255451; 75; 5.47; 97.5; 5.47; 138.056682; 75; 5.47; 133.722176; 75; 5.47; 87.5; 5.47; 120.257465; 75; 5.47; 123.695184; 75; 5.47; 90.5; 5.47; 124.380173; 75; 5.47; 125.432179; 75; 
52; 5.47; 35.5; 5.47; 48.7299208; 75; 5.47; 48.1054958; 75.5045661; 5.47; 97.5; 5.47; 133.065375; 75; 5.47; 133.731654; 75; 5.47; 87.5; 5.47; 120.28328; 75; 5.47; 119.749152; 75.1045604; 5.47; 90.5; 5.47; 124.406868; 75; 5.47; 124.071721; 75; 
53; 5.47; 35.5; 5.47; 48.7348077; 75; 5.47; 48.1155605; 75; 5.47; 97.5; 5.47; 133.071995; 75; 5.47; 133.744084; 75; 5.47; 87.5; 5.47; 120.293948; 75; 5.47; 119.760003; 75.0009448; 5.47; 90.5; 5.47; 124.4179; 75; 5.47; 123.759279; 75; 
54; 5.47; 35.5; 5.47; 48.7350046; 75; 5.47; 48.3370054; 75; 5.47; 97.5; 5.47; 133.070664; 75; 5.47; 133.745106; 75; 5.47; 87.5; 5.47; 120.293125; 75; 5.47; 120.000235; 75; 5.47; 90.5; 5.47; 124.417049; 75; 5.47; 124.00158; 75; 
55; 5.47; 35.5; 5.47; 48.7330273; 75; 5.47; 48.4525484; 75; 5.47; 97.5; 5.47; 133.065085; 75; 5.47; 133.739826; 75; 5.47; 87.5; 5.47; 120.287034; 75; 5.47; 119.941618; 75; 5.47; 90.5; 5.47; 124.41075; 75; 5.47; 124.307678; 75; 
56; 5.47; 35.5; 5.47; 48.7294513; 75; 5.47; 48.6785106; 75; 5.47; 97.5; 5.47; 133.055942; 75; 5.47; 133.726492; 75.0014771; 5.47; 87.5; 5.47; 120.27697; 75; 5.47; 119.929644; 75; 5.47; 90.5; 5.47; 124.400342; 75; 5.47; 123.965563; 75.0281821; 
57; 5.47; 35.5; 5.47; 48.7245957; 75; 5.47; 48.5699316; 75; 5.47; 97.5; 5.47; 133.043707; 75; 5.47; 133.699421; 75; 5.47; 87.5; 5.47; 120.263761; 75; 5.47; 119.983589; 75; 5.47; 90.5; 5.47; 124.386681; 75; 5.47; 123.999254; 75; 
58; 5.47; 35.5; 5.47; 48.7186368; 75; 5.47; 48.5834501; 75; 5.47; 97.5; 5.47; 133.028635; 75; 5.47; 133.693912; 75; 5.47; 87.5; 5.47; 120.247842; 75; 5.47; 119.728955; 75; 5.47; 90.5; 5.47; 124.370217; 75; 5.47; 124.035745; 75.0465174; 
59; 5.47; 35.5; 5.47; 48.7116614; 75; 5.47; 48.4720917; 75.1004709; 5.47; 97.5; 5.47; 133.010857; 75; 5.47; 133.657463; 75; 5.47; 87.5; 5.47; 120.229426; 75; 5.47; 119.81134; 75; 5.47; 90.5; 5.47; 124.351171; 75; 5.47; 123.575177; 75; 
60; 5.47; 35.5; 5.47; 48.703714; 75; 5.47; 48.4499778; 75.0165919; 5.47; 97.5; 5.47; 132.990444; 75; 5.47; 133.638723; 75; 5.47; 87.5; 5.47; 120.208624; 75; 5.47; 120.027248; 75; 5.47; 90.5; 5.47; 124.329656; 75; 5.47; 123.727934; 75; 
61; 5.47; 35.5; 5.47; 48.694819; 75; 5.47; 48.5358751; 75; 5.47; 97.5; 5.47; 132.967439; 75; 5.47; 133.648387; 75; 5.47; 87.5; 5.47; 120.185495; 75; 5.47; 119.877987; 75; 5.47; 90.5; 5.47; 124.305735; 75; 5.47; 124.153354; 75; 
62; 5.47; 35.5; 5.47; 48.6849917; 75; 5.47; 48.5419506; 75; 5.47; 97.5; 5.47; 132.941872; 75; 5.47; 133.612841; 75; 5.47; 87.5; 5.47; 120.160076; 75; 5.47; 119.859806; 75; 5.47; 90.5; 5.47; 124.279447; 75; 5.47; 123.659667; 75.1692336; 
63; 5.47; 35.5; 5.47; 48.6742427; 75; 5.47; 48.4021879; 75; 5.47; 97.5; 5.47; 132.913769; 75; 5.47; 133.571273; 75; 5.47; 87.5; 5.47; 120.132395; 75; 5.47; 119.759635; 75; 5.47; 90.5; 5.47; 124.250818; 75; 5.47; 123.549511; 75; 
64; 5.47; 35.5; 5.47; 48.6625806; 75; 5.47; 48.3847244; 75; 5.47; 97.5; 5.47; 132.883149; 75; 5.47; 133.544236; 75; 5.47; 87.5; 5.47; 120.102472; 75; 5.47; 119.588404; 75; 5.47; 90.5; 5.47; 124.21987; 75; 5.47; 123.892538; 75; 
65; 5.47; 35.5; 5.47; 48.6500129; 75; 5.47; 48.3714672; 75; 5.47; 97.5; 5.47; 132.850033; 75; 5.47; 133.519719; 75; 5.47; 87.5; 5.47; 120.070325; 75; 5.47; 119.725144; 75; 5.47; 90.5; 5.47; 124.186622; 75; 5.47; 123.666479; 75; 
66; 5.47; 35.5; 5.47; 48.6365467; 75; 5.47; 48.1620337; 75; 5.47; 97.5; 5.47; 132.814439; 75; 5.47; 133.477175; 75.0005466; 5.47; 87.5; 5.47; 120.035972; 75; 5.47; 119.564727; 75; 5.47; 90.5; 5.47; 124.151092; 75; 5.47; 123.778473; 75; 
67; 5.47; 35.5; 5.47; 48.6221888; 75; 5.47; 48.4043803; 75; 5.47; 97.5; 5.47; 132.776387; 75; 5.47; 133.428997; 75.0004495; 5.47; 87.5; 5.47; 119.99943; 75; 5.47; 119.454244; 75; 5.47; 90.5; 5.47; 124.113298; 75; 5.47; 123.960779; 75; 
68; 5.47; 35.5; 5.47; 48.6069457; 75; 5.47; 48.2909305; 75; 5.47; 97.5; 5.47; 132.735893; 75; 5.47; 133.39082; 75; 5.47; 87.5; 5.47; 119.960715; 75; 5.47; 119.723708; 75; 5.47; 90.5; 5.47; 124.073257; 75; 5.47; 123.807815; 75; 
69; 5.47; 35.5; 5.47; 48.5908241; 75; 5.47; 48.1777099; 75.1166331; 5.47; 97.5; 5.47; 132.692976; 75; 5.47; 133.356766; 75; 5.47; 87.5; 5.47; 119.919843; 75; 5.47; 119.677191; 75; 5.47; 90.5; 5.47; 124.030984; 75; 5.47; 123.604671; 75; 
70; 5.47; 35.5; 5.47; 48.5738304; 75; 5.47; 48.168957; 75; 5.47; 97.5; 5.47; 132.647654; 75; 5.47; 133.279217; 75; 5.47; 87.5; 5.47; 119.876829; 75; 5.47; 119.225387; 75; 5.47; 90.5; 5.47; 123.986497; 75; 5.47; 123.635857; 75; 
71; 5.47; 35.5; 5.47; 48.555971; 75; 5.47; 48.2067474; 75; 5.47; 97.5; 5.47; 132.599945; 75; 5.47; 133.235396; 75; 5.47; 87.5; 5.47; 119.83169; 75; 5.47; 119.348159; 75; 5.47; 90.5; 5.47; 123.939811; 75; 5.47; 123.328484; 75; 
72; 5.47; 35.5; 5.47; 48.5372522; 75; 5.47; 48.2913117; 75; 5.47; 97.5; 5.47; 132.549865; 75; 5.47; 133.217071; 75; 5.47; 87.5; 5.47; 119.784441; 75; 5.47; 119.555907; 75.0407692; 5.47; 90.5; 5.47; 123.890944; 75; 5.47; 123.402977; 75; 
73; 5.47; 35.5; 5.47; 48.5176804; 75; 5.47; 48.1433846; 75; 5.47; 97.5; 5.47; 132.497433; 75; 5.47; 133.158148; 75; 5.47; 87.5; 5.47; 119.735097; 75; 5.47; 118.921409; 75.1819516; 5.47; 90.5; 5.47; 123.83991; 75; 5.47; 123.763075; 75; 
74; 5.47; 35.5; 9.86547149; 48.4972618; 75; 9.05922315; 47.40642; 75; 5.47; 97.5; 9.86547149; 132.442666; 75; 9.05922315; 132.734195; 75; 5.47; 87.5; 9.86547149; 119.683675; 75; 9.05922315; 118.688011; 75.1217944; 5.47; 90.5; 9.86547149; 123.786725; 75; 9.05922315; 122.468395; 75.2350873; 
75; 5.47; 35.5; 10.52; 41.9608964; 75; 9.05922315; 47.2193831; 75; 5.47; 97.5; 10.52; 132.38558; 75; 9.05922315; 132.810357; 75; 5.47; 87.5; 10.52; 119.630189; 75; 9.05922315; 114.396478; 75.2932888; 5.47; 90.5; 10.52; 123.731406; 75; 9.05922315; 122.649898; 75; 
76; 5.47; 35.5; 10.52; 45.0125857; 75; 9.05922315; 47.99891; 75; 5.47; 97.5; 10.52; 132.326193; 75; 9.05922315; 133.118934; 75; 5.47; 87.5; 10.52; 103.471071; 75; 9.05922315; 115.75442; 75; 5.47; 90.5; 10.52; 117.275688; 75; 9.05922315; 100.581318; 80; 
77; 5.47; 35.5; 9.14188594; 44.9176892; 75; 9.05922315; 48.1676584; 75; 5.47; 97.5; 9.14188594; 132.264522; 75; 9.05922315; 132.904431; 75; 5.47; 87.5; 9.14188594; 81.982161; 75; 9.05922315; 120.652166; 75; 5.47; 90.5; 9.14188594; 120.234812; 75; 9.05922315; 77.8395872; 80; 
78; 5.47; 35.5; 10.6922643; 35.5000005; 80; 10.5955826; 37.4671095; 75; 5.47; 97.5; 10.6922643; 114.779582; 80; 10.5955826; 132.407317; 75; 5.47; 87.5; 10.6922643; 99.1471178; 75; 10.5955826; 93.1687549; 80; 5.47; 90.5; 10.6922643; 96.9042681; 80; 10.5955826; 72.6628029; 80; 
79; 12.1185984; 35.5; 10.6922643; 35.5000005; 80; 10.5955826; 35.6026399; 75; 12.1185984; 97.5; 10.6922643; 117.023285; 75; 10.5955826; 132.532279; 75; 12.1185984; 87.5; 10.6922643; 95.4153731; 75; 10.5955826; 77.048649; 80; 12.1185984; 90.5; 10.6922643; 64.6688699; 80; 10.5955826; 67.588619; 80; 
80; 12.1185984; 35.5; 10.6922643; 35.5000005; 80; 10.5955826; 39.3112151; 80; 12.1185984; 97.5; 10.6922643; 116.828522; 80; 10.5955826; 113.839666; 75; 12.1185984; 87.5; 10.6922643; 78.5661691; 75; 10.5955826; 75.1533808; 80; 12.1185984; 90.5; 10.6922643; 64.6688699; 80; 10.5955826; 67.4239583; 80; 
81; 12.1185984; 35.5; 10.6922643; 38.9238096; 80; 10.5955826; 31.0629153; 80; 12.1185984; 97.5; 10.6922643; 83.5156887; 80; 10.5955826; 114.985993; 75; 12.1185984; 87.5; 10.6922643; 83.7480553; 75; 10.5955826; 80.3587548; 80; 12.1185984; 90.5; 10.6922643; 95.8526632; 80; 10.5955826; 66.3295912; 80; 
82; 12.1185984; 35.5; 10.6922643; 38.8896541; 75; 10.86; 27.7424607; 80; 12.1185984; 97.5; 10.6922643; 97.7211505; 80; 10.86; 102.467712; 75; 12.1185984; 87.5; 10.6922643; 96.646174; 75; 10.86; 80.6899505; 75; 12.1185984; 90.5; 10.6922643; 95.5415772; 80; 10.86; 94.5341437; 80; 
83; 10.3614016; 35.5; 10.6922643; 30.4082764; 80; 10.86; 27.4282282; 80; 10.3614016; 97.5; 10.6922643; 116.065908; 80; 10.86; 111.636781; 75; 10.3614016; 87.5; 10.6922643; 100.232394; 75; 10.86; 88.8816088; 75; 10.3614016; 90.5; 10.6922643; 90.4648468; 80; 10.86; 93.6939392; 80; 
84; 10.3614016; 35.5; 10.6922643; 36.8380487; 80; 10.86; 36.6184911; 80; 10.3614016; 97.5; 10.6922643; 119.746191; 75; 10.86; 135.007159; 75; 10.3614016; 87.5; 10.6922643; 80.6229257; 75; 10.86; 98.6888484; 75; 10.3614016; 90.5; 10.6922643; 103.18782; 80; 10.86; 64.6688699; 80; 
85; 10.3614016; 35.5; 10.6922643; 41.8153424; 80; 10.86; 36.2229797; 75; 10.3614016; 97.5; 10.6922643; 116.973978; 75; 10.86; 129.394085; 75; 10.3614016; 87.5; 10.6922643; 103.45192; 75; 10.86; 109.142963; 75; 10.3614016; 90.5; 10.6922643; 109.519767; 75; 10.86; 64.9676104; 80; 
86; 10.3614016; 35.5; 9.83094297; 35.5000005; 80; 10.86; 41.1648172; 75; 10.3614016; 97.5; 9.83094297; 85.4936224; 80; 10.86; 121.832303; 75; 10.3614016; 87.5; 9.83094297; 97.4833111; 80; 10.86; 98.0259485; 80; 10.3614016; 90.5; 9.83094297; 109.330028; 75; 10.86; 67.1049541; 77.863007; 
87; 13.32; 35.5; 10.6922643; 38.6026993; 80; 10.86; 41.0821581; 75; 13.32; 97.5; 10.6922643; 100.353109; 80; 10.86; 86.1647227; 75.3069137; 13.32; 87.5; 10.6922643; 69.7440781; 80; 10.86; 80.6242497; 80; 13.32; 90.5; 10.6922643; 103.085432; 80; 10.86; 104.078847; 75; 
88; 13.32; 35.5; 10.6922643; 38.5717472; 80; 10.86; 26.017235; 78.392106; 13.32; 97.5; 10.6922643; 100.047027; 80; 10.86; 69.705993; 80; 13.32; 87.5; 10.6922643; 105.766762; 75; 10.86; 80.6859358; 80; 13.32; 90.5; 10.6922643; 89.9795707; 80; 10.86; 135.090076; 75; 
89; 13.32; 35.5; 10.6922643; 35.5000005; 80; 10.86; 37.8900168; 80; 13.32; 97.5; 10.6922643; 97.0945063; 80; 10.86; 69.7171578; 80; 13.32; 87.5; 10.6922643; 98.2597734; 80; 10.86; 63.2494213; 80; 13.32; 90.5; 10.6922643; 64.6688699; 80; 10.86; 126.745117; 75; 
90; 13.32; 35.5; 10.6922643; 38.7472222; 80; 10.86; 46.6306365; 75; 13.32; 97.5; 10.6922643; 96.8209313; 80; 10.86; 69.6972087; 80; 13.32; 87.5; 10.6922643; 74.9302594; 80; 10.86; 73.0992401; 75; 13.32; 90.5; 10.6922643; 71.3329346; 80; 10.86; 94.296854; 75; 
91; 13.32; 35.5; 10.1754715; 33.9275657; 80; 10.86; 34.4614307; 75; 13.32; 97.5; 10.1754715; 97.2712449; 80; 10.86; 73.7141578; 77.1242417; 13.32; 87.5; 10.1754715; 74.8065074; 80; 10.86; 105.313471; 75; 13.32; 90.5; 10.1754715; 71.2664546; 80; 10.86; 104.441999; 75; 
92; 13.32; 35.5; 10.6922643; 30.7604951; 80; 10.86; 40.2367637; 75; 13.32; 97.5; 10.6922643; 110.980219; 80; 10.86; 79.2841266; 80; 13.32; 87.5; 10.6922643; 79.2151425; 75; 10.86; 111.427567; 75; 13.32; 90.5; 10.6922643; 64.6688699; 80; 10.86; 104.135189; 75; 
93; 13.32; 35.5; 10.6922643; 35.5000005; 80; 10.86; 40.6353691; 75; 13.32; 97.5; 10.6922643; 104.840678; 80; 10.86; 82.8881618; 80; 13.32; 87.5; 10.6922643; 83.1964472; 75; 10.86; 79.2942649; 80; 13.32; 90.5; 10.6922643; 64.6688699; 80; 10.86; 104.51125; 76.9785913; 
94; 13.32; 35.5; 10.6922643; 35.5000005; 80; 10.86; 41.1005998; 75; 13.32; 97.5; 10.6922643; 109.872035; 80; 10.86; 77.2951173; 76.8550213; 13.32; 87.5; 10.6922643; 67.3902312; 80; 10.86; 73.2584857; 75; 13.32; 90.5; 10.6922643; 99.6894352; 75; 10.86; 131.568343; 75; 
95; 13.32; 35.5; 10.6922643; 30.4082764; 80; 10.86; 40.1030431; 80; 13.32; 97.5; 10.6922643; 88.5693524; 75; 10.86; 69.7082419; 80; 13.32; 87.5; 10.6922643; 63.2762388; 80; 10.86; 72.6632555; 80; 13.32; 90.5; 10.6922643; 99.340074; 75; 10.86; 92.8956676; 75; 
96; 13.32; 35.5; 20.93; 40.5774556; 75; 20.7; 37.1328542; 75; 13.32; 97.5; 20.93; 111.445124; 75; 20.7; 111.236147; 75; 13.32; 87.5; 20.93; 100.014855; 75; 20.7; 96.3741325; 75; 13.32; 90.5; 20.93; 103.443936; 75; 20.7; 98.8167385; 75; 
