t; nomPriceB5; nomPlPowB5; integrPriceB5; integrPlPowB5; integrT_in_B5; disagg_price_bus5; PlPowB5; disaggT_in_B5;  initFeasThres; finalFeasThres; accept_gap; iterations; CPUmaster; CPUsubproblem; CPUfeasPt; finalDetectGap; nomCongestionCost; intCongestionCost; disaggCongestionCost; Objective; nomImprovPercent; CoopPotentialPercent; nominalCost; integratedCost
1; 10.52; 71; 10.52; 60.8165523; 80; 10.52; 60.8165523; 80; 14.2; 2.96772839; 2e-05; 395; 25.7070007; 47.6020012; 0.688000023; 1.68266817e-05; 2.27134469e-10; -4.80638862e-10; -1.81828897e-09; 1804408.17; 0.512101962; 99.6850115; 1813696.15; 1804378.83
2; 10.52; 71; 10.52; 50.7346935; 80; 10.52; 51.2715332; 80; 
3; 10.52; 71; 10.52; 50.7346935; 80; 10.52; 51.3017941; 80; 
4; 10.52; 71; 10.52; 50.7346935; 80; 10.52; 50.9922194; 80; 
5; 10.52; 71; 10.52; 50.7346935; 80; 10.52; 66.2918334; 80; 
6; 10.52; 71; 10.52; 50.7346935; 80; 10.52; 66.2226794; 80; 
7; 10.52; 71; 10.52; 50.7346935; 80; 10.52; 70.4007636; 80; 
8; 10.52; 71; 10.52; 69.8574689; 80; 10.52; 80.9400214; 80; 
9; 10.52; 71; 10.52; 77.2645831; 80; 10.52; 69.1344729; 80; 
10; 10.52; 71; 10.52; 58.2567787; 80; 10.52; 58.2565359; 80; 
11; 14.59; 71; 14.59; 50.7346935; 80; 14.59; 50.8533846; 80; 
12; 15.5475; 71; 15.3761538; 50.7346935; 80; 15.3761538; 50.7346935; 80; 
13; 15.5475; 71; 15.3761538; 50.7346935; 80; 15.3761538; 50.7346935; 80; 
14; 15.5475; 71; 15.3761538; 50.7346935; 80; 15.3761538; 50.7346935; 80; 
15; 15.5475; 71; 15.3761538; 50.7346935; 80; 15.3761538; 50.7346935; 80; 
16; 15.5475; 71; 15.3761538; 50.7346935; 80; 15.3761538; 50.7346935; 80; 
17; 15.5475; 71; 15.3761538; 50.7346935; 80; 15.3761538; 50.8804589; 80; 
18; 15.5475; 71; 15.3761538; 50.7346935; 80; 15.3761538; 50.9066932; 80; 
19; 15.5475; 71; 15.3761538; 50.7346935; 80; 15.3761538; 51.0749797; 80; 
20; 15.5475; 71; 15.3761538; 50.7346935; 80; 15.3761538; 51.0444464; 80; 
21; 15.5475; 71; 15.3761538; 50.7346935; 80; 15.3761538; 50.7346935; 80; 
22; 15.5475; 71; 15.3761538; 50.7346935; 80; 15.3761538; 50.7346935; 80; 
23; 15.5475; 71; 15.3761538; 50.7346935; 80; 15.3761538; 50.7536737; 80; 
24; 15.5475; 71; 15.3761538; 50.7346935; 80; 15.3761538; 50.7534843; 80; 
25; 17.81; 71; 16.6238462; 50.7346935; 80; 16.6238462; 50.7346935; 80; 
26; 16; 71; 16; 50.7346935; 80; 16; 50.7346935; 80; 
27; 16; 71; 16; 50.7346935; 80; 16; 50.7346935; 80; 
28; 16; 71; 16; 50.7346935; 80; 16; 50.7346935; 80; 
29; 16; 71; 16; 50.7346935; 80; 16; 50.7346935; 80; 
30; 16; 71; 16; 50.7346935; 80; 16; 50.7494942; 80; 
31; 16; 71; 16; 50.7346935; 80; 16; 50.7493466; 80; 
32; 16; 71; 16; 50.7346935; 80; 16; 50.7346935; 80; 
33; 16; 71; 16; 50.7346935; 80; 16; 50.8443367; 80; 
34; 16; 71; 16; 50.7346935; 80; 16; 50.8432429; 80; 
35; 16; 71; 16; 50.7346935; 80; 16; 50.7346935; 80; 
36; 16; 71; 16; 50.7346935; 80; 16; 50.7346935; 80; 
37; 20.4725; 71; 18.7134503; 50.7346935; 80; 18.7134503; 50.7346935; 80; 
38; 20.4725; 71; 18.7134503; 50.7346935; 80; 18.7134503; 50.7346935; 80; 
39; 20.7; 71; 18.7134503; 50.7346935; 80; 18.7134503; 50.7346935; 80; 
40; 20.7; 71; 20.7; 50.7346935; 80; 20.7; 50.7346935; 80; 
41; 20.4725; 71; 18.7134503; 50.7346935; 80; 18.7134503; 50.7346935; 80; 
42; 20.4725; 71; 18.7134503; 50.7346935; 80; 18.7134503; 50.7346935; 80; 
43; 13.4015; 71; 12.9127485; 64.1023604; 80; 12.9127485; 64.2903657; 80; 
44; 4.67685; 71; 6.32194144; 83.6109579; 79.7482587; 6.32194144; 83.6560055; 79.4555767; 
45; 5.47; 71; 7.39408356; 93.3287969; 75; 7.39408356; 93.6390311; 75; 
46; 4.67685; 71; 6.32194144; 96.8411562; 75; 6.32194144; 97.2623296; 75.0499407; 
47; 4.67685; 71; 7.39408356; 96.8946516; 75; 7.39408356; 96.8832982; 75.0385923; 
48; 4.67685; 71; 4.67685; 96.9154079; 75; 4.67685; 96.8895116; 75.0623167; 
49; 4.67685; 71; 4.67685; 96.9238076; 75; 4.67685; 96.938166; 75.0149783; 
50; 4.67685; 71; 4.67685; 96.9223545; 75; 4.67685; 96.9745954; 75.0355628; 
51; 4.67685; 71; 4.67685; 96.9169829; 75; 4.67685; 97.0033878; 75; 
52; 4.67685; 71; 4.67685; 96.9083789; 75; 4.67685; 97.0732868; 75; 
53; 4.67685; 71; 4.67685; 96.8972429; 75; 4.67685; 96.9727566; 75.0437997; 
54; 4.67685; 71; 4.67685; 96.8839188; 75; 4.67685; 96.9238467; 75.0076828; 
55; 5.47; 71; 5.47; 96.8685758; 75; 5.47; 97.000086; 75; 
56; 5.47; 71; 5.47; 96.8513006; 75; 5.47; 97.0173106; 75; 
57; 5.47; 71; 5.47; 96.8321414; 75; 5.47; 96.8366639; 75.0798751; 
58; 5.47; 71; 5.47; 96.8111279; 75; 5.47; 96.7135818; 75.054775; 
59; 5.47; 71; 5.47; 96.7882811; 75; 5.47; 96.8073016; 75.0181646; 
60; 5.47; 71; 5.47; 96.7636181; 75; 5.47; 96.7727988; 75.0481811; 
61; 5.47; 71; 5.47; 96.7371538; 75; 5.47; 96.791719; 75; 
62; 5.47; 71; 5.47; 96.7089022; 75; 5.47; 96.8749749; 75; 
63; 5.47; 71; 5.47; 96.6788769; 75; 5.47; 96.7456415; 75.0469727; 
64; 5.47; 71; 5.47; 96.6470909; 75; 5.47; 96.7144042; 75; 
65; 5.47; 71; 5.47; 96.6135574; 75; 5.47; 96.7588865; 75; 
66; 5.47; 71; 5.47; 96.5782891; 75; 5.47; 96.6789409; 75; 
67; 5.47; 71; 5.47; 96.5412988; 75; 5.47; 96.6732567; 75; 
68; 4.67685; 71; 5.47; 96.5025991; 75; 5.47; 96.6769004; 75; 
69; 4.67685; 71; 4.67685; 96.4622026; 75; 4.67685; 96.6132832; 75; 
70; 4.67685; 71; 4.67685; 96.4201218; 75; 4.67685; 96.5702462; 75; 
71; 4.67685; 71; 4.67685; 96.3763689; 75; 4.67685; 96.4815905; 75; 
72; 4.67685; 71; 4.67685; 96.3309562; 75; 4.67685; 96.4559578; 75; 
73; 4.67685; 71; 4.67685; 96.283896; 75; 4.67685; 96.4511411; 75; 
74; 4.67685; 71; 4.67685; 96.2352003; 75; 4.67685; 96.3812993; 75; 
75; 4.67685; 71; 4.67685; 96.1848811; 75; 4.67685; 96.3300462; 75; 
76; 4.67685; 71; 4.67685; 96.1329503; 75; 4.67685; 96.2469776; 75; 
77; 4.67685; 71; 4.67685; 96.0794198; 75; 4.67685; 95.9604999; 75; 
78; 9.43575; 71; 10.89; 77.043261; 80; 10.7259878; 82.0300835; 80; 
79; 9.43575; 71; 10.89; 74.6388615; 78.7103688; 9.17071956; 62.3873295; 80; 
80; 9.43575; 71; 10.89; 70.7118016; 80; 10.7259878; 53.7909222; 80; 
81; 9.43575; 71; 10.89; 50.7346935; 80; 10.7259878; 51.5485213; 80; 
82; 9.43575; 71; 10.89; 50.7346935; 77.5654272; 10.7259878; 51.4334118; 78.0442474; 
83; 8.06756625; 71; 9.31095; 79.5255668; 75; 10.7259878; 76.5669483; 75; 
84; 8.06756625; 71; 10.89; 102.071678; 75; 10.7259878; 90.2846898; 75; 
85; 8.06756625; 71; 9.31095; 97.4102042; 75; 9.17071956; 93.3203934; 75; 
86; 8.06756625; 71; 9.31095; 84.4861361; 80; 10.7259878; 81.5275176; 75; 
87; 9.194135; 71; 10.51715; 67.122388; 80; 9.17071956; 53.8186805; 77.3404478; 
88; 13.32; 71; 10.89; 57.2342779; 80; 10.7259878; 51.9653264; 80; 
89; 13.32; 71; 10.89; 50.7346935; 80; 10.7259878; 51.7741368; 80; 
90; 13.32; 71; 10.89; 50.7346935; 80; 10.7259878; 51.6850636; 80; 
91; 13.32; 71; 10.89; 50.7346935; 80; 10.7259878; 51.268535; 80; 
92; 13.32; 71; 10.89; 50.7346935; 80; 10.7259878; 51.6753506; 80; 
93; 13.32; 71; 10.89; 50.7346935; 80; 10.7259878; 51.9673883; 80; 
94; 13.32; 71; 10.89; 50.7346935; 80; 10.7259878; 51.9557583; 80; 
95; 13.32; 71; 10.89; 50.7346935; 80; 10.7259878; 51.6132142; 78.3004536; 
96; 13.32; 71; 16; 81.1549111; 75; 18.5080244; 79.3263443; 75; 
