t; nomPriceB5; nomPlPowB5; integrPriceB5; integrPlPowB5; integrT_in_B5; disagg_price_bus5; PlPowB5; disaggT_in_B5;  initFeasThres; finalFeasThres; accept_gap; iterations; CPUmaster; CPUsubproblem; CPUfeasPt; finalDetectGap; nomCongestionCost; intCongestionCost; disaggCongestionCost; Objective; nomImprovPercent; CoopPotentialPercent; nominalCost; integratedCost
1; 10.52; 71; 10.52; 60.8165523; 80; 10.52; 60.8165523; 80; 71; 29.9341293; 0.0001; 151; 11.632; 21.5249996; 0.77700001; 8.1570349e-05; 2.27134469e-10; -4.80638862e-10; 4.26252978e-11; 1804473.52; 0.508499364; 98.9837352; 1813696.15; 1804378.83
2; 10.52; 71; 10.52; 50.7346935; 80; 10.52; 59.8990666; 80; 
3; 10.52; 71; 10.52; 50.7346935; 80; 10.52; 61.2847725; 80; 
4; 10.52; 71; 10.52; 50.7346935; 80; 10.52; 67.8208536; 80; 
5; 10.52; 71; 10.52; 50.7346935; 80; 10.52; 78.8086723; 80; 
6; 10.52; 71; 10.52; 50.7346935; 80; 10.52; 71.3635851; 80; 
7; 10.52; 71; 10.52; 50.7346935; 80; 10.52; 62.442922; 80; 
8; 10.52; 71; 10.52; 69.8574689; 80; 10.52; 58.3533666; 80; 
9; 10.52; 71; 10.52; 77.2645831; 80; 10.52; 61.5362417; 80; 
10; 10.52; 71; 10.52; 58.2567787; 80; 10.52; 58.2565359; 80; 
11; 14.59; 71; 14.59; 50.7346935; 80; 14.59; 51.4895015; 80; 
12; 15.5475; 71; 15.3761538; 50.7346935; 80; 15.3761538; 50.7346935; 80; 
13; 15.5475; 71; 15.3761538; 50.7346935; 80; 15.3761538; 50.7346935; 80; 
14; 15.5475; 71; 15.3761538; 50.7346935; 80; 15.3761538; 50.7346935; 80; 
15; 15.5475; 71; 15.3761538; 50.7346935; 80; 15.3761538; 50.7346935; 80; 
16; 15.5475; 71; 15.3761538; 50.7346935; 80; 15.3761538; 50.7346935; 80; 
17; 15.5475; 71; 15.3761538; 50.7346935; 80; 15.3761538; 50.7346935; 80; 
18; 15.5475; 71; 15.3761538; 50.7346935; 80; 15.3761538; 50.7346935; 80; 
19; 15.5475; 71; 15.3761538; 50.7346935; 80; 15.3761538; 50.7346935; 80; 
20; 15.5475; 71; 15.3761538; 50.7346935; 80; 15.3761538; 50.7346935; 80; 
21; 15.5475; 71; 15.3761538; 50.7346935; 80; 15.3761538; 50.7346935; 80; 
22; 15.5475; 71; 15.3761538; 50.7346935; 80; 15.3761538; 50.7346935; 80; 
23; 15.5475; 71; 15.3761538; 50.7346935; 80; 15.3761538; 50.7346935; 80; 
24; 15.5475; 71; 15.3761538; 50.7346935; 80; 15.3761538; 50.7346935; 80; 
25; 17.81; 71; 16.6238462; 50.7346935; 80; 16.6238462; 50.7346935; 80; 
26; 16; 71; 16; 50.7346935; 80; 16; 50.7346935; 80; 
27; 16; 71; 16; 50.7346935; 80; 16; 50.7346935; 80; 
28; 16; 71; 16; 50.7346935; 80; 16; 50.7346935; 80; 
29; 16; 71; 16; 50.7346935; 80; 16; 50.7346935; 80; 
30; 16; 71; 16; 50.7346935; 80; 16; 50.7346935; 80; 
31; 16; 71; 16; 50.7346935; 80; 16; 50.7346935; 80; 
32; 16; 71; 16; 50.7346935; 80; 16; 50.7346935; 80; 
33; 16; 71; 16; 50.7346935; 80; 16; 50.7346935; 80; 
34; 16; 71; 16; 50.7346935; 80; 16; 50.7346935; 80; 
35; 16; 71; 16; 50.7346935; 80; 16; 50.7346935; 80; 
36; 16; 71; 16; 50.7346935; 80; 16; 50.7346935; 80; 
37; 20.4725; 71; 18.7134503; 50.7346935; 80; 18.7134503; 50.7346935; 80; 
38; 20.4725; 71; 18.7134503; 50.7346935; 80; 18.7134503; 50.7346935; 80; 
39; 20.7; 71; 18.7134503; 50.7346935; 80; 18.7134503; 50.7346935; 80; 
40; 20.7; 71; 20.7; 50.7346935; 80; 20.7; 50.7346935; 80; 
41; 20.4725; 71; 18.7134503; 50.7346935; 80; 18.7134503; 50.7346935; 80; 
42; 20.4725; 71; 18.7134503; 50.7346935; 80; 18.7134503; 50.7346935; 80; 
43; 13.4015; 71; 12.9127485; 64.1023604; 80; 12.9127485; 66.1181173; 80; 
44; 4.67685; 71; 6.32194144; 83.6109579; 79.7482587; 6.32194144; 83.9984824; 77.7528513; 
45; 5.47; 71; 7.39408356; 93.3287969; 75; 7.39408356; 93.9770884; 75; 
46; 4.67685; 71; 6.32194144; 96.8411562; 75; 6.32194144; 99.1234911; 75; 
47; 4.67685; 71; 7.39408356; 96.8946516; 75; 7.39408356; 95.9228802; 75; 
48; 4.67685; 71; 4.67685; 96.9154079; 75; 4.67685; 96.4605802; 75; 
49; 4.67685; 71; 4.67685; 96.9238076; 75; 4.67685; 97.5454383; 75; 
50; 4.67685; 71; 4.67685; 96.9223545; 75; 4.67685; 97.0344233; 75; 
51; 4.67685; 71; 4.67685; 96.9169829; 75; 4.67685; 97.0263914; 75; 
52; 4.67685; 71; 4.67685; 96.9083789; 75; 4.67685; 97.0154155; 75; 
53; 4.67685; 71; 4.67685; 96.8972429; 75; 4.67685; 96.6972193; 75; 
54; 4.67685; 71; 4.67685; 96.8839188; 75; 4.67685; 96.8255742; 75; 
55; 5.47; 71; 5.47; 96.8685758; 75; 5.47; 97.1077417; 75; 
56; 5.47; 71; 5.47; 96.8513006; 75; 5.47; 96.6756046; 75.1445229; 
57; 5.47; 71; 5.47; 96.8321414; 75; 5.47; 96.6586636; 75; 
58; 5.47; 71; 5.47; 96.8111279; 75; 5.47; 96.8610716; 75; 
59; 5.47; 71; 5.47; 96.7882811; 75; 5.47; 96.8590634; 75; 
60; 5.47; 71; 5.47; 96.7636181; 75; 5.47; 96.8786355; 75; 
61; 5.47; 71; 5.47; 96.7371538; 75; 5.47; 96.8290188; 75; 
62; 5.47; 71; 5.47; 96.7089022; 75; 5.47; 96.044069; 75.4001453; 
63; 5.47; 71; 5.47; 96.6788769; 75; 5.47; 95.8941046; 75.0688407; 
64; 5.47; 71; 5.47; 96.6470909; 75; 5.47; 96.0737866; 75.2872289; 
65; 5.47; 71; 5.47; 96.6135574; 75; 5.47; 95.5226813; 75; 
66; 5.47; 71; 5.47; 96.5782891; 75; 5.47; 96.3373728; 75; 
67; 5.47; 71; 5.47; 96.5412988; 75; 5.47; 96.5736581; 75; 
68; 4.67685; 71; 5.47; 96.5025991; 75; 5.47; 96.4085201; 75; 
69; 4.67685; 71; 4.67685; 96.4622026; 75; 4.67685; 96.7330888; 75; 
70; 4.67685; 71; 4.67685; 96.4201218; 75; 4.67685; 95.3068855; 75; 
71; 4.67685; 71; 4.67685; 96.3763689; 75; 4.67685; 95.779494; 75; 
72; 4.67685; 71; 4.67685; 96.3309562; 75; 4.67685; 96.9490773; 75; 
73; 4.67685; 71; 4.67685; 96.283896; 75; 4.67685; 96.3965921; 75; 
74; 4.67685; 71; 4.67685; 96.2352003; 75; 4.67685; 94.5771553; 75; 
75; 4.67685; 71; 4.67685; 96.1848811; 75; 4.67685; 94.464456; 75; 
76; 4.67685; 71; 4.67685; 96.1329503; 75; 4.67685; 96.5429201; 75; 
77; 4.67685; 71; 4.67685; 96.0794198; 75; 4.67685; 96.5549275; 75; 
78; 9.43575; 71; 10.89; 77.043261; 80; 10.7881508; 82.1280389; 75; 
79; 9.43575; 71; 10.89; 74.6388615; 78.7103688; 9.22386894; 63.2127719; 80; 
80; 9.43575; 71; 10.89; 70.7118016; 80; 10.7881508; 54.4492164; 80; 
81; 9.43575; 71; 10.89; 50.7346935; 80; 10.7881508; 50.7346935; 80; 
82; 9.43575; 71; 10.89; 50.7346935; 77.5654272; 10.7881508; 51.5111788; 77.9082383; 
83; 8.06756625; 71; 9.31095; 79.5255668; 75; 10.7881508; 77.0002144; 80; 
84; 8.06756625; 71; 10.89; 102.071678; 75; 10.7881508; 90.7179559; 75; 
85; 8.06756625; 71; 9.31095; 97.4102042; 75; 9.22386894; 87.45329; 75; 
86; 8.06756625; 71; 9.31095; 84.4861361; 80; 10.7881508; 81.9607837; 75; 
87; 9.194135; 71; 10.51715; 67.122388; 80; 10.7881508; 64.5970355; 75; 
88; 13.32; 71; 10.89; 57.2342779; 80; 10.7881508; 55.3218197; 80; 
89; 13.32; 71; 10.89; 50.7346935; 80; 10.7881508; 50.7346935; 80; 
90; 13.32; 71; 10.89; 50.7346935; 80; 10.7881508; 50.7346935; 80; 
91; 13.32; 71; 10.89; 50.7346935; 80; 10.7881508; 50.7346935; 80; 
92; 13.32; 71; 10.89; 50.7346935; 80; 10.7881508; 50.775485; 80; 
93; 13.32; 71; 10.89; 50.7346935; 80; 10.7881508; 50.7750781; 80; 
94; 13.32; 71; 10.89; 50.7346935; 80; 10.7881508; 51.2821012; 80; 
95; 13.32; 71; 10.89; 50.7346935; 80; 10.7881508; 51.2766403; 78.3878548; 
96; 13.32; 71; 16; 81.1549111; 75; 15.8518492; 72.3727749; 75; 
