AcceptGap; iterations; time_master; time_subproblem; time_feasPt; CoopPotentialPercent
0.002; 2; 0.722000003; 1.72599995; 0.558000028; 77.7123178
0.001; 5; 1.15999997; 2.25; 0.677999973; 96.2432292
0.0005; 16; 2.18700004; 3.88499999; 0.537; 93.7354086
0.0002; 96; 8.21399975; 15.9729996; 0.959999979; 97.8550727
0.0001; 161; 11.7720003; 23.8220005; 0.712000012; 98.6095268
5e-05; 303; 19.7950001; 38.4300003; 0.801999986; 99.221599
2e-05; 351; 22.9850006; 42.9379997; 0.648999989; 99.7004862
