t; nomPriceB7; nomPlPowB7; integrPriceB7; integrPlPowB7; integrT_in_B7; disagg_price_bus7; PlPowB7; disaggT_in_B7;  initFeasThres; finalFeasThres; accept_gap; iterations; CPUmaster; CPUsubproblem; CPUfeasPt; finalDetectGap; nomCongestionCost; intCongestionCost; disaggCongestionCost; Objective; nomImprovPercent; CoopPotentialPercent; nominalCost; integratedCost
1; 13.32; 71; 10.52; 60.8165523; 80; 10.52; 61.018065; 80; 71; 19.1131929; 0.0001; 175; 10.9540005; 25.4580002; 0.856999993; 9.54854514e-05; 231210.636; 250971.904; 263429.656; 2115189.75; 0.671663549; 98.9570178; 2129492.78; 2115039
2; 13.32; 71; 16.12; 66.0503242; 80; 16.12; 66.6419262; 80; 
3; 13.32; 71; 16.12; 65.8975372; 80; 16.5955556; 78.2543147; 80; 
4; 13.32; 71; 16.12; 53.38447; 80; 16.5955556; 66.5025055; 80; 
5; 13.32; 71; 16.12; 72.6749487; 80; 16.5955556; 55.6205443; 80; 
6; 13.32; 71; 16.12; 83.7073055; 80; 16.5955556; 72.0878364; 80; 
7; 13.32; 71; 16.12; 68.4434656; 80; 16.5955556; 74.8748299; 80; 
8; 13.32; 71; 16.12; 71.735011; 80; 16.5955556; 72.326613; 79.9124206; 
9; 13.32; 71; 16.12; 69.9013541; 80; 16.5955556; 70.4929561; 80; 
10; 13.32; 71; 16.12; 53.0067787; 80; 16.5955556; 53.5983808; 80; 
11; 39.15; 71; 20.4; 50.7346935; 80; 16.5955556; 51.3262955; 80; 
12; 39.15; 71; 37.9333333; 50.7346935; 80; 37.9333333; 50.7346935; 80; 
13; 39.15; 71; 37.9333333; 50.7346935; 80; 37.9333333; 50.7346935; 80; 
14; 39.15; 71; 37.9333333; 50.7346935; 80; 37.9333333; 50.7346935; 80; 
15; 20.7; 71; 20.7; 50.7346935; 80; 20.7; 50.7346935; 80; 
16; 20.7; 71; 20.7; 50.7346935; 80; 20.7; 50.7346935; 80; 
17; 20.7; 71; 20.7; 50.7346935; 80; 20.7; 50.7346935; 80; 
18; 20.7; 71; 20.7; 50.7346935; 80; 20.7; 50.7346935; 80; 
19; 20.7; 71; 20.7; 50.7346935; 80; 20.7; 50.7346935; 80; 
20; 20.7; 71; 20.7; 50.7346935; 80; 20.7; 50.7346935; 80; 
21; 20.7; 71; 20.7; 50.7346935; 80; 20.7; 50.7346935; 80; 
22; 20.7; 71; 20.7; 50.7346935; 80; 20.7; 50.7346935; 80; 
23; 20.7; 71; 20.7; 50.7346935; 80; 20.7; 50.7346935; 80; 
24; 20.7; 71; 20.7; 50.7346935; 80; 20.7; 50.7346935; 80; 
25; 20.7; 71; 20.7; 50.7346935; 80; 20.7; 50.7346935; 80; 
26; 20.7; 71; 20.7; 50.7346935; 80; 20.7; 50.7346935; 80; 
27; 20.7; 71; 20.7; 50.7346935; 80; 20.7; 50.7346935; 80; 
28; 20.7; 71; 20.7; 50.7346935; 80; 20.7; 50.7346935; 80; 
29; 20.7; 71; 20.7; 50.7346935; 80; 20.7; 52.0673241; 80; 
30; 20.7; 71; 20.7; 50.7346935; 80; 20.7; 52.05403; 80; 
31; 20.7; 71; 20.7; 50.7346935; 80; 20.7; 50.7346935; 80; 
32; 25.0713897; 71; 20.7; 50.7346935; 80; 20.7; 50.7346935; 80; 
33; 25.0713897; 71; 21.2073768; 50.7346935; 80; 21.203097; 50.7346935; 80; 
34; 25.0713897; 71; 21.2073768; 50.7346935; 80; 21.203097; 50.7346935; 80; 
35; 25.0713897; 71; 21.2073768; 50.7346935; 80; 21.203097; 50.7346935; 80; 
36; 25.0713897; 71; 21.2073768; 50.7346935; 80; 21.203097; 50.7346935; 80; 
37; 29.3232628; 71; 24.8039495; 50.7346935; 80; 24.7989438; 50.7346935; 80; 
38; 29.3232628; 71; 24.8039495; 50.7346935; 80; 24.7989438; 50.7346935; 80; 
39; 29.3232628; 71; 24.8039495; 50.7346935; 80; 24.7989438; 50.7346935; 80; 
40; 29.3232628; 71; 24.8039495; 50.7346935; 80; 24.7989438; 50.7346935; 80; 
41; 29.3232628; 71; 24.8039495; 50.7346935; 80; 24.7989438; 50.7346935; 80; 
42; 29.3232628; 71; 24.8039495; 50.7346935; 80; 24.7989438; 50.7346935; 80; 
43; 29.3232628; 71; 24.8039495; 50.7346935; 80; 24.7989438; 50.7346935; 80; 
44; 29.3232628; 71; 13.6243447; 50.7346935; 80; 21.203097; 51.3463586; 80; 
45; 6.00694864; 71; 15.9349061; 63.5351466; 80; 24.7989438; 61.0175971; 80; 
46; 5.47; 71; 13.6243447; 73.5711789; 80; 8.45313085; 72.124956; 80; 
47; 5.47; 71; 15.9349061; 79.1438758; 80; 9.88670275; 77.8626392; 80; 
48; 5.47; 71; 13.6243447; 86.8636435; 77.8796401; 8.45313085; 82.8437005; 77.7915941; 
49; 5.47; 71; 15.9349061; 91.996499; 75; 9.88670275; 92.070529; 75; 
50; 5.47; 71; 5.47; 97.4792666; 75; 5.47; 98.595006; 75.0295997; 
51; 5.47; 71; 5.47; 97.5179126; 75; 5.47; 97.2039306; 75; 
52; 5.47; 71; 5.47; 97.5345161; 75; 5.47; 97.396738; 75; 
53; 5.47; 71; 5.47; 97.5390875; 75; 5.47; 97.6283484; 75; 
54; 5.47; 71; 5.47; 97.536574; 75; 5.47; 97.5181744; 75; 
55; 5.47; 71; 5.47; 97.5302341; 75; 5.47; 97.5140565; 75; 
56; 5.47; 71; 5.47; 97.5209438; 75; 5.47; 97.3220889; 75.0963169; 
57; 5.47; 71; 5.47; 97.5092515; 75; 5.47; 97.1042631; 75.1107855; 
58; 5.47; 71; 5.47; 97.4954339; 75; 5.47; 97.0332295; 75.1281695; 
59; 5.47; 71; 5.47; 97.4796287; 75; 5.47; 96.0024641; 75.3782474; 
60; 5.47; 71; 5.47; 97.4619078; 75; 5.47; 96.4807289; 75; 
61; 5.47; 71; 5.47; 97.4423121; 75; 5.47; 97.4033832; 75.1465282; 
62; 5.47; 71; 5.47; 97.4208683; 75; 5.47; 96.8673655; 75.0966037; 
63; 5.47; 71; 6.62322473; 97.3975957; 75; 6.49340009; 96.6572359; 75; 
64; 5.47; 71; 6.62322473; 97.3725106; 75; 6.49340009; 97.1604434; 75; 
65; 6.39766082; 71; 6.62322473; 97.3456276; 75; 6.49340009; 97.5946265; 75; 
66; 6.39766082; 71; 6.62322473; 97.3169606; 75; 6.49340009; 97.3298411; 75; 
67; 6.39766082; 71; 6.62322473; 97.2865229; 75; 6.49340009; 97.3001046; 75; 
68; 5.47; 71; 6.62322473; 97.2543277; 75; 6.49340009; 97.0606756; 75; 
69; 5.47; 71; 6.62322473; 97.2203879; 75; 6.49340009; 96.1883382; 75; 
70; 5.47; 71; 5.66285714; 97.1847163; 75; 5.55185708; 96.7993806; 75; 
71; 5.47; 71; 5.66285714; 97.1473257; 75; 5.55185708; 97.587738; 75; 
72; 5.47; 71; 5.66285714; 97.1082287; 75; 5.55185708; 96.7176762; 75; 
73; 5.47; 71; 5.66285714; 97.0674377; 75; 5.55185708; 96.8663756; 75; 
74; 5.47; 71; 5.66285714; 97.0249653; 75; 5.55185708; 97.2181412; 75; 
75; 5.47; 71; 5.66285714; 96.9808237; 75; 5.55185708; 96.665557; 75.1721145; 
76; 5.47; 71; 5.66285714; 96.9350252; 75; 5.55185708; 96.6117465; 75.0067888; 
77; 8.07204466; 71; 16; 87.7475961; 79.8432073; 16; 88.2957443; 79.5540699; 
78; 17.3550271; 71; 16; 64.6347063; 80; 16; 66.7217521; 80; 
79; 17.3550271; 71; 16; 50.7346935; 80; 16; 56.103882; 80; 
80; 17.3550271; 71; 16; 50.7346935; 80; 16; 57.6685825; 80; 
81; 17.3550271; 71; 16; 50.7346935; 80; 16; 54.5768905; 80; 
82; 17.3550271; 71; 16; 55.1436644; 76.6869884; 16; 54.0257294; 76.9217148; 
83; 16; 71; 16; 63.8696831; 75; 16; 62.8125336; 75; 
84; 14.8385482; 71; 13.68; 89.8374247; 75; 13.68; 88.7802752; 75; 
85; 14.8385482; 71; 14.6903258; 106.360297; 75; 15.8568002; 105.303147; 75; 
86; 14.8385482; 71; 13.68; 99.0573105; 75; 13.68; 99.8496613; 75; 
87; 14.8385482; 71; 15.8903258; 92.3458781; 75; 16; 90.7405804; 75; 
88; 14.8385482; 71; 13.68; 81.4473295; 80; 13.7031998; 79.8420318; 80; 
89; 14.8385482; 71; 15.8732247; 66.3265533; 80; 16; 64.7212556; 80; 
90; 14.8385482; 71; 15.1061236; 61.1781379; 80; 13.68; 59.5728402; 80; 
91; 17.3550271; 71; 16; 57.559149; 80; 16; 61.6721103; 80; 
92; 17.3550271; 71; 16; 50.7730508; 80; 16; 54.7968243; 80; 
93; 17.3550271; 71; 16; 50.7726681; 80; 16; 50.7346935; 80; 
94; 17.3550271; 71; 16; 50.7346935; 80; 16; 51.7683853; 80; 
95; 17.3550271; 71; 16; 50.7346935; 80; 16; 51.7580733; 78.7319535; 
96; 17.3550271; 71; 25.4; 81.1549111; 77.3173179; 25.4; 74.7233996; 75; 
