t; nomPriceB5; nomPlPowB5; integrPriceB5; integrPlPowB5; integrT_in_B5; disagg_price_bus5; PlPowB5; disaggT_in_B5;  initFeasThres; finalFeasThres; accept_gap; iterations; CPUmaster; CPUsubproblem; CPUfeasPt; finalDetectGap; nomCongestionCost; intCongestionCost; disaggCongestionCost; Objective; nomImprovPercent; CoopPotentialPercent; nominalCost; integratedCost
1; 10.52; 71; 10.52; 60.8165523; 80; 10.52; 60.8165523; 80; 1420; 1420; 0.002; 2; 0.745000005; 1.745; 0.536000013; 0.00196668303; 2.27134469e-10; -4.80638862e-10; 3.09142665e-09; 1806575.79; 0.392588206; 76.4206404; 1813696.15; 1804378.83
2; 10.52; 71; 10.52; 50.7346935; 80; 10.52; 50.7346935; 80; 
3; 10.52; 71; 10.52; 50.7346935; 80; 10.52; 50.7346935; 80; 
4; 10.52; 71; 10.52; 50.7346935; 80; 10.52; 50.7346935; 80; 
5; 10.52; 71; 10.52; 50.7346935; 80; 10.52; 50.7346935; 80; 
6; 10.52; 71; 10.52; 50.7346935; 80; 10.52; 50.7346935; 80; 
7; 10.52; 71; 10.52; 50.7346935; 80; 10.52; 50.7346935; 80; 
8; 10.52; 71; 10.52; 69.8574689; 80; 10.52; 50.7346935; 80; 
9; 10.52; 71; 10.52; 77.2645831; 80; 10.52; 50.7346935; 80; 
10; 10.52; 71; 10.52; 58.2567787; 80; 10.52; 50.7346935; 80; 
11; 14.59; 71; 14.59; 50.7346935; 80; 14.59; 50.7346935; 80; 
12; 15.5475; 71; 15.3761538; 50.7346935; 80; 15.3761538; 50.7346935; 80; 
13; 15.5475; 71; 15.3761538; 50.7346935; 80; 15.3761538; 50.7346935; 80; 
14; 15.5475; 71; 15.3761538; 50.7346935; 80; 15.3761538; 50.7346935; 80; 
15; 15.5475; 71; 15.3761538; 50.7346935; 80; 15.3761538; 50.7346935; 80; 
16; 15.5475; 71; 15.3761538; 50.7346935; 80; 15.3761538; 50.7346935; 80; 
17; 15.5475; 71; 15.3761538; 50.7346935; 80; 15.3761538; 50.7346935; 80; 
18; 15.5475; 71; 15.3761538; 50.7346935; 80; 15.3761538; 50.7346935; 80; 
19; 15.5475; 71; 15.3761538; 50.7346935; 80; 15.3761538; 50.7346935; 80; 
20; 15.5475; 71; 15.3761538; 50.7346935; 80; 15.3761538; 50.7346935; 80; 
21; 15.5475; 71; 15.3761538; 50.7346935; 80; 15.3761538; 50.7346935; 80; 
22; 15.5475; 71; 15.3761538; 50.7346935; 80; 15.3761538; 50.7346935; 80; 
23; 15.5475; 71; 15.3761538; 50.7346935; 80; 15.3761538; 50.7346935; 80; 
24; 15.5475; 71; 15.3761538; 50.7346935; 80; 15.3761538; 50.7346935; 80; 
25; 17.81; 71; 16.6238462; 50.7346935; 80; 16.1386325; 50.7346935; 80; 
26; 16; 71; 16; 50.7346935; 80; 16.1386325; 50.7346935; 80; 
27; 16; 71; 16; 50.7346935; 80; 16.1386325; 50.7346935; 80; 
28; 16; 71; 16; 50.7346935; 80; 16.1386325; 50.7346935; 80; 
29; 16; 71; 16; 50.7346935; 80; 16.1386325; 50.7346935; 80; 
30; 16; 71; 16; 50.7346935; 80; 16.1386325; 50.7346935; 80; 
31; 16; 71; 16; 50.7346935; 80; 16.1386325; 74.5721087; 80; 
32; 16; 71; 16; 50.7346935; 80; 16.1386325; 88.0065301; 80; 
33; 16; 71; 16; 50.7346935; 80; 16.1386325; 77.6493611; 80; 
34; 16; 71; 16; 50.7346935; 80; 16.1386325; 77.4458653; 80; 
35; 16; 71; 16; 50.7346935; 80; 16.1386325; 77.6135318; 80; 
36; 16; 71; 16; 50.7346935; 80; 18.8755935; 77.7802204; 80; 
37; 20.4725; 71; 18.7134503; 50.7346935; 80; 18.8755935; 77.9478076; 80; 
38; 20.4725; 71; 18.7134503; 50.7346935; 80; 20.7; 78.1148819; 80; 
39; 20.7; 71; 18.7134503; 50.7346935; 80; 20.7; 78.2825029; 80; 
40; 20.7; 71; 20.7; 50.7346935; 80; 20.7; 64.4804759; 80; 
41; 20.4725; 71; 18.7134503; 50.7346935; 80; 18.8755935; 50.7346935; 80; 
42; 20.4725; 71; 18.7134503; 50.7346935; 80; 18.8755935; 50.7346935; 80; 
43; 13.4015; 71; 12.9127485; 64.1023604; 80; 7.69940273; 75.768261; 80; 
44; 4.67685; 71; 6.32194144; 83.6109579; 79.7482587; 6.64685672; 89.4523555; 80; 
45; 5.47; 71; 7.39408356; 93.3287969; 75; 7.77410143; 85.351588; 76.5663612; 
46; 4.67685; 71; 6.32194144; 96.8411562; 75; 5.01836708; 95.0864475; 75; 
47; 4.67685; 71; 7.39408356; 96.8946516; 75; 5.6021052; 90.9147201; 78.7416639; 
48; 4.67685; 71; 4.67685; 96.9154079; 75; 5.01836708; 82.5799094; 75; 
49; 4.67685; 71; 4.67685; 96.9238076; 75; 5.01836708; 93.6364016; 75; 
50; 4.67685; 71; 4.67685; 96.9223545; 75; 5.01836708; 101.972422; 75; 
51; 4.67685; 71; 4.67685; 96.9169829; 75; 5.01836708; 98.0782867; 75; 
52; 4.67685; 71; 4.67685; 96.9083789; 75; 5.01836708; 98.0697907; 75; 
53; 4.67685; 71; 4.67685; 96.8972429; 75; 5.01836708; 98.0561526; 75; 
54; 4.67685; 71; 4.67685; 96.8839188; 75; 5.01836708; 98.0391022; 75; 
55; 5.47; 71; 5.47; 96.8685758; 75; 5.47; 98.0194755; 75; 
56; 5.47; 71; 5.47; 96.8513006; 75; 5.47; 97.997673; 75; 
57; 5.47; 71; 5.47; 96.8321414; 75; 5.47; 97.9738903; 75; 
58; 5.47; 71; 5.47; 96.8111279; 75; 5.47; 97.9482262; 75; 
59; 5.47; 71; 5.47; 96.7882811; 75; 5.47; 97.9207345; 75; 
60; 5.47; 71; 5.47; 96.7636181; 75; 5.47; 97.891447; 75; 
61; 5.47; 71; 5.47; 96.7371538; 75; 5.47; 97.860386; 75; 
62; 5.47; 71; 5.47; 96.7089022; 75; 5.47; 97.8275683; 75; 
63; 5.47; 71; 5.47; 96.6788769; 75; 5.47; 97.793009; 75; 
64; 5.47; 71; 5.47; 96.6470909; 75; 5.47; 97.7567217; 75; 
65; 5.47; 71; 5.47; 96.6135574; 75; 5.47; 97.7187194; 75; 
66; 5.47; 71; 5.47; 96.5782891; 75; 5.47; 97.6790151; 75; 
67; 5.47; 71; 5.47; 96.5412988; 75; 5.47; 97.6376212; 75; 
68; 4.67685; 71; 5.47; 96.5025991; 75; 5.47; 97.5945502; 75; 
69; 4.67685; 71; 4.67685; 96.4622026; 75; 5.01836708; 97.5498145; 75; 
70; 4.67685; 71; 4.67685; 96.4201218; 75; 5.01836708; 97.5034262; 75; 
71; 4.67685; 71; 4.67685; 96.3763689; 75; 5.01836708; 97.4553975; 75; 
72; 4.67685; 71; 4.67685; 96.3309562; 75; 5.01836708; 97.4057403; 75; 
73; 4.67685; 71; 4.67685; 96.283896; 75; 5.01836708; 97.3544668; 75; 
74; 4.67685; 71; 4.67685; 96.2352003; 75; 5.01836708; 97.3015886; 75; 
75; 4.67685; 71; 4.67685; 96.1848811; 75; 5.01836708; 97.2471177; 75; 
76; 4.67685; 71; 4.67685; 96.1329503; 75; 5.01836708; 97.1910656; 75; 
77; 4.67685; 71; 4.67685; 96.0794198; 75; 5.01836708; 97.133444; 75; 
78; 9.43575; 71; 10.89; 77.043261; 80; 8.08878505; 73.8033176; 80; 
79; 9.43575; 71; 10.89; 74.6388615; 78.7103688; 6.91591121; 50.7346935; 76.4107029; 
80; 9.43575; 71; 10.89; 70.7118016; 80; 8.08878505; 50.7346935; 79.621856; 
81; 9.43575; 71; 10.89; 50.7346935; 80; 8.08878505; 50.7346935; 79.5987163; 
82; 9.43575; 71; 10.89; 50.7346935; 77.5654272; 8.08878505; 50.7346935; 79.586791; 
83; 8.06756625; 71; 9.31095; 79.5255668; 75; 6.91591121; 50.7346935; 80; 
84; 8.06756625; 71; 10.89; 102.071678; 75; 6.91591121; 50.7346935; 79.3681735; 
85; 8.06756625; 71; 9.31095; 97.4102042; 75; 6.91591121; 50.7346935; 80; 
86; 8.06756625; 71; 9.31095; 84.4861361; 80; 6.91591121; 50.7346935; 79.3466482; 
87; 9.194135; 71; 10.51715; 67.122388; 80; 13.32; 50.7346935; 80; 
88; 13.32; 71; 10.89; 57.2342779; 80; 13.32; 50.7346935; 79.3288075; 
89; 13.32; 71; 10.89; 50.7346935; 80; 13.32; 50.7346935; 79.532064; 
90; 13.32; 71; 10.89; 50.7346935; 80; 13.32; 50.7346935; 80; 
91; 13.32; 71; 10.89; 50.7346935; 80; 13.32; 50.7346935; 79.2993686; 
92; 13.32; 71; 10.89; 50.7346935; 80; 13.32; 50.7346935; 80; 
93; 13.32; 71; 10.89; 50.7346935; 80; 13.32; 50.7346935; 79.285295; 
94; 13.32; 71; 10.89; 50.7346935; 80; 13.32; 50.7346935; 79.5064665; 
95; 13.32; 71; 10.89; 50.7346935; 80; 13.32; 50.7346935; 79.4977502; 
96; 13.32; 71; 16; 81.1549111; 75; 13.32; 81.1549111; 75; 
