t; nomPriceB5; nomPlPowB5; integrPriceB5; integrPlPowB5; integrT_in_B5; disagg_price_bus5; PlPowB5; disaggT_in_B5;  initFeasThres; finalFeasThres; accept_gap; iterations; CPUmaster; CPUsubproblem; CPUfeasPt; finalDetectGap; nomCongestionCost; intCongestionCost; disaggCongestionCost; Objective; nomImprovPercent; CoopPotentialPercent; nominalCost; integratedCost
1; 10.52; 71; 10.52; 60.8165523; 80; 10.52; 60.8165523; 80; 142; 86.7751129; 0.0002; 90; 8.14400005; 14.3299999; 0.819999993; 0.000192025073; 2.27134469e-10; -4.80638862e-10; 1.28116772e-09; 1804618.38; 0.500512136; 97.4289531; 1813696.15; 1804378.83
2; 10.52; 71; 10.52; 50.7346935; 80; 10.52; 58.1296622; 80; 
3; 10.52; 71; 10.52; 50.7346935; 80; 10.52; 59.6427848; 80; 
4; 10.52; 71; 10.52; 50.7346935; 80; 10.52; 72.9756509; 80; 
5; 10.52; 71; 10.52; 50.7346935; 80; 10.52; 73.5731382; 80; 
6; 10.52; 71; 10.52; 50.7346935; 80; 10.52; 53.0857544; 80; 
7; 10.52; 71; 10.52; 50.7346935; 80; 10.52; 58.2524086; 80; 
8; 10.52; 71; 10.52; 69.8574689; 80; 10.52; 65.2126216; 80; 
9; 10.52; 71; 10.52; 77.2645831; 80; 10.52; 58.7459277; 80; 
10; 10.52; 71; 10.52; 58.2567787; 80; 10.52; 51.7704645; 80; 
11; 14.59; 71; 14.59; 50.7346935; 80; 14.59; 50.7346935; 80; 
12; 15.5475; 71; 15.3761538; 50.7346935; 80; 15.3761538; 50.7346935; 80; 
13; 15.5475; 71; 15.3761538; 50.7346935; 80; 15.3761538; 50.7346935; 80; 
14; 15.5475; 71; 15.3761538; 50.7346935; 80; 15.3761538; 50.7346935; 80; 
15; 15.5475; 71; 15.3761538; 50.7346935; 80; 15.3761538; 50.7346935; 80; 
16; 15.5475; 71; 15.3761538; 50.7346935; 80; 15.3761538; 50.7346935; 80; 
17; 15.5475; 71; 15.3761538; 50.7346935; 80; 15.3761538; 50.7346935; 80; 
18; 15.5475; 71; 15.3761538; 50.7346935; 80; 15.3761538; 50.7346935; 80; 
19; 15.5475; 71; 15.3761538; 50.7346935; 80; 15.3761538; 50.7346935; 80; 
20; 15.5475; 71; 15.3761538; 50.7346935; 80; 15.3761538; 50.7346935; 80; 
21; 15.5475; 71; 15.3761538; 50.7346935; 80; 15.3761538; 50.7346935; 80; 
22; 15.5475; 71; 15.3761538; 50.7346935; 80; 15.3761538; 50.7346935; 80; 
23; 15.5475; 71; 15.3761538; 50.7346935; 80; 15.3761538; 50.7346935; 80; 
24; 15.5475; 71; 15.3761538; 50.7346935; 80; 15.3761538; 50.7346935; 80; 
25; 17.81; 71; 16.6238462; 50.7346935; 80; 16.6238462; 50.7346935; 80; 
26; 16; 71; 16; 50.7346935; 80; 16; 50.7346935; 80; 
27; 16; 71; 16; 50.7346935; 80; 16; 50.7346935; 80; 
28; 16; 71; 16; 50.7346935; 80; 16; 50.7346935; 80; 
29; 16; 71; 16; 50.7346935; 80; 16; 50.7346935; 80; 
30; 16; 71; 16; 50.7346935; 80; 16; 50.7346935; 80; 
31; 16; 71; 16; 50.7346935; 80; 16; 50.7346935; 80; 
32; 16; 71; 16; 50.7346935; 80; 16; 50.7346935; 80; 
33; 16; 71; 16; 50.7346935; 80; 16; 50.7346935; 80; 
34; 16; 71; 16; 50.7346935; 80; 16; 50.7346935; 80; 
35; 16; 71; 16; 50.7346935; 80; 16; 50.7346935; 80; 
36; 16; 71; 16; 50.7346935; 80; 16; 50.7346935; 80; 
37; 20.4725; 71; 18.7134503; 50.7346935; 80; 18.7134503; 50.7346935; 80; 
38; 20.4725; 71; 18.7134503; 50.7346935; 80; 18.7134503; 50.7346935; 80; 
39; 20.7; 71; 18.7134503; 50.7346935; 80; 18.7134503; 50.7346935; 80; 
40; 20.7; 71; 20.7; 50.7346935; 80; 20.7; 50.7346935; 80; 
41; 20.4725; 71; 18.7134503; 50.7346935; 80; 18.7134503; 50.7346935; 80; 
42; 20.4725; 71; 18.7134503; 50.7346935; 80; 18.7134503; 50.7346935; 80; 
43; 13.4015; 71; 12.9127485; 64.1023604; 80; 12.9127485; 62.9912376; 80; 
44; 4.67685; 71; 6.32194144; 83.6109579; 79.7482587; 6.25097591; 84.0443119; 79.2739019; 
45; 5.47; 71; 7.39408356; 93.3287969; 75; 7.31108293; 88.4720819; 77.9862562; 
46; 4.67685; 71; 6.32194144; 96.8411562; 75; 6.25097591; 90.9734955; 75; 
47; 4.67685; 71; 7.39408356; 96.8946516; 75; 7.31108293; 97.4253042; 75; 
48; 4.67685; 71; 4.67685; 96.9154079; 75; 4.72084033; 96.39716; 75; 
49; 4.67685; 71; 4.67685; 96.9238076; 75; 4.72084033; 95.2504233; 75; 
50; 4.67685; 71; 4.67685; 96.9223545; 75; 4.72084033; 96.649703; 75; 
51; 4.67685; 71; 4.67685; 96.9169829; 75; 4.72084033; 97.7905198; 75; 
52; 4.67685; 71; 4.67685; 96.9083789; 75; 4.72084033; 97.0960637; 75; 
53; 4.67685; 71; 4.67685; 96.8972429; 75; 4.72084033; 97.0855582; 75; 
54; 4.67685; 71; 4.67685; 96.8839188; 75; 4.72084033; 96.9472319; 75.0664944; 
55; 5.47; 71; 5.47; 96.8685758; 75; 5.47; 95.8394503; 75; 
56; 5.47; 71; 5.47; 96.8513006; 75; 5.47; 96.464133; 75; 
57; 5.47; 71; 5.47; 96.8321414; 75; 5.47; 97.5216138; 75; 
58; 5.47; 71; 5.47; 96.8111279; 75; 5.47; 91.5425046; 75; 
59; 5.47; 71; 5.47; 96.7882811; 75; 5.47; 94.0938333; 75; 
60; 5.47; 71; 5.47; 96.7636181; 75; 5.47; 97.945843; 75; 
61; 5.47; 71; 5.47; 96.7371538; 75; 5.47; 96.1124679; 75; 
62; 5.47; 71; 5.47; 96.7089022; 75; 5.47; 97.5446035; 75; 
63; 5.47; 71; 5.47; 96.6788769; 75; 5.47; 95.6552648; 75; 
64; 5.47; 71; 5.47; 96.6470909; 75; 5.47; 96.1793426; 75; 
65; 5.47; 71; 5.47; 96.6135574; 75; 5.47; 97.3031496; 75; 
66; 5.47; 71; 5.47; 96.5782891; 75; 5.47; 93.2513223; 76.8425531; 
67; 5.47; 71; 5.47; 96.5412988; 75; 5.47; 91.5678075; 75.0487244; 
68; 4.67685; 71; 5.47; 96.5025991; 75; 5.47; 95.7585387; 75; 
69; 4.67685; 71; 4.67685; 96.4622026; 75; 4.72084033; 95.9794642; 75; 
70; 4.67685; 71; 4.67685; 96.4201218; 75; 4.72084033; 95.0026128; 75; 
71; 4.67685; 71; 4.67685; 96.3763689; 75; 4.72084033; 96.7738551; 75; 
72; 4.67685; 71; 4.67685; 96.3309562; 75; 4.72084033; 96.934398; 75; 
73; 4.67685; 71; 4.67685; 96.283896; 75; 4.72084033; 94.9702935; 75; 
74; 4.67685; 71; 4.67685; 96.2352003; 75; 4.72084033; 94.3484107; 75; 
75; 4.67685; 71; 4.67685; 96.1848811; 75; 4.72084033; 94.2092267; 75; 
76; 4.67685; 71; 4.67685; 96.1329503; 75; 4.72084033; 95.7635265; 75; 
77; 4.67685; 71; 4.67685; 96.0794198; 75; 4.72084033; 97.2714708; 75; 
78; 9.43575; 71; 10.89; 77.043261; 80; 9.53231106; 79.7314968; 80; 
79; 9.43575; 71; 10.89; 74.6388615; 78.7103688; 8.15012596; 70.5377188; 80; 
80; 9.43575; 71; 10.89; 70.7118016; 80; 9.53231106; 64.6955332; 80; 
81; 9.43575; 71; 10.89; 50.7346935; 80; 9.53231106; 51.3172278; 80; 
82; 9.43575; 71; 10.89; 50.7346935; 77.5654272; 9.53231106; 50.7346935; 77.7661842; 
83; 8.06756625; 71; 9.31095; 79.5255668; 75; 8.15012596; 79.0844664; 75; 
84; 8.06756625; 71; 10.89; 102.071678; 75; 8.15012596; 92.8022079; 75; 
85; 8.06756625; 71; 9.31095; 97.4102042; 75; 8.15012596; 83.3419164; 75; 
86; 8.06756625; 71; 9.31095; 84.4861361; 80; 8.15012596; 84.0450357; 75; 
87; 9.194135; 71; 10.51715; 67.122388; 80; 8.15012596; 66.6812875; 75.0742819; 
88; 13.32; 71; 10.89; 57.2342779; 80; 13.32; 68.6885079; 80; 
89; 13.32; 71; 10.89; 50.7346935; 80; 13.32; 67.1933287; 80; 
90; 13.32; 71; 10.89; 50.7346935; 80; 13.32; 50.7346935; 76.9385933; 
91; 13.32; 71; 10.89; 50.7346935; 80; 13.32; 52.469219; 80; 
92; 13.32; 71; 10.89; 50.7346935; 80; 13.32; 52.4519156; 80; 
93; 13.32; 71; 10.89; 50.7346935; 80; 13.32; 50.7346935; 80; 
94; 13.32; 71; 10.89; 50.7346935; 80; 13.32; 50.7346935; 78.6080918; 
95; 13.32; 71; 10.89; 50.7346935; 80; 13.32; 52.191417; 80; 
96; 13.32; 71; 16; 81.1549111; 75; 13.32; 77.6028686; 79.398308; 
