Iterations; CPUmaster; CPUsubproblem; CPUfeasPt; Buses; AcceptGap; CoopPotentialPercent
163; 10.79; 27.4169998; 0.75; 1; 0.0001; 99.9542095
951; 138.949005; 147.639999; 1.06599998; 2; 0.0001; 99.9652828
1520; 411.415985; 276.600006; 0.765999973; 3; 0.0001; 99.9592709
1526; 645.195984; 322.337006; 0.718999982; 4; 0.0001; 99.9609363
