t; nomPriceB5; nomPlPowB5; integrPriceB5; integrPlPowB5; integrT_in_B5; disagg_price_bus5; PlPowB5; disaggT_in_B5;  initFeasThres; finalFeasThres; accept_gap; iterations; CPUmaster; CPUsubproblem; CPUfeasPt; finalDetectGap; nomCongestionCost; intCongestionCost; disaggCongestionCost; Objective; nomImprovPercent; CoopPotentialPercent; nominalCost; integratedCost
1; 13.32; 71; 10.52; 60.8165523; 80; 10.52; 60.8165523; 80; 71; 16.1971467; 0.0001; 166; 10.5609999; 23.4920006; 0.79400003; 8.79257853e-05; 232380.919; 33832.7919; 34309.2783; 1816367.71; 15.1711975; 99.9628791; 2141215.78; 1816247.08
2; 13.32; 71; 16.12; 66.0938793; 80; 16.3017092; 67.6607235; 80; 
3; 13.32; 71; 16.12; 65.9406578; 80; 16.3017092; 70.9012352; 80; 
4; 13.32; 71; 16.12; 51.4260892; 80; 16.3017092; 56.5202244; 80; 
5; 13.32; 71; 16.12; 65.6566306; 80; 16.3017092; 65.9269366; 80; 
6; 13.32; 71; 17.7861988; 81.4352202; 80; 16.3017092; 79.3498397; 80; 
7; 13.32; 71; 16.12; 68.8543434; 80; 16.3017092; 68.4479548; 80; 
8; 13.32; 71; 16.12; 69.4629257; 80; 16.3017092; 71.0295271; 80; 
9; 13.32; 71; 16.12; 67.6292688; 80; 16.3017092; 69.1958701; 80; 
10; 13.32; 71; 18.8538012; 50.7346935; 80; 19.0663265; 52.3012948; 80; 
11; 39.15; 71; 30.1; 50.7346935; 80; 30.1; 52.0251103; 80; 
12; 39.15; 71; 30.1; 50.7346935; 80; 30.1; 50.7346935; 80; 
13; 39.15; 71; 30.1; 50.7346935; 80; 30.1; 50.7346935; 80; 
14; 39.15; 71; 30.1; 50.7346935; 80; 30.1; 50.7346935; 80; 
15; 36.65; 71; 30.1; 50.7346935; 80; 30.1; 50.7346935; 80; 
16; 39.15; 71; 30.1; 50.7346935; 80; 30.1; 50.7346935; 80; 
17; 39.15; 71; 30.1; 50.7346935; 80; 30.1; 50.7346935; 80; 
18; 39.15; 71; 30.1; 50.7346935; 80; 30.1; 50.7346935; 80; 
19; 39.15; 71; 30.1; 50.7346935; 80; 30.1; 50.7346935; 80; 
20; 39.15; 71; 30.1; 50.7346935; 80; 30.1; 50.7346935; 80; 
21; 39.15; 71; 30.1; 50.7346935; 80; 30.1; 50.7346935; 80; 
22; 39.15; 71; 30.1; 50.7346935; 80; 30.1; 50.7346935; 80; 
23; 39.15; 71; 30.1; 50.7346935; 80; 30.1; 50.7346935; 80; 
24; 39.15; 71; 30.1; 50.7346935; 80; 30.1; 50.7346935; 80; 
25; 255.566746; 71; 47.0097866; 50.7346935; 80; 47.8303152; 50.7346935; 80; 
26; 218.509568; 71; 47.0097866; 50.7346935; 80; 47.8303152; 50.7346935; 80; 
27; 255.566746; 71; 47.0097866; 50.7346935; 80; 47.8303152; 50.7346935; 80; 
28; 255.566746; 71; 47.0097866; 50.7346935; 80; 47.8303152; 50.7346935; 80; 
29; 255.566746; 71; 21.8636976; 50.7346935; 80; 21.6772528; 50.7346935; 80; 
30; 25.0072091; 71; 21.8636976; 50.7346935; 80; 21.6772528; 50.7346935; 80; 
31; 25.0072091; 71; 21.8636976; 50.7346935; 80; 21.6772528; 50.7346935; 80; 
32; 25.0072091; 71; 21.8636976; 50.7346935; 80; 21.6772528; 50.7346935; 80; 
33; 25.0072091; 71; 21.8636976; 50.7346935; 80; 21.6772528; 50.7346935; 80; 
34; 25.0072091; 71; 21.8636976; 50.7346935; 80; 21.6772528; 50.7346935; 80; 
35; 25.0072091; 71; 21.8636976; 50.7346935; 80; 21.6772528; 50.7346935; 80; 
36; 25.0072091; 71; 21.8636976; 50.7346935; 80; 21.6772528; 50.7346935; 80; 
37; 29.2481977; 71; 25.5715762; 50.7346935; 80; 25.3535121; 50.7346935; 80; 
38; 29.2481977; 71; 25.5715762; 50.7346935; 80; 25.3535121; 50.7346935; 80; 
39; 29.2481977; 71; 25.5715762; 50.7346935; 80; 25.3535121; 50.7346935; 80; 
40; 29.2481977; 71; 25.5715762; 50.7346935; 80; 25.3535121; 50.7346935; 80; 
41; 29.2481977; 71; 25.5715762; 50.7346935; 80; 25.3535121; 50.7346935; 80; 
42; 29.2481977; 71; 25.5715762; 50.7346935; 80; 25.3535121; 50.7346935; 80; 
43; 29.2481977; 71; 25.5715762; 50.7346935; 80; 25.3535121; 50.785588; 80; 
44; 29.2481977; 71; 13.2951678; 51.565733; 80; 13.3265004; 51.0928567; 80; 
45; 6.30720906; 71; 15.5499038; 67.4119288; 80; 15.5865502; 67.8157874; 80; 
46; 5.47; 71; 13.2951678; 79.006082; 80; 13.3265004; 79.0058391; 80; 
47; 5.47; 71; 13.2951678; 79.649995; 80; 15.5865502; 79.649995; 79.6932262; 
48; 5.47; 71; 13.2951678; 89.4180393; 75.5356706; 13.3265004; 89.4079215; 75; 
49; 5.47; 71; 15.5499038; 96.340589; 75; 15.5865502; 96.3492396; 75; 
50; 5.47; 71; 5.47; 97.4111221; 75; 5.47; 98.3093066; 75; 
51; 5.47; 71; 5.47; 97.4348965; 75; 5.47; 96.9558915; 75.2565273; 
52; 5.47; 71; 5.47; 97.4447693; 75; 5.47; 96.9719359; 75; 
53; 5.47; 71; 5.47; 97.4452702; 75; 5.47; 97.3403503; 75; 
54; 5.47; 71; 5.47; 97.4407701; 75; 5.47; 97.3899608; 75; 
55; 5.47; 71; 5.47; 97.4329806; 75; 5.47; 97.4936173; 75; 
56; 5.47; 71; 5.47; 97.4225602; 75; 5.47; 97.4308366; 75; 
57; 5.47; 71; 5.47; 97.4099028; 75; 5.47; 97.4178375; 75; 
58; 5.47; 71; 5.47; 97.395201; 75; 5.47; 97.1252118; 75.147111; 
59; 5.47; 71; 5.47; 97.3785527; 75; 5.47; 97.1124736; 75; 
60; 5.47; 71; 5.47; 97.3600111; 75; 5.47; 97.3703979; 75; 
61; 5.47; 71; 5.47; 97.3396086; 75; 5.47; 97.1652756; 75; 
62; 5.47; 71; 5.47; 97.3173673; 75; 5.47; 97.2304062; 75; 
63; 5.47; 71; 7.28660826; 97.2933049; 75; 6.49340009; 97.3881409; 75; 
64; 5.47; 71; 7.28660826; 97.2674366; 75; 6.49340009; 96.5321514; 75.1526066; 
65; 6.39766082; 71; 7.28660826; 97.2397765; 75; 6.49340009; 96.724184; 75; 
66; 6.39766082; 71; 7.28660826; 97.2103383; 75; 6.49340009; 97.4306188; 75; 
67; 6.39766082; 71; 7.28660826; 97.1791352; 75; 6.49340009; 97.1888024; 75.0006144; 
68; 5.47; 71; 7.28660826; 97.1461801; 75; 6.49340009; 97.1010137; 75; 
69; 5.47; 71; 7.28660826; 97.111486; 75; 6.49340009; 96.9148644; 75; 
70; 5.47; 71; 6.23005006; 97.0750657; 75; 5.55185708; 97.0165045; 75; 
71; 5.47; 71; 6.23005006; 97.0369319; 75; 5.55185708; 96.7327779; 75; 
72; 5.47; 71; 6.23005006; 96.9970971; 75; 5.55185708; 96.3463285; 75; 
73; 5.47; 71; 6.23005006; 96.9555738; 75; 5.55185708; 96.7886869; 75; 
74; 5.47; 71; 6.23005006; 96.9123744; 75; 5.55185708; 97.0619378; 75; 
75; 5.47; 71; 6.23005006; 96.8675111; 75; 5.55185708; 96.9248426; 75; 
76; 5.47; 71; 6.23005006; 96.8209963; 75; 5.55185708; 96.7760668; 75.0254999; 
77; 8.07204466; 71; 7.28660826; 84.3291274; 80; 16; 84.8769699; 80; 
78; 17.3550271; 71; 16; 61.3066776; 80; 16; 64.1571225; 80; 
79; 17.3550271; 71; 16; 50.7346935; 80; 16; 55.9685163; 80; 
80; 17.3550271; 71; 16; 50.7346935; 80; 16; 56.7155773; 80; 
81; 17.3550271; 71; 16; 50.7346935; 80; 16; 55.6113166; 80; 
82; 17.3550271; 71; 16; 53.6624486; 77.4395459; 16; 52.6057702; 77.9938871; 
83; 16; 71; 16; 62.8958798; 75; 16; 61.7139674; 75; 
84; 14.8385482; 71; 15.1232165; 88.8636214; 75; 13.68; 86.3748977; 75; 
85; 14.8385482; 71; 16; 105.386494; 75; 15.8568002; 102.89777; 75; 
86; 14.8385482; 71; 13.68; 99.4670376; 75; 13.68; 101.155198; 75; 
87; 14.8385482; 71; 16; 94.242701; 75; 16; 91.7539773; 75; 
88; 14.8385482; 71; 14.4367835; 83.3441524; 80; 16; 80.8554287; 80; 
89; 14.8385482; 71; 13.68; 68.2233762; 80; 13.7031998; 65.7346524; 75; 
90; 14.8385482; 71; 13.68; 63.6228033; 80; 13.68; 60.5862371; 80; 
91; 17.3550271; 71; 16; 58.0827972; 80; 16; 58.6858163; 80; 
92; 17.3550271; 71; 16; 53.2177162; 80; 16; 52.4550444; 80; 
93; 17.3550271; 71; 16; 53.1929458; 80; 16; 51.3113046; 80; 
94; 17.3550271; 71; 16; 50.7346935; 80; 16; 50.9789118; 78.5768566; 
95; 17.3550271; 71; 16; 50.7346935; 80; 16; 50.9764755; 80; 
96; 17.3550271; 71; 25.4; 81.1549111; 77.2217754; 25.4; 74.0352027; 75; 
