AcceptGap; iterations; time_master; time_subproblem; time_feasPt; CoopPotentialPercent
0.002; 2; 0.653999984; 1.89600003; 0.515999973; 78.4883639
0.001; 6; 1.33599997; 2.78299999; 0.59799999; 93.6107339
0.0005; 47; 7.35400009; 12.448; 0.721000016; 94.3665934
0.0002; 148; 22.0830002; 35.6209984; 0.744000018; 97.7766397
0.0001; 258; 36.0719986; 56.1679993; 0.657999992; 98.850989
5e-05; 515; 74.9400024; 103.925003; 0.861999989; 99.4327663
2e-05; 616; 93.0240021; 120.072998; 1.00800002; 99.705633
