t; nomPriceB7; nomPlPowB7; integrPriceB7; integrPlPowB7; integrT_in_B7; disagg_price_bus7; PlPowB7; disaggT_in_B7;  initFeasThres; finalFeasThres; accept_gap; iterations; CPUmaster; CPUsubproblem; CPUfeasPt; finalDetectGap; nomCongestionCost; intCongestionCost; disaggCongestionCost; Objective; nomImprovPercent; CoopPotentialPercent; nominalCost; integratedCost
1; 10.52; 71; 10.52; 60.8165523; 80; 10.52; 60.8165523; 80; 142; 82.8409202; 0.0002; 96; 8.21399975; 15.9729996; 0.959999979; 0.000166978885; 1.45262589e-10; -1.45676245e-09; 6.03748994e-10; 1804578.68; 0.502701198; 97.8550727; 1813696.15; 1804378.83
2; 10.52; 71; 10.52; 50.7346935; 80; 10.52; 50.7346935; 80; 
3; 10.52; 71; 10.52; 50.7346935; 80; 10.52; 54.9979138; 80; 
4; 10.52; 71; 10.52; 50.7346935; 80; 10.52; 65.5542643; 80; 
5; 10.52; 71; 10.52; 50.7346935; 80; 10.52; 71.5875839; 80; 
6; 10.52; 71; 10.52; 50.7346935; 80; 10.52; 73.5852489; 80; 
7; 10.52; 71; 10.52; 50.7346935; 80; 10.52; 64.2433199; 80; 
8; 10.52; 71; 10.52; 69.8574689; 80; 10.52; 51.7644226; 80; 
9; 10.52; 71; 10.52; 77.2645831; 80; 10.52; 54.9695324; 80; 
10; 10.52; 71; 10.52; 58.2567787; 80; 10.52; 58.2565359; 80; 
11; 14.59; 71; 14.59; 50.7346935; 80; 14.59; 54.030731; 80; 
12; 15.5475; 71; 15.3761538; 50.7346935; 80; 15.3761538; 50.7346935; 80; 
13; 15.5475; 71; 15.3761538; 50.7346935; 80; 15.3761538; 50.7346935; 80; 
14; 15.5475; 71; 15.3761538; 50.7346935; 80; 15.3761538; 50.7346935; 80; 
15; 15.5475; 71; 15.3761538; 50.7346935; 80; 15.3761538; 50.7346935; 80; 
16; 15.5475; 71; 15.3761538; 50.7346935; 80; 15.3761538; 50.7346935; 80; 
17; 15.5475; 71; 15.3761538; 50.7346935; 80; 15.3761538; 50.7346935; 80; 
18; 15.5475; 71; 15.3761538; 50.7346935; 80; 15.3761538; 50.7346935; 80; 
19; 15.5475; 71; 15.3761538; 50.7346935; 80; 15.3761538; 50.7346935; 80; 
20; 15.5475; 71; 15.3761538; 50.7346935; 80; 15.3761538; 50.7346935; 80; 
21; 15.5475; 71; 15.3761538; 50.7346935; 80; 15.3761538; 50.7346935; 80; 
22; 15.5475; 71; 15.3761538; 50.7346935; 80; 15.3761538; 50.7346935; 80; 
23; 15.5475; 71; 15.3761538; 50.7346935; 80; 15.3761538; 50.7346935; 80; 
24; 15.5475; 71; 15.3761538; 50.7346935; 80; 15.3761538; 50.7346935; 80; 
25; 17.81; 71; 16.6238462; 50.7346935; 80; 16.6238462; 50.7346935; 80; 
26; 16; 71; 16; 50.7346935; 80; 16; 50.7346935; 80; 
27; 16; 71; 16; 50.7346935; 80; 16; 50.7346935; 80; 
28; 16; 71; 16; 50.7346935; 80; 16; 50.7346935; 80; 
29; 16; 71; 16; 50.7346935; 80; 16; 50.7346935; 80; 
30; 16; 71; 16; 50.7346935; 80; 16; 50.7346935; 80; 
31; 16; 71; 16; 50.7346935; 80; 16; 50.7346935; 80; 
32; 16; 71; 16; 50.7346935; 80; 16; 50.7346935; 80; 
33; 16; 71; 16; 50.7346935; 80; 16; 50.7346935; 80; 
34; 16; 71; 16; 50.7346935; 80; 16; 50.7346935; 80; 
35; 16; 71; 16; 50.7346935; 80; 16; 50.7346935; 80; 
36; 16; 71; 16; 50.7346935; 80; 16; 50.7346935; 80; 
37; 20.4725; 71; 18.7134503; 50.7346935; 80; 18.7134503; 50.7346935; 80; 
38; 20.4725; 71; 18.7134503; 50.7346935; 80; 18.7134503; 50.7346935; 80; 
39; 20.7; 71; 18.7134503; 50.7346935; 80; 18.7134503; 50.7346935; 80; 
40; 20.7; 71; 20.7; 50.7346935; 80; 18.7134503; 50.7346935; 80; 
41; 20.4725; 71; 18.7134503; 50.7346935; 80; 18.7134503; 50.7346935; 80; 
42; 20.4725; 71; 18.7134503; 50.7346935; 80; 18.7134503; 50.7346935; 80; 
43; 13.4015; 71; 12.9127485; 64.1023604; 80; 14.8992982; 67.1290123; 80; 
44; 4.67685; 71; 6.32194144; 83.6109579; 79.7482587; 7.75261456; 85.5125584; 79.6485978; 
45; 5.47; 71; 7.39408356; 93.3287969; 75; 9.06738544; 92.3035476; 75; 
46; 4.67685; 71; 6.32194144; 96.8411562; 75; 4.89126833; 96.9663948; 75; 
47; 4.67685; 71; 7.39408356; 96.8946516; 75; 5.72078167; 96.9229068; 75.0525669; 
48; 4.67685; 71; 4.67685; 96.9154079; 75; 4.67685; 96.2173791; 75; 
49; 4.67685; 71; 4.67685; 96.9238076; 75; 4.67685; 96.667603; 75; 
50; 4.67685; 71; 4.67685; 96.9223545; 75; 4.67685; 97.3764587; 75; 
51; 4.67685; 71; 4.67685; 96.9169829; 75; 4.67685; 97.0372763; 75; 
52; 4.67685; 71; 4.67685; 96.9083789; 75; 4.67685; 97.0278099; 75; 
53; 4.67685; 71; 4.67685; 96.8972429; 75; 4.67685; 97.0157907; 75; 
54; 4.67685; 71; 4.67685; 96.8839188; 75; 4.67685; 97.0015773; 75; 
55; 5.47; 71; 5.47; 96.8685758; 75; 5.47; 96.0773081; 75.4813277; 
56; 5.47; 71; 5.47; 96.8513006; 75; 5.47; 93.6784057; 75; 
57; 5.47; 71; 5.47; 96.8321414; 75; 5.47; 93.3457429; 75; 
58; 5.47; 71; 5.47; 96.8111279; 75; 5.47; 96.7885235; 75; 
59; 5.47; 71; 5.47; 96.7882811; 75; 5.47; 95.6006634; 76.2577231; 
60; 5.47; 71; 5.47; 96.7636181; 75; 5.47; 93.5624026; 75.5146565; 
61; 5.47; 71; 5.47; 96.7371538; 75; 5.47; 92.7793603; 75; 
62; 5.47; 71; 5.47; 96.7089022; 75; 5.47; 95.2078019; 75; 
63; 5.47; 71; 5.47; 96.6788769; 75; 5.47; 98.2691454; 75; 
64; 5.47; 71; 5.47; 96.6470909; 75; 5.47; 96.7181661; 75; 
65; 5.47; 71; 5.47; 96.6135574; 75; 5.47; 96.7237453; 75; 
66; 5.47; 71; 5.47; 96.5782891; 75; 5.47; 96.7673756; 75; 
67; 5.47; 71; 5.47; 96.5412988; 75; 5.47; 95.4044707; 75; 
68; 4.67685; 71; 5.47; 96.5025991; 75; 5.47; 95.974905; 75; 
69; 4.67685; 71; 4.67685; 96.4622026; 75; 4.67685; 96.9676317; 75; 
70; 4.67685; 71; 4.67685; 96.4201218; 75; 4.67685; 94.9593539; 75; 
71; 4.67685; 71; 4.67685; 96.3763689; 75; 4.67685; 95.8475205; 75; 
72; 4.67685; 71; 4.67685; 96.3309562; 75; 4.67685; 97.1532799; 75; 
73; 4.67685; 71; 4.67685; 96.283896; 75; 4.67685; 95.6977077; 75; 
74; 4.67685; 71; 4.67685; 96.2352003; 75; 4.67685; 94.3155034; 75; 
75; 4.67685; 71; 4.67685; 96.1848811; 75; 4.67685; 95.7706194; 75; 
76; 4.67685; 71; 4.67685; 96.1329503; 75; 4.67685; 97.0330263; 75; 
77; 4.67685; 71; 4.67685; 96.0794198; 75; 4.67685; 96.2091033; 75; 
78; 9.43575; 71; 10.89; 77.043261; 80; 9.74574124; 82.7932243; 80; 
79; 9.43575; 71; 10.89; 74.6388615; 78.7103688; 8.33260876; 66.725358; 80; 
80; 9.43575; 71; 10.89; 70.7118016; 80; 11.361937; 57.3047877; 80; 
81; 9.43575; 71; 10.89; 50.7346935; 80; 11.361937; 50.7346935; 80; 
82; 9.43575; 71; 10.89; 50.7346935; 77.5654272; 11.361937; 52.4468079; 77.1724158; 
83; 8.06756625; 71; 9.31095; 79.5255668; 75; 9.71445609; 78.9778136; 75; 
84; 8.06756625; 71; 10.89; 102.071678; 75; 9.71445609; 92.6955551; 75; 
85; 8.06756625; 71; 9.31095; 97.4102042; 75; 9.71445609; 94.2068267; 75; 
86; 8.06756625; 71; 9.31095; 84.4861361; 80; 9.71445609; 83.9383829; 75; 
87; 9.194135; 71; 10.51715; 67.122388; 80; 9.71445609; 66.5746348; 75; 
88; 13.32; 71; 10.89; 57.2342779; 80; 11.361937; 63.5859625; 80; 
89; 13.32; 71; 10.89; 50.7346935; 80; 11.361937; 53.2999849; 77.5362625; 
90; 13.32; 71; 10.89; 50.7346935; 80; 11.361937; 50.7346935; 80; 
91; 13.32; 71; 10.89; 50.7346935; 80; 11.361937; 50.7346935; 80; 
92; 13.32; 71; 10.89; 50.7346935; 80; 11.361937; 50.7346935; 80; 
93; 13.32; 71; 10.89; 50.7346935; 80; 11.361937; 55.4435723; 80; 
94; 13.32; 71; 10.89; 50.7346935; 80; 11.361937; 55.396597; 80; 
95; 13.32; 71; 10.89; 50.7346935; 80; 11.361937; 53.4663867; 80; 
96; 13.32; 71; 16; 81.1549111; 75; 15.278063; 74.160724; 75; 
