GAMS 28.2.0  r750fa45 Released Aug 19, 2019 WEX-WEI x86 64bit/MS Windows                                                                                                                                                               05/27/21 22:25:45 Page 1
G e n e r a l   A l g e b r a i c   M o d e l i n g   S y s t e m
C o m p i l a t i o n


   2  display "MSNT/";
   3  file screen /'con'/;
   4   
   5  $macro erf(x) (1/2 + 1/sqrt(2*pi)*exp(-power(x,2)/2)*(x + power(x,3)/3 + power(x,5)/15 + power(x,7)/105 + power(x,9)/945 + power(x,11)/10395 + power(x,13)/135135 + power(x,15)/2027025 + power(x,17)/34459425 + power(x,19)/654729075 + power(x,21)/1374
      9310575 + power(x,23)/316234143225))
   6   
   7  Sets
   8    bid
   9    h              Hours in a week
  10    i              Intervalls for linearization
  11    c              Number of cuts
  12   
  13  *  scenIdx         Loop index for scenarios
  14  *  stat            Set for model and solver status /modelstat,solvestat/
  15  ;
  16   
  17   
  18  Scalars
  19    mu                   Median of factor f1's natural logarithm [-]
  20    sigm                 Standard deviation of factor f1's natural logarithm [-]
  21    movAvg               Moving average of past ask prices [EUR]
  22    f2                   Price estimation factor f2
  23  ;
  24   
  25  Parameters
  26    uB(c)
  27    ug(c)
  28    combinations(bid,bid)
  29  *  returnStat(scenIdx,stat) Parameter for model and solver status
  30  *  tSol(scenIdx)            Time used by solver [CPU secs]
  31    C0                       Production cost without PRL [EUR]
  32    maxPRL
  33    maxCPRL
  34    solvetime
  35    barontime
  36  ;
  37   
INCLUDE    U:\biddingwithnils\MINLP approach\matdata.gms
GDXIN   U:\biddingwithnils\MINLP approach\matdata.gdx
--- LOAD  c = 1:c
--- LOAD  uB = 2:uB
--- LOAD  ug = 3:ug
--- LOAD  bid = 4:bid
--- LOAD  mu = 5:mu
--- LOAD  sigm = 6:sigm
--- LOAD  movAvg = 7:movAvg
--- LOAD  f2 = 8:f2
--- LOAD  C0 = 9:C0
--- LOAD  combinations = 10:combinations
--- LOAD  maxPRL = 11:maxPRL
--- LOAD  maxCPRL = 12:maxCPRL
  53   
  54  Alias(bid,biid)
GAMS 28.2.0  r750fa45 Released Aug 19, 2019 WEX-WEI x86 64bit/MS Windows                                                                                                                                                               05/27/21 22:25:45 Page 2
G e n e r a l   A l g e b r a i c   M o d e l i n g   S y s t e m
C o m p i l a t i o n


  55   
  56  Variables
  57    CPRL(bid)                    Total cost [EUR]
  58   
  59  *  askPrice(bid)                Price for current PRL offer
  60    x(bid)                       Transformed ask price
  61    y1(bid)                      Natural logarithm of price estimation factor f1
  62  *  pRefuse                 Probabilty that entire offer package is refused
  63  *  p(bid)                       Probabilty that bid package i is accepted
  64    Ctot                    Weekly cost in current loop [EUR]
  65    C_b(bid)
  66  ;
  67   
  68  Positive variables
  69    pRefuse
  70    p(bid)
  71    askPrice(bid)
  72  ;
  73   
  74  Integer Variable
  75    PRL(bid)              PRL partition for given scenario [MW]
  76  ;
  77   
  78  Equations
  79    CostWeek         Weekly production cost
  80  *  CostBid(bid)
  81    Transf(bid)           Transform offer price into standard normally distributed variable
  82    ProbRefuse       Probability of entire offer refusal
  83    ProbAcc(bid)          Probability of partial offer acceptance
  84    ProbAccLast(bid)
  85    Estimation(bid)       Linking factors to asked price
  86    ascendingBids(bid)
  87    sumPRL
  88   
  89   
  90  ;
  91   
  92  *  CostWeek                          ..  Ctot =e= pRefuse*C0 + sum(bid,p(bid)*C_b(bid));
  93  *  CostBid(bid)                      ..  C_b(bid) =e= CPRL(bid) - sum(biid,PRL(biid)*askPrice(biid)*combinations(biid,bid));
  94    CostWeek                          ..  Ctot =e= pRefuse*C0 + sum(bid,p(bid)*(CPRL(bid) - sum(biid,PRL(biid)*askPrice(biid)*combinations(biid,bid))));
  95    Transf(bid)                       ..  x(bid) =e= (y1(bid) - mu)/(sigm);
  96    Estimation(bid)                   ..  y1(bid) =e= log(askPrice(bid)) - log(movAvg) - log(f2);
  97   
  98    ProbRefuse                            ..  pRefuse =e= 1 - sum(bid,p(bid));
  99    ProbAcc(bid)$(ord(bid)<card(bid))     ..  p(bid) =e= (1/2 + 1/sqrt(2*pi)*exp(-power(x(bid+1),2)/2)*(x(bid+1) + power(x(bid+1),3)/3 + power(x(bid+1),5)/15 + power(x(bid+1),7)/105 + power(x(bid+1),9)/945 + power(x(bid+1),11)/10395 + power(x(bid+1),1
      3)/135135 + power(x(bid+1),15)/2027025 + power(x(bid+1),17)/34459425 + power(x(bid+1),19)/654729075 + power(x(bid+1),21)/13749310575 + power(x(bid+1),23)/316234143225))-(1/2 + 1/sqrt(2*pi)*exp(-power(x(bid),2)/2)*(x(bid) + power(x(bid),3)/3 + power(
      x(bid),5)/15 + power(x(bid),7)/105 + power(x(bid),9)/945 + power(x(bid),11)/10395 + power(x(bid),13)/135135 + power(x(bid),15)/2027025 + power(x(bid),17)/34459425 + power(x(bid),19)/654729075 + power(x(bid),21)/13749310575 + power(x(bid),23)/3162341
      43225));
 100    ProbAccLast(bid)$(ord(bid)=card(bid)) ..  p(bid) =e= 1-(1/2 + 1/sqrt(2*pi)*exp(-power(x(bid),2)/2)*(x(bid) + power(x(bid),3)/3 + power(x(bid),5)/15 + power(x(bid),7)/105 + power(x(bid),9)/945 + power(x(bid),11)/10395 + power(x(bid),13)/135135 + po
      wer(x(bid),15)/2027025 + power(x(bid),17)/34459425 + power(x(bid),19)/654729075 + power(x(bid),21)/13749310575 + power(x(bid),23)/316234143225));
 101   
 102    ascendingBids(bid)$(ord(bid)>1)   ..  askPrice(bid) =g= askPrice(bid-1);
 103    sumPRL                            ..  sum(bid,PRL(bid)) =l= maxPRL;
GAMS 28.2.0  r750fa45 Released Aug 19, 2019 WEX-WEI x86 64bit/MS Windows                                                                                                                                                               05/27/21 22:25:45 Page 3
G e n e r a l   A l g e b r a i c   M o d e l i n g   S y s t e m
C o m p i l a t i o n


 104   
 105    x.lo(bid)             = -2;
 106    x.up(bid)             = 2;
 107  *  askPrice.lo(bid)      = 1000;
 108  *  askPrice.up(bid)      = 6000;
 109    askPrice.lo(bid)      = 0;
 110    askPrice.up(bid)      = movAvg*3;
 111    y1.lo(bid)            = mu - 2*sigm;
 112    y1.up(bid)            = mu + 2*sigm;
 113    p.lo(bid)             = 0;
 114    p.up(bid)             = 1;
 115    pRefuse.lo            = 0;
 116    pRefuse.up            = 1;
 117    CPRL.lo(bid) = C0;
 118    CPRL.up(bid) = maxCPRL;
 119    PRL.lo(bid) = 0;
 120    PRL.up(bid) = maxPRL;
 121    Ctot.lo = C0 - movAvg*3*maxPRL;
 122    Ctot.up = C0;
 123  *  C_b.lo(bid) = C0 - movAvg*3*10;
 124  *  C_b.up(bid) = maxCPRL;
 125   
 126  *Init
 127    p.l(bid)                  = 0.3;
 128    askPrice.l(bid)           = movAvg;
 129    y1.l(bid)                 = - log(f2);
 130    CPRL.l(bid)               = (C0+maxCPRL)/2;
 131    PRL.l(bid)                = 3;
 132   
 133   
 134   
 135   
INCLUDE    U:\biddingwithnils\MINLP approach\cuts.inc
 137  Equations
 138  Cuts(bid,c)
 139  ;
 140  Cuts(bid,c) .. CPRL(bid) =g= ug(c) - uB(c) * sum(biid,PRL(biid)*combinations(biid,bid));
 141   
 142  Model    bidding    / all /;
 143   
 144  option MINLP = Baron
 145         reslim = 14400
 146         threads = 1
 147         optca = 0.001
 148         optcr = 1e-5;
 149  *$onecho > baron.opt
 150  *DeltaTerm 1
 151  *DeltaT 600
 152  *DeltaA 0.5
 153  *$offecho
 154   
INCLUDE    U:\biddingwithnils\MINLP approach\options.inc
 156   
GAMS 28.2.0  r750fa45 Released Aug 19, 2019 WEX-WEI x86 64bit/MS Windows                                                                                                                                                               05/27/21 22:25:45 Page 4
G e n e r a l   A l g e b r a i c   M o d e l i n g   S y s t e m
C o m p i l a t i o n


 157  option optcr = 0.001
 158  option threads = 1
 159   
 160  solve bidding minimizing Ctot using minlp;
 161   
 162  *Set stat / modelStat, solveStat /;
 163   
 164  Parameter etSolve;
 165  etSolve = bidding.etSolve;
 166   
 167  execute_unload 'matsol.gdx';
GAMS 28.2.0  r750fa45 Released Aug 19, 2019 WEX-WEI x86 64bit/MS Windows                                                                                                                                                               05/27/21 22:25:45 Page 5
G e n e r a l   A l g e b r a i c   M o d e l i n g   S y s t e m
Include File Summary


   SEQ   GLOBAL TYPE      PARENT   LOCAL  FILENAME

     1        1 INPUT          0       0  U:\biddingwithnils\MINLP approach\Bidding_Master.gms
     2       38 IF EXIST       1      38  U:\biddingwithnils\MINLP approach\matdata.gms
     3       38 INCLUDE        1      38  .U:\biddingwithnils\MINLP approach\matdata.gms
     4       39 GDXIN          3       1  .U:\biddingwithnils\MINLP approach\matdata.gdx
     5      136 INCLUDE        1     122  .U:\biddingwithnils\MINLP approach\cuts.inc
     6      155 INCLUDE        1     137  .U:\biddingwithnils\MINLP approach\options.inc


COMPILATION TIME     =        0.109 SECONDS      3 MB  28.2.0 r750fa45 WEX-WEI
GAMS 28.2.0  r750fa45 Released Aug 19, 2019 WEX-WEI x86 64bit/MS Windows                                                                                                                                                               05/27/21 22:25:45 Page 6
G e n e r a l   A l g e b r a i c   M o d e l i n g   S y s t e m
E x e c u t i o n


----      2 MSNT/
GAMS 28.2.0  r750fa45 Released Aug 19, 2019 WEX-WEI x86 64bit/MS Windows                                                                                                                                                               05/27/21 22:25:45 Page 7
G e n e r a l   A l g e b r a i c   M o d e l i n g   S y s t e m
Equation Listing    SOLVE bidding Using MINLP From line 160


---- CostWeek  =E=  Weekly production cost

CostWeek..  - (0.3)*CPRL(1) + Ctot - 242292.031829084*pRefuse - (249857.466365516)*p(1) + (0.9)*askPrice(1) + (808.514019230769)*PRL(1) =E= 0 ; (LHS = 86483.3899963522, INFES = 86483.3899963522 ****)
     

---- Transf  =E=  Transform offer price into standard normally distributed variable

Transf(1)..  x(1) - 12.7208142542321*y1(1) =E= -1.84530596072196 ; (LHS = 0.15469403927804, INFES = 2 ****)
     

---- ProbRefuse  =E=  Probability of entire offer refusal

ProbRefuse..  pRefuse + p(1) =E= 1 ; (LHS = 0.3, INFES = 0.7 ****)
     

---- ProbAcc  =E=  Probability of partial offer acceptance

                NONE


---- ProbAccLast  =E=  

ProbAccLast(1)..  (0.398942280401433)*x(1) + p(1) =E= 0.5 ; (LHS = 0.3, INFES = 0.2 ****)
     

---- Estimation  =E=  Linking factors to asked price

Estimation(1)..  y1(1) - (0.000371051079962007)*askPrice(1) =E= -8.12135953560833 ; (LHS = -7.9113315256196, INFES = 0.210028009988735 ****)
     

---- ascendingBids  =G=  

                NONE


---- sumPRL  =L=  

sumPRL..  PRL(1) =L= 10 ; (LHS = 3)
     

---- Cuts  =G=  

Cuts(1,1)..  CPRL(1) - 1932.05765609217*PRL(1) =G= 242292.03182908 ; (LHS = 252146.433589548)
     
Cuts(1,2)..  CPRL(1) - 2181.24335758544*PRL(1) =G= 242102.725921649 ; (LHS = 251398.876485068)
     
Cuts(1,3)..  CPRL(1) - 2431.361121473*PRL(1) =G= 241655.459993797 ; (LHS = 250648.523193405)
     
REMAINING 8 ENTRIES SKIPPED

GAMS 28.2.0  r750fa45 Released Aug 19, 2019 WEX-WEI x86 64bit/MS Windows                                                                                                                                                               05/27/21 22:25:45 Page 8
G e n e r a l   A l g e b r a i c   M o d e l i n g   S y s t e m
Column Listing      SOLVE bidding Using MINLP From line 160


---- CPRL  Total cost [EUR]

CPRL(1)
                (.LO, .L, .UP, .M = 242292.031829084, 257942.606557824, 273593.181286564, 0)
      (-0.3)    CostWeek
        1       Cuts(1,1)
        1       Cuts(1,2)
        1       Cuts(1,3)
        1       Cuts(1,4)
        1       Cuts(1,5)
        1       Cuts(1,6)
        1       Cuts(1,7)
        1       Cuts(1,8)
        1       Cuts(1,9)
        1       Cuts(1,10)
        1       Cuts(1,11)


---- x  Transformed ask price

x(1)
                (.LO, .L, .UP, .M = -2, 0, 2, 0)
        1       Transf(1)
       (0.3989) ProbAccLast(1)


---- y1  Natural logarithm of price estimation factor f1

y1(1)
                (.LO, .L, .UP, .M = -0.0121607026237786, -0.0121607026237786, 0.302284577376221, 0)
      -12.7208  Transf(1)
        1       Estimation(1)
       -0.2222  (OLD LEVEL ****)


---- Ctot  Weekly cost in current loop [EUR]

Ctot
                (.LO, .L, .UP, .M = 161440.629906007, 161440.629906007, 242292.031829084, 0)
        1       CostWeek
        0       (OLD LEVEL ****)


---- pRefuse  

pRefuse
                (.LO, .L, .UP, .M = 0, 0, 1, 0)
  -242292.0318  CostWeek
        1       ProbRefuse

GAMS 28.2.0  r750fa45 Released Aug 19, 2019 WEX-WEI x86 64bit/MS Windows                                                                                                                                                               05/27/21 22:25:45 Page 9
G e n e r a l   A l g e b r a i c   M o d e l i n g   S y s t e m
Column Listing      SOLVE bidding Using MINLP From line 160


---- p  

p(1)
                (.LO, .L, .UP, .M = 0, 0.3, 1, 0)
 (-249857.4664) CostWeek
        1       ProbRefuse
        1       ProbAccLast(1)


---- askPrice  

askPrice(1)
                (.LO, .L, .UP, .M = 0, 2695.04673076923, 8085.14019230769, 0)
       (0.9)    CostWeek
      (-0.0004) Estimation(1)


---- PRL  PRL partition for given scenario [MW]

PRL(1)
                (.LO, .L, .UP, .M = 0, 3, 10, 0)
     (808.514)  CostWeek
        1       sumPRL
    -1932.0577  Cuts(1,1)
    -2181.2434  Cuts(1,2)
    -2431.3611  Cuts(1,3)
    -2681.395   Cuts(1,4)
    -2932.9499  Cuts(1,5)
    -3186.8629  Cuts(1,6)
    -3444.1202  Cuts(1,7)
    -3701.8873  Cuts(1,8)
    -3959.6543  Cuts(1,9)
    -4218.0354  Cuts(1,10)
    -4476.8707  Cuts(1,11)

GAMS 28.2.0  r750fa45 Released Aug 19, 2019 WEX-WEI x86 64bit/MS Windows                                                                                                                                                              05/27/21 22:25:45 Page 10
G e n e r a l   A l g e b r a i c   M o d e l i n g   S y s t e m
Model Statistics    SOLVE bidding Using MINLP From line 160


MODEL STATISTICS

BLOCKS OF EQUATIONS           9     SINGLE EQUATIONS           17
BLOCKS OF VARIABLES           8     SINGLE VARIABLES            8  2 projected
NON ZERO ELEMENTS            37     NON LINEAR N-Z              6
DERIVATIVE POOL              20     CONSTANT POOL              37
CODE LENGTH                  67     DISCRETE VARIABLES          1


GENERATION TIME      =        0.079 SECONDS      4 MB  28.2.0 r750fa45 WEX-WEI


EXECUTION TIME       =        0.094 SECONDS      4 MB  28.2.0 r750fa45 WEX-WEI
GAMS 28.2.0  r750fa45 Released Aug 19, 2019 WEX-WEI x86 64bit/MS Windows                                                                                                                                                              05/27/21 22:25:45 Page 11
G e n e r a l   A l g e b r a i c   M o d e l i n g   S y s t e m
Solution Report     SOLVE bidding Using MINLP From line 160


               S O L V E      S U M M A R Y

     MODEL   bidding             OBJECTIVE  Ctot
     TYPE    MINLP               DIRECTION  MINIMIZE
     SOLVER  BARON               FROM LINE  160

**** SOLVER STATUS     1 Normal Completion         
**** MODEL STATUS      8 Integer Solution          
**** OBJECTIVE VALUE           237341.9730

 RESOURCE USAGE, LIMIT          1.960     14400.000
 ITERATION COUNT, LIMIT         0    2000000000
 EVALUATION ERRORS              0             0

GAMS/BARON       28.2.0 r750fa45 Released Aug 19, 2019 WEI x86 64bit/MS Window

BARON is a product of The Optimization Firm, LLC. http://www.minlp.com/
Parts of the BARON software were created at the
University of Illinois at Urbana-Champaign.


===========================================================================
 BARON version 19.7.13. Built: WIN-64 Sat Jul 13 11:49:21 EDT 2019

 BARON is a product of The Optimization Firm.
 For information on BARON, see https://minlp.com/about-baron

 If you use this software, please cite publications from
 https://minlp.com/baron-publications, such as: 

 Kilinc, M. and N. V. Sahinidis, Exploiting integrality in the global
 optimization of mixed-integer nonlinear programming problems in BARON,
 Optimization Methods and Software, 33, 540-562, 2018.
===========================================================================
 This BARON run may utilize the following subsolver(s)
 For LP/MIP/QP: ILOG CPLEX                                      
 For NLP: MINOS, SNOPT, GAMS external NLP, IPOPT, FILTERSD, FILTERSQP

Solution      = 237341.973038339  found at node 1
Best possible = 237104.86817
Absolute gap  = 237.104868338909  optca = 0.001
Relative gap  = 0.000999000999711957  optcr = 0.001
  (Note that BARON uses a different formula to compute the relative gap as
   was used for the above reported value.)


                           LOWER          LEVEL          UPPER

---- EQU CostWeek            .              .              .          

  CostWeek  Weekly production cost
GAMS 28.2.0  r750fa45 Released Aug 19, 2019 WEX-WEI x86 64bit/MS Windows                                                                                                                                                              05/27/21 22:25:45 Page 12
G e n e r a l   A l g e b r a i c   M o d e l i n g   S y s t e m
Solution Report     SOLVE bidding Using MINLP From line 160


---- EQU Transf  Transform offer price into standard normally distributed variable

         LOWER          LEVEL          UPPER

1        -1.8453        -1.8453        -1.8453      

                           LOWER          LEVEL          UPPER

---- EQU ProbRefuse         1.0000         1.0000         1.0000      

  ProbRefuse  Probability of entire offer refusal

---- EQU ProbAcc  Probability of partial offer acceptance

                NONE


---- EQU ProbAccLast  

         LOWER          LEVEL          UPPER

1         0.5000         0.5000         0.5000      

---- EQU Estimation  Linking factors to asked price

         LOWER          LEVEL          UPPER

1        -8.1214        -8.1214        -8.1214      

---- EQU ascendingBids  

                NONE


                           LOWER          LEVEL          UPPER

---- EQU sumPRL            -INF            6.0000        10.0000      

---- EQU Cuts  

            LOWER          LEVEL          UPPER

1.1     242292.0318    246397.2040        +INF         
1.2     242102.7259    244902.0898        +INF         
1.3     241655.4600    243401.3832        +INF         
1.4     240959.4830    241901.1798        +INF         
1.5     240013.6774    240391.8507        +INF         
1.6     238807.1550    238868.3725        +INF         
1.7     237324.8289    237324.8289        +INF         
1.8     235583.7464    235778.2264        +INF         
1.9     233589.8658    234231.6240        +INF         
1.10    231336.6955    232681.3377        +INF         
1.11    228824.4747    231128.3260        +INF         
GAMS 28.2.0  r750fa45 Released Aug 19, 2019 WEX-WEI x86 64bit/MS Windows                                                                                                                                                              05/27/21 22:25:45 Page 13
G e n e r a l   A l g e b r a i c   M o d e l i n g   S y s t e m
Solution Report     SOLVE bidding Using MINLP From line 160


---- VAR CPRL  Total cost [EUR]

         LOWER          LEVEL          UPPER

1    242292.0318    257989.5499    273593.1813      

---- VAR x  Transformed ask price

         LOWER          LEVEL          UPPER

1        -2.0000        -0.9983         2.0000      

---- VAR y1  Natural logarithm of price estimation factor f1

         LOWER          LEVEL          UPPER

1        -0.0122         0.0666         0.3023      

                           LOWER          LEVEL          UPPER

---- VAR Ctot          161440.6299    237341.9730    242292.0318      
---- VAR pRefuse             .             0.1591         1.0000      

  Ctot  Weekly cost in current loop [EUR]

---- VAR p  

         LOWER          LEVEL          UPPER

1          .             0.8409         1.0000      

---- VAR askPrice  

         LOWER          LEVEL          UPPER

1          .          3597.3296      8085.1402      

---- VAR PRL  PRL partition for given scenario [MW]

         LOWER          LEVEL          UPPER

1          .             6.0000        10.0000      


**** REPORT SUMMARY :        0     NONOPT
                             0 INFEASIBLE
                             0  UNBOUNDED
                             0     ERRORS
                             1  PROJECTED
GAMS 28.2.0  r750fa45 Released Aug 19, 2019 WEX-WEI x86 64bit/MS Windows                                                                                                                                                              05/27/21 22:25:45 Page 14
G e n e r a l   A l g e b r a i c   M o d e l i n g   S y s t e m
E x e c u t i o n


EXECUTION TIME       =        0.047 SECONDS      3 MB  28.2.0 r750fa45 WEX-WEI


USER: Small MUD - 5 User License                     S190207:0909AO-WIN
      RWTH Aachen, Aachener Verfahrenstechnik                    DC7534
      License for teaching and research at degree granting institutions


**** FILE SUMMARY

Input      U:\biddingwithnils\MINLP approach\Bidding_Master.gms
Output     U:\biddingwithnils\MINLP approach\Bidding_Master.lst
