GAMS 28.2.0  r750fa45 Released Aug 19, 2019 WEX-WEI x86 64bit/MS Windows                                                                                                                                                               05/27/21 22:26:21 Page 1
G e n e r a l   A l g e b r a i c   M o d e l i n g   S y s t e m
C o m p i l a t i o n


   2  display "MSNT/";
   3  file screen /'con'/;
   4   
   5  $macro erf(x) (1/2 + 1/sqrt(2*pi)*exp(-power(x,2)/2)*(x + power(x,3)/3 + power(x,5)/15 + power(x,7)/105 + power(x,9)/945 + power(x,11)/10395 + power(x,13)/135135 + power(x,15)/2027025 + power(x,17)/34459425 + power(x,19)/654729075 + power(x,21)/1374
      9310575 + power(x,23)/316234143225))
   6   
   7  Sets
   8    bid
   9    h              Hours in a week
  10    i              Intervalls for linearization
  11    c              Number of cuts
  12   
  13  *  scenIdx         Loop index for scenarios
  14  *  stat            Set for model and solver status /modelstat,solvestat/
  15  ;
  16   
  17   
  18  Scalars
  19    mu                   Median of factor f1's natural logarithm [-]
  20    sigm                 Standard deviation of factor f1's natural logarithm [-]
  21    movAvg               Moving average of past ask prices [EUR]
  22    f2                   Price estimation factor f2
  23  ;
  24   
  25  Parameters
  26    uB(c)
  27    ug(c)
  28    combinations(bid,bid)
  29  *  returnStat(scenIdx,stat) Parameter for model and solver status
  30  *  tSol(scenIdx)            Time used by solver [CPU secs]
  31    C0                       Production cost without PRL [EUR]
  32    maxPRL
  33    maxCPRL
  34    solvetime
  35    barontime
  36  ;
  37   
INCLUDE    U:\biddingwithnils\MINLP approach\matdata.gms
GDXIN   U:\biddingwithnils\MINLP approach\matdata.gdx
--- LOAD  c = 1:c
--- LOAD  uB = 2:uB
--- LOAD  ug = 3:ug
--- LOAD  bid = 4:bid
--- LOAD  mu = 5:mu
--- LOAD  sigm = 6:sigm
--- LOAD  movAvg = 7:movAvg
--- LOAD  f2 = 8:f2
--- LOAD  C0 = 9:C0
--- LOAD  combinations = 10:combinations
--- LOAD  maxPRL = 11:maxPRL
--- LOAD  maxCPRL = 12:maxCPRL
  53   
  54  Alias(bid,biid)
GAMS 28.2.0  r750fa45 Released Aug 19, 2019 WEX-WEI x86 64bit/MS Windows                                                                                                                                                               05/27/21 22:26:21 Page 2
G e n e r a l   A l g e b r a i c   M o d e l i n g   S y s t e m
C o m p i l a t i o n


  55   
  56  Variables
  57    CPRL(bid)                    Total cost [EUR]
  58   
  59  *  askPrice(bid)                Price for current PRL offer
  60    x(bid)                       Transformed ask price
  61    y1(bid)                      Natural logarithm of price estimation factor f1
  62  *  pRefuse                 Probabilty that entire offer package is refused
  63  *  p(bid)                       Probabilty that bid package i is accepted
  64    Ctot                    Weekly cost in current loop [EUR]
  65    C_b(bid)
  66  ;
  67   
  68  Positive variables
  69    pRefuse
  70    p(bid)
  71    askPrice(bid)
  72  ;
  73   
  74  Integer Variable
  75    PRL(bid)              PRL partition for given scenario [MW]
  76  ;
  77   
  78  Equations
  79    CostWeek         Weekly production cost
  80  *  CostBid(bid)
  81    Transf(bid)           Transform offer price into standard normally distributed variable
  82    ProbRefuse       Probability of entire offer refusal
  83    ProbAcc(bid)          Probability of partial offer acceptance
  84    ProbAccLast(bid)
  85    Estimation(bid)       Linking factors to asked price
  86    ascendingBids(bid)
  87    sumPRL
  88   
  89   
  90  ;
  91   
  92  *  CostWeek                          ..  Ctot =e= pRefuse*C0 + sum(bid,p(bid)*C_b(bid));
  93  *  CostBid(bid)                      ..  C_b(bid) =e= CPRL(bid) - sum(biid,PRL(biid)*askPrice(biid)*combinations(biid,bid));
  94    CostWeek                          ..  Ctot =e= pRefuse*C0 + sum(bid,p(bid)*(CPRL(bid) - sum(biid,PRL(biid)*askPrice(biid)*combinations(biid,bid))));
  95    Transf(bid)                       ..  x(bid) =e= (y1(bid) - mu)/(sigm);
  96    Estimation(bid)                   ..  y1(bid) =e= log(askPrice(bid)) - log(movAvg) - log(f2);
  97   
  98    ProbRefuse                            ..  pRefuse =e= 1 - sum(bid,p(bid));
  99    ProbAcc(bid)$(ord(bid)<card(bid))     ..  p(bid) =e= (1/2 + 1/sqrt(2*pi)*exp(-power(x(bid+1),2)/2)*(x(bid+1) + power(x(bid+1),3)/3 + power(x(bid+1),5)/15 + power(x(bid+1),7)/105 + power(x(bid+1),9)/945 + power(x(bid+1),11)/10395 + power(x(bid+1),1
      3)/135135 + power(x(bid+1),15)/2027025 + power(x(bid+1),17)/34459425 + power(x(bid+1),19)/654729075 + power(x(bid+1),21)/13749310575 + power(x(bid+1),23)/316234143225))-(1/2 + 1/sqrt(2*pi)*exp(-power(x(bid),2)/2)*(x(bid) + power(x(bid),3)/3 + power(
      x(bid),5)/15 + power(x(bid),7)/105 + power(x(bid),9)/945 + power(x(bid),11)/10395 + power(x(bid),13)/135135 + power(x(bid),15)/2027025 + power(x(bid),17)/34459425 + power(x(bid),19)/654729075 + power(x(bid),21)/13749310575 + power(x(bid),23)/3162341
      43225));
 100    ProbAccLast(bid)$(ord(bid)=card(bid)) ..  p(bid) =e= 1-(1/2 + 1/sqrt(2*pi)*exp(-power(x(bid),2)/2)*(x(bid) + power(x(bid),3)/3 + power(x(bid),5)/15 + power(x(bid),7)/105 + power(x(bid),9)/945 + power(x(bid),11)/10395 + power(x(bid),13)/135135 + po
      wer(x(bid),15)/2027025 + power(x(bid),17)/34459425 + power(x(bid),19)/654729075 + power(x(bid),21)/13749310575 + power(x(bid),23)/316234143225));
 101   
 102    ascendingBids(bid)$(ord(bid)>1)   ..  askPrice(bid) =g= askPrice(bid-1);
 103    sumPRL                            ..  sum(bid,PRL(bid)) =l= maxPRL;
GAMS 28.2.0  r750fa45 Released Aug 19, 2019 WEX-WEI x86 64bit/MS Windows                                                                                                                                                               05/27/21 22:26:21 Page 3
G e n e r a l   A l g e b r a i c   M o d e l i n g   S y s t e m
C o m p i l a t i o n


 104   
 105    x.lo(bid)             = -2;
 106    x.up(bid)             = 2;
 107  *  askPrice.lo(bid)      = 1000;
 108  *  askPrice.up(bid)      = 6000;
 109    askPrice.lo(bid)      = 0;
 110    askPrice.up(bid)      = movAvg*3;
 111    y1.lo(bid)            = mu - 2*sigm;
 112    y1.up(bid)            = mu + 2*sigm;
 113    p.lo(bid)             = 0;
 114    p.up(bid)             = 1;
 115    pRefuse.lo            = 0;
 116    pRefuse.up            = 1;
 117    CPRL.lo(bid) = C0;
 118    CPRL.up(bid) = maxCPRL;
 119    PRL.lo(bid) = 0;
 120    PRL.up(bid) = maxPRL;
 121    Ctot.lo = C0 - movAvg*3*maxPRL;
 122    Ctot.up = C0;
 123  *  C_b.lo(bid) = C0 - movAvg*3*10;
 124  *  C_b.up(bid) = maxCPRL;
 125   
 126  *Init
 127    p.l(bid)                  = 0.3;
 128    askPrice.l(bid)           = movAvg;
 129    y1.l(bid)                 = - log(f2);
 130    CPRL.l(bid)               = (C0+maxCPRL)/2;
 131    PRL.l(bid)                = 3;
 132   
 133   
 134   
 135   
INCLUDE    U:\biddingwithnils\MINLP approach\cuts.inc
 137  Equations
 138  Cuts(bid,c)
 139  ;
 140  Cuts(bid,c) .. CPRL(bid) =g= ug(c) - uB(c) * sum(biid,PRL(biid)*combinations(biid,bid));
 141   
 142  Model    bidding    / all /;
 143   
 144  option MINLP = Baron
 145         reslim = 14400
 146         threads = 1
 147         optca = 0.001
 148         optcr = 1e-5;
 149  *$onecho > baron.opt
 150  *DeltaTerm 1
 151  *DeltaT 600
 152  *DeltaA 0.5
 153  *$offecho
 154   
INCLUDE    U:\biddingwithnils\MINLP approach\options.inc
 156   
GAMS 28.2.0  r750fa45 Released Aug 19, 2019 WEX-WEI x86 64bit/MS Windows                                                                                                                                                               05/27/21 22:26:21 Page 4
G e n e r a l   A l g e b r a i c   M o d e l i n g   S y s t e m
C o m p i l a t i o n


 157  option optcr = 0.001
 158  option threads = 1
 159   
 160  solve bidding minimizing Ctot using minlp;
 161   
 162  *Set stat / modelStat, solveStat /;
 163   
 164  Parameter etSolve;
 165  etSolve = bidding.etSolve;
 166   
 167  execute_unload 'matsol.gdx';
GAMS 28.2.0  r750fa45 Released Aug 19, 2019 WEX-WEI x86 64bit/MS Windows                                                                                                                                                               05/27/21 22:26:21 Page 5
G e n e r a l   A l g e b r a i c   M o d e l i n g   S y s t e m
Include File Summary


   SEQ   GLOBAL TYPE      PARENT   LOCAL  FILENAME

     1        1 INPUT          0       0  U:\biddingwithnils\MINLP approach\Bidding_Master.gms
     2       38 IF EXIST       1      38  U:\biddingwithnils\MINLP approach\matdata.gms
     3       38 INCLUDE        1      38  .U:\biddingwithnils\MINLP approach\matdata.gms
     4       39 GDXIN          3       1  .U:\biddingwithnils\MINLP approach\matdata.gdx
     5      136 INCLUDE        1     122  .U:\biddingwithnils\MINLP approach\cuts.inc
     6      155 INCLUDE        1     137  .U:\biddingwithnils\MINLP approach\options.inc


COMPILATION TIME     =        0.046 SECONDS      3 MB  28.2.0 r750fa45 WEX-WEI
GAMS 28.2.0  r750fa45 Released Aug 19, 2019 WEX-WEI x86 64bit/MS Windows                                                                                                                                                               05/27/21 22:26:21 Page 6
G e n e r a l   A l g e b r a i c   M o d e l i n g   S y s t e m
E x e c u t i o n


----      2 MSNT/
GAMS 28.2.0  r750fa45 Released Aug 19, 2019 WEX-WEI x86 64bit/MS Windows                                                                                                                                                               05/27/21 22:26:21 Page 7
G e n e r a l   A l g e b r a i c   M o d e l i n g   S y s t e m
Equation Listing    SOLVE bidding Using MINLP From line 160


---- CostWeek  =E=  Weekly production cost

CostWeek..  - (0.3)*CPRL(1) - (0.3)*CPRL(2) + Ctot - 530198.082809042*pRefuse - (529700.692085067)*p(1) - (521586.53266199)*p(2) + (1.8)*askPrice(1) + (0.9)*askPrice(2) + (1622.83188461538)*PRL(1) + (811.415942307692)*PRL(2) =E= 0 ;
     
      (LHS = 133670.321154156, INFES = 133670.321154156 ****)
     

---- Transf  =E=  Transform offer price into standard normally distributed variable

Transf(1)..  x(1) - 12.7208142542321*y1(1) =E= -0.776952947488773 ; (LHS = 1.22304705251123, INFES = 2 ****)
     
Transf(2)..  x(2) - 12.7208142542321*y1(2) =E= -0.776952947488773 ; (LHS = 1.22304705251123, INFES = 2 ****)
     

---- ProbRefuse  =E=  Probability of entire offer refusal

ProbRefuse..  pRefuse + p(1) + p(2) =E= 1 ; (LHS = 0.6, INFES = 0.4 ****)
     

---- ProbAcc  =E=  Probability of partial offer acceptance

ProbAcc(1)..  (0.398942280401433)*x(1) - (0.398942280401433)*x(2) + p(1) =E= 0 ; (LHS = 0.3, INFES = 0.3 ****)
     

---- ProbAccLast  =E=  

ProbAccLast(2)..  (0.398942280401433)*x(2) + p(2) =E= 0.5 ; (LHS = 0.3, INFES = 0.2 ****)
     

---- Estimation  =E=  Linking factors to asked price

Estimation(1)..  y1(1) - (0.000369724064265721)*askPrice(1) =E= -8.05832129283231 ; (LHS = -7.99889894602729, INFES = 0.0594223468050156 ****)
     
Estimation(2)..  y1(2) - (0.000369724064265721)*askPrice(2) =E= -8.05832129283231 ; (LHS = -7.99889894602729, INFES = 0.0594223468050156 ****)
     

---- ascendingBids  =G=  

ascendingBids(2)..  - askPrice(1) + askPrice(2) =G= 0 ; (LHS = 0)
     

---- sumPRL  =L=  

sumPRL..  PRL(1) + PRL(2) =L= 10 ; (LHS = 6)
     

---- Cuts  =G=  

Cuts(1,1)..  CPRL(1) - 439.343528909172*PRL(1) =G= 530198.082809039 ; (LHS = 536496.820921417)
     
GAMS 28.2.0  r750fa45 Released Aug 19, 2019 WEX-WEI x86 64bit/MS Windows                                                                                                                                                               05/27/21 22:26:21 Page 8
G e n e r a l   A l g e b r a i c   M o d e l i n g   S y s t e m
Equation Listing    SOLVE bidding Using MINLP From line 160


     Cuts  =G=  

Cuts(1,2)..  CPRL(1) - 657.835286832398*PRL(1) =G= 530059.498238748 ; (LHS = 535841.345647647)
     
Cuts(1,3)..  CPRL(1) - 878.873363737059*PRL(1) =G= 529697.258280613 ; (LHS = 535178.231416933)
     
REMAINING 19 ENTRIES SKIPPED

GAMS 28.2.0  r750fa45 Released Aug 19, 2019 WEX-WEI x86 64bit/MS Windows                                                                                                                                                               05/27/21 22:26:21 Page 9
G e n e r a l   A l g e b r a i c   M o d e l i n g   S y s t e m
Column Listing      SOLVE bidding Using MINLP From line 160


---- CPRL  Total cost [EUR]

CPRL(1)
                (.LO, .L, .UP, .M = 530198.082809042, 537814.851508144, 545431.620207246, 0)
      (-0.3)    CostWeek
        1       Cuts(1,1)
        1       Cuts(1,2)
        1       Cuts(1,3)
        1       Cuts(1,4)
        1       Cuts(1,5)
        1       Cuts(1,6)
        1       Cuts(1,7)
        1       Cuts(1,8)
        1       Cuts(1,9)
        1       Cuts(1,10)
        1       Cuts(1,11)

CPRL(2)
                (.LO, .L, .UP, .M = 530198.082809042, 537814.851508144, 545431.620207246, 0)
      (-0.3)    CostWeek
        1       Cuts(2,1)
        1       Cuts(2,2)
        1       Cuts(2,3)
        1       Cuts(2,4)
        1       Cuts(2,5)
        1       Cuts(2,6)
        1       Cuts(2,7)
        1       Cuts(2,8)
        1       Cuts(2,9)
        1       Cuts(2,10)
        1       Cuts(2,11)


---- x  Transformed ask price

x(1)
                (.LO, .L, .UP, .M = -2, 0, 2, 0)
        1       Transf(1)
       (0.3989) ProbAcc(1)

x(2)
                (.LO, .L, .UP, .M = -2, 0, 2, 0)
        1       Transf(2)
      (-0.3989) ProbAcc(1)
       (0.3989) ProbAccLast(2)


---- y1  Natural logarithm of price estimation factor f1

y1(1)
                (.LO, .L, .UP, .M = -0.0961453432200169, -0.0961453432200169, 0.218299936779983, 0)
      -12.7208  Transf(1)
        1       Estimation(1)
GAMS 28.2.0  r750fa45 Released Aug 19, 2019 WEX-WEI x86 64bit/MS Windows                                                                                                                                                              05/27/21 22:26:21 Page 10
G e n e r a l   A l g e b r a i c   M o d e l i n g   S y s t e m
Column Listing      SOLVE bidding Using MINLP From line 160


     y1  Natural logarithm of price estimation factor f1

       -0.1556  (OLD LEVEL ****)

y1(2)
                (.LO, .L, .UP, .M = -0.0961453432200169, -0.0961453432200169, 0.218299936779983, 0)
      -12.7208  Transf(2)
        1       Estimation(2)
       -0.1556  (OLD LEVEL ****)


---- Ctot  Weekly cost in current loop [EUR]

Ctot
                (.LO, .L, .UP, .M = 449056.488578273, 449056.488578273, 530198.082809042, 0)
        1       CostWeek
        0       (OLD LEVEL ****)


---- pRefuse  

pRefuse
                (.LO, .L, .UP, .M = 0, 0, 1, 0)
  -530198.0828  CostWeek
        1       ProbRefuse


---- p  

p(1)
                (.LO, .L, .UP, .M = 0, 0.3, 1, 0)
 (-529700.6921) CostWeek
        1       ProbRefuse
        1       ProbAcc(1)

p(2)
                (.LO, .L, .UP, .M = 0, 0.3, 1, 0)
 (-521586.5327) CostWeek
        1       ProbRefuse
        1       ProbAccLast(2)


---- askPrice  

askPrice(1)
                (.LO, .L, .UP, .M = 0, 2704.71980769231, 8114.15942307692, 0)
       (1.8)    CostWeek
      (-0.0004) Estimation(1)
       -1       ascendingBids(2)

askPrice(2)
                (.LO, .L, .UP, .M = 0, 2704.71980769231, 8114.15942307692, 0)
       (0.9)    CostWeek
GAMS 28.2.0  r750fa45 Released Aug 19, 2019 WEX-WEI x86 64bit/MS Windows                                                                                                                                                              05/27/21 22:26:21 Page 11
G e n e r a l   A l g e b r a i c   M o d e l i n g   S y s t e m
Column Listing      SOLVE bidding Using MINLP From line 160


     askPrice  

      (-0.0004) Estimation(2)
        1       ascendingBids(2)


---- PRL  PRL partition for given scenario [MW]

PRL(1)
                (.LO, .L, .UP, .M = 0, 3, 10, 0)
    (1622.8319) CostWeek
        1       sumPRL
     -439.3435  Cuts(1,1)
     -657.8353  Cuts(1,2)
     -878.8734  Cuts(1,3)
    -1100.1632  Cuts(1,4)
    -1323.372   Cuts(1,5)
    -1543.9476  Cuts(1,6)
    -1771.1612  Cuts(1,7)
    -2000.9261  Cuts(1,8)
    -2232.3011  Cuts(1,9)
    -2467.7262  Cuts(1,10)
    -2705.7773  Cuts(1,11)
     -439.3435  Cuts(2,1)
     -657.8353  Cuts(2,2)
     -878.8734  Cuts(2,3)
    -1100.1632  Cuts(2,4)
    -1323.372   Cuts(2,5)
    -1543.9476  Cuts(2,6)
    -1771.1612  Cuts(2,7)
    -2000.9261  Cuts(2,8)
    -2232.3011  Cuts(2,9)
    -2467.7262  Cuts(2,10)
    -2705.7773  Cuts(2,11)

PRL(2)
                (.LO, .L, .UP, .M = 0, 3, 10, 0)
     (811.4159) CostWeek
        1       sumPRL
     -439.3435  Cuts(2,1)
     -657.8353  Cuts(2,2)
     -878.8734  Cuts(2,3)
    -1100.1632  Cuts(2,4)
    -1323.372   Cuts(2,5)
    -1543.9476  Cuts(2,6)
    -1771.1612  Cuts(2,7)
    -2000.9261  Cuts(2,8)
    -2232.3011  Cuts(2,9)
    -2467.7262  Cuts(2,10)
    -2705.7773  Cuts(2,11)

GAMS 28.2.0  r750fa45 Released Aug 19, 2019 WEX-WEI x86 64bit/MS Windows                                                                                                                                                              05/27/21 22:26:21 Page 12
G e n e r a l   A l g e b r a i c   M o d e l i n g   S y s t e m
Model Statistics    SOLVE bidding Using MINLP From line 160


MODEL STATISTICS

BLOCKS OF EQUATIONS           9     SINGLE EQUATIONS           32
BLOCKS OF VARIABLES           8     SINGLE VARIABLES           14  3 projected
NON ZERO ELEMENTS            85     NON LINEAR N-Z             13
DERIVATIVE POOL              20     CONSTANT POOL              37
CODE LENGTH                 189     DISCRETE VARIABLES          2


GENERATION TIME      =        0.047 SECONDS      4 MB  28.2.0 r750fa45 WEX-WEI


EXECUTION TIME       =        0.063 SECONDS      4 MB  28.2.0 r750fa45 WEX-WEI
GAMS 28.2.0  r750fa45 Released Aug 19, 2019 WEX-WEI x86 64bit/MS Windows                                                                                                                                                              05/27/21 22:26:21 Page 13
G e n e r a l   A l g e b r a i c   M o d e l i n g   S y s t e m
Solution Report     SOLVE bidding Using MINLP From line 160


               S O L V E      S U M M A R Y

     MODEL   bidding             OBJECTIVE  Ctot
     TYPE    MINLP               DIRECTION  MINIMIZE
     SOLVER  BARON               FROM LINE  160

**** SOLVER STATUS     1 Normal Completion         
**** MODEL STATUS      8 Integer Solution          
**** OBJECTIVE VALUE           516432.7817

 RESOURCE USAGE, LIMIT         18.500     14400.000
 ITERATION COUNT, LIMIT         0    2000000000
 EVALUATION ERRORS              0             0

GAMS/BARON       28.2.0 r750fa45 Released Aug 19, 2019 WEI x86 64bit/MS Window

BARON is a product of The Optimization Firm, LLC. http://www.minlp.com/
Parts of the BARON software were created at the
University of Illinois at Urbana-Champaign.


===========================================================================
 BARON version 19.7.13. Built: WIN-64 Sat Jul 13 11:49:21 EDT 2019

 BARON is a product of The Optimization Firm.
 For information on BARON, see https://minlp.com/about-baron

 If you use this software, please cite publications from
 https://minlp.com/baron-publications, such as: 

 Kilinc, M. and N. V. Sahinidis, Exploiting integrality in the global
 optimization of mixed-integer nonlinear programming problems in BARON,
 Optimization Methods and Software, 33, 540-562, 2018.
===========================================================================
 This BARON run may utilize the following subsolver(s)
 For LP/MIP/QP: ILOG CPLEX                                      
 For NLP: MINOS, SNOPT, GAMS external NLP, IPOPT, FILTERSD, FILTERSQP

Solution      = 516432.781715631  best solution found during preprocessing
Best possible = 515916.864851
Absolute gap  = 515.916864631348  optca = 0.001
Relative gap  = 0.000999000998576099  optcr = 0.001
  (Note that BARON uses a different formula to compute the relative gap as
   was used for the above reported value.)


                           LOWER          LEVEL          UPPER

---- EQU CostWeek            .              .              .          

  CostWeek  Weekly production cost
GAMS 28.2.0  r750fa45 Released Aug 19, 2019 WEX-WEI x86 64bit/MS Windows                                                                                                                                                              05/27/21 22:26:21 Page 14
G e n e r a l   A l g e b r a i c   M o d e l i n g   S y s t e m
Solution Report     SOLVE bidding Using MINLP From line 160


---- EQU Transf  Transform offer price into standard normally distributed variable

         LOWER          LEVEL          UPPER

1        -0.7770        -0.7770        -0.7770      
2        -0.7770        -0.7770        -0.7770      

                           LOWER          LEVEL          UPPER

---- EQU ProbRefuse         1.0000         1.0000         1.0000      

  ProbRefuse  Probability of entire offer refusal

---- EQU ProbAcc  Probability of partial offer acceptance

         LOWER          LEVEL          UPPER

1          .              .              .          

---- EQU ProbAccLast  

         LOWER          LEVEL          UPPER

2         0.5000         0.5000         0.5000      

---- EQU Estimation  Linking factors to asked price

         LOWER          LEVEL          UPPER

1        -8.0583        -8.0583        -8.0583      
2        -8.0583        -8.0583        -8.0583      

---- EQU ascendingBids  

         LOWER          LEVEL          UPPER

2          .           126.2421        +INF         

                           LOWER          LEVEL          UPPER

---- EQU sumPRL            -INF           10.0000        10.0000      

---- EQU Cuts  

            LOWER          LEVEL          UPPER

1.1     530198.0828    533992.6543        +INF         
1.2     530059.4982    532681.7038        +INF         
1.3     529697.2583    531355.4753        +INF         
1.4     529114.8224    530027.7363        +INF         
1.5     528304.3954    528688.4834        +INF         
1.6     527284.1142    527365.0300        +INF         
1.7     526001.7485    526001.7485        +INF         
GAMS 28.2.0  r750fa45 Released Aug 19, 2019 WEX-WEI x86 64bit/MS Windows                                                                                                                                                              05/27/21 22:26:21 Page 15
G e n e r a l   A l g e b r a i c   M o d e l i n g   S y s t e m
Solution Report     SOLVE bidding Using MINLP From line 160


     EQU Cuts  

            LOWER          LEVEL          UPPER

1.8     524476.1430    524623.1592        +INF         
1.9     522707.1878    523234.9087        +INF         
1.10    520672.4500    521822.3581        +INF         
1.11    518373.8471    520394.0516        +INF         
2.1     530198.0828    541038.1849        +INF         
2.2     530059.4982    538853.2673        +INF         
2.3     529697.2583    536642.8866        +INF         
2.4     529114.8224    534429.9882        +INF         
2.5     528304.3954    532197.9000        +INF         
2.6     527284.1142    529992.1443        +INF         
2.7     526001.7485    527720.0085        +INF         
2.8     524476.1430    525422.3596        +INF         
2.9     522707.1878    523108.6089        +INF         
2.10    520672.4500    520754.3578        +INF         
2.11    518373.8471    518373.8471        +INF         

---- VAR CPRL  Total cost [EUR]

         LOWER          LEVEL          UPPER

1    530198.0828    536628.7155    545431.6202      
2    530198.0828    545431.6202    545431.6202      

---- VAR x  Transformed ask price

         LOWER          LEVEL          UPPER

1        -2.0000        -1.5723         2.0000      
2        -2.0000        -1.0425         2.0000      

---- VAR y1  Natural logarithm of price estimation factor f1

         LOWER          LEVEL          UPPER

1        -0.0961        -0.0625         0.2183      
2        -0.0961        -0.0209         0.2183      

                           LOWER          LEVEL          UPPER

---- VAR Ctot          449056.4886    516432.7817    530198.0828      
---- VAR pRefuse             .             0.0579         1.0000      

  Ctot  Weekly cost in current loop [EUR]
GAMS 28.2.0  r750fa45 Released Aug 19, 2019 WEX-WEI x86 64bit/MS Windows                                                                                                                                                              05/27/21 22:26:21 Page 16
G e n e r a l   A l g e b r a i c   M o d e l i n g   S y s t e m
Solution Report     SOLVE bidding Using MINLP From line 160


---- VAR p  

         LOWER          LEVEL          UPPER

1          .             0.0907         1.0000      
2          .             0.8514         1.0000      

---- VAR askPrice  

         LOWER          LEVEL          UPPER

1          .          2968.4597      8114.1594      
2          .          3094.7018      8114.1594      

---- VAR PRL  PRL partition for given scenario [MW]

         LOWER          LEVEL          UPPER

1          .             6.0000        10.0000      
2          .             4.0000        10.0000      


**** REPORT SUMMARY :        0     NONOPT
                             0 INFEASIBLE
                             0  UNBOUNDED
                             0     ERRORS
                             7  PROJECTED
GAMS 28.2.0  r750fa45 Released Aug 19, 2019 WEX-WEI x86 64bit/MS Windows                                                                                                                                                              05/27/21 22:26:21 Page 17
G e n e r a l   A l g e b r a i c   M o d e l i n g   S y s t e m
E x e c u t i o n


EXECUTION TIME       =        0.063 SECONDS      3 MB  28.2.0 r750fa45 WEX-WEI


USER: Small MUD - 5 User License                     S190207:0909AO-WIN
      RWTH Aachen, Aachener Verfahrenstechnik                    DC7534
      License for teaching and research at degree granting institutions


**** FILE SUMMARY

Input      U:\biddingwithnils\MINLP approach\Bidding_Master.gms
Output     U:\biddingwithnils\MINLP approach\Bidding_Master.lst
