t; nomPriceB5; nomPlPowB5; integrPriceB5; integrPlPowB5; integrT_in_B5; disagg_price_bus5; PlPowB5; disaggT_in_B5; nomPriceB10; nomPlPowB10; integrPriceB10; integrPlPowB10; integrT_in_B10; disagg_price_bus10; PlPowB10; disaggT_in_B10; nomPriceB9; nomPlPowB9; integrPriceB9; integrPlPowB9; integrT_in_B9; disagg_price_bus9; PlPowB9; disaggT_in_B9;  initFeasThres; finalFeasThres; accept_gap; iterations; CPUmaster; CPUsubproblem; CPUfeasPt; finalDetectGap; nomCongestionCost; intCongestionCost; disaggCongestionCost; Objective; nomImprovPercent; CoopPotentialPercent; nominalCost; integratedCost
1; 10.52; 35.5; 10.52; 30.4082761; 80; 10.52; 30.4082761; 80; 10.52; 97.5; 10.52; 83.515688; 80; 10.52; 83.515688; 80; 10.52; 87.5; 10.52; 74.9499764; 80; 10.52; 74.9499764; 80; 220.5; 14.4901903; 0.0001; 1378; 199.982303; 93.2306171; 0.648635077; 7.25098363e-05; 2.06173572e-10; 1.16974489e-09; -5.77476245e-10; 1808087.65; 1.40342727; 99.5321897; 1833824.04; 1807966.69
2; 10.52; 35.5; 10.52; 25.3673467; 80; 10.52; 34.6006833; 80; 10.52; 97.5; 10.52; 86.267454; 80; 10.52; 70.049451; 80; 10.52; 87.5; 10.52; 62.5251504; 80; 10.52; 69.8456325; 80; 
3; 10.52; 35.5; 10.52; 25.3673467; 80; 10.52; 34.9625787; 80; 10.52; 97.5; 10.52; 86.1018885; 80; 10.52; 70.086397; 80; 10.52; 87.5; 10.52; 62.5251504; 80; 10.52; 69.9259541; 80; 
4; 10.52; 35.5; 10.52; 30.4590709; 80; 10.52; 25.8168237; 80; 10.52; 97.5; 10.52; 82.2222902; 80; 10.52; 73.0944314; 80; 10.52; 87.5; 10.52; 63.2421076; 80; 10.52; 77.8988177; 80; 
5; 10.52; 35.5; 10.52; 35.5000005; 80; 10.52; 26.1641499; 80; 10.52; 97.5; 10.52; 85.9018929; 80; 10.52; 91.9160913; 80; 10.52; 87.5; 10.52; 75.7849795; 80; 10.52; 78.6965289; 80; 
6; 10.52; 35.5; 10.52; 30.4082764; 80; 10.52; 27.893525; 80; 10.52; 97.5; 10.52; 90.9381052; 80; 10.52; 111.749478; 80; 10.52; 87.5; 10.52; 87.5000013; 80; 10.52; 69.8376624; 80; 
7; 10.52; 35.5; 10.52; 25.3673467; 80; 10.52; 27.3506705; 80; 10.52; 97.5; 10.52; 86.9966659; 80; 10.52; 103.150418; 80; 10.52; 87.5; 10.52; 86.7543696; 80; 10.52; 69.2515766; 80; 
8; 10.52; 35.5; 10.52; 30.4590709; 80; 10.52; 28.9559939; 80; 10.52; 97.5; 10.52; 83.6551946; 80; 10.52; 79.9517634; 80; 10.52; 87.5; 10.52; 75.2822864; 80; 10.52; 81.1230771; 80; 
9; 10.52; 35.5; 10.52; 30.4082764; 80; 10.52; 30.2714285; 80; 10.52; 97.5; 10.52; 83.5156887; 80; 10.52; 69.7567394; 80; 10.52; 87.5; 10.52; 69.8502314; 80; 10.52; 84.3803111; 80; 
10; 10.52; 35.5; 10.52; 25.3673467; 80; 10.52; 28.0422407; 80; 10.52; 97.5; 10.52; 69.6708819; 80; 10.52; 69.7275684; 80; 10.52; 87.5; 10.52; 68.7279064; 80; 10.52; 66.6306085; 80; 
11; 15.4738462; 35.5; 14.59; 25.3673467; 80; 14.9158106; 26.4381672; 80; 15.4738462; 97.5; 14.59; 69.6708819; 80; 14.9158106; 69.6843139; 80; 15.4738462; 87.5; 14.59; 62.5251504; 80; 14.9158106; 62.9048812; 80; 
12; 15.4738462; 35.5; 14.9408729; 25.3673467; 80; 14.9158106; 25.3673467; 80; 15.4738462; 97.5; 14.9408729; 69.6708819; 80; 14.9158106; 69.67698; 80; 15.4738462; 87.5; 14.9408729; 62.5251504; 80; 14.9158106; 62.756581; 80; 
13; 15.4738462; 35.5; 14.9408729; 25.3673467; 80; 14.9158106; 25.3673467; 80; 15.4738462; 97.5; 14.9408729; 69.6708819; 80; 14.9158106; 69.6769191; 80; 15.4738462; 87.5; 14.9408729; 62.5251504; 80; 14.9158106; 62.7302683; 80; 
14; 15.4738462; 35.5; 14.9408729; 25.3673467; 80; 14.9158106; 25.9539764; 80; 15.4738462; 97.5; 14.9408729; 69.6708819; 80; 14.9158106; 69.6708819; 80; 15.4738462; 87.5; 14.9408729; 62.5251504; 80; 14.9158106; 62.7282221; 80; 
15; 15.4738462; 35.5; 14.9408729; 25.3673467; 80; 14.9158106; 25.9481243; 80; 15.4738462; 97.5; 14.9408729; 69.6708819; 80; 14.9158106; 69.6820422; 80; 15.4738462; 87.5; 14.9408729; 62.5251504; 80; 14.9158106; 62.5251504; 80; 
16; 15.4738462; 35.5; 14.9408729; 25.3673467; 80; 14.9158106; 25.3673467; 80; 15.4738462; 97.5; 14.9408729; 69.6708819; 80; 14.9158106; 69.699216; 80; 15.4738462; 87.5; 14.9408729; 62.5251504; 80; 14.9158106; 62.6399426; 80; 
17; 15.4738462; 35.5; 14.9408729; 25.3673467; 80; 14.9158106; 25.5690745; 80; 15.4738462; 97.5; 14.9408729; 69.6708819; 80; 14.9158106; 69.6879946; 80; 15.4738462; 87.5; 14.9408729; 62.5251504; 80; 14.9158106; 62.6387974; 80; 
18; 15.4738462; 35.5; 14.9408729; 25.3673467; 80; 14.9158106; 25.7022226; 80; 15.4738462; 97.5; 14.9408729; 69.6708819; 80; 14.9158106; 69.6948158; 80; 15.4738462; 87.5; 14.9408729; 62.5251504; 80; 14.9158106; 62.5251504; 80; 
19; 15.4738462; 35.5; 14.9408729; 25.3673467; 80; 14.9158106; 25.501159; 80; 15.4738462; 97.5; 14.9408729; 69.6708819; 80; 14.9158106; 69.694577; 80; 15.4738462; 87.5; 14.9408729; 62.5251504; 80; 14.9158106; 62.9668428; 80; 
20; 15.4738462; 35.5; 14.9408729; 25.3673467; 80; 14.9158106; 25.7402195; 80; 15.4738462; 97.5; 14.9408729; 69.6708819; 80; 14.9158106; 69.6990556; 80; 15.4738462; 87.5; 14.9408729; 62.5251504; 80; 14.9158106; 63.0218889; 80; 
21; 15.4738462; 35.5; 14.9408729; 25.3673467; 80; 14.9158106; 25.7364998; 80; 15.4738462; 97.5; 14.9408729; 69.6708819; 80; 14.9158106; 69.7083207; 80; 15.4738462; 87.5; 14.9408729; 62.5251504; 80; 14.9158106; 62.6714753; 80; 
22; 15.4738462; 35.5; 14.9408729; 25.3673467; 80; 14.9158106; 25.3826553; 80; 15.4738462; 97.5; 14.9408729; 69.6708819; 80; 14.9158106; 69.7094642; 80; 15.4738462; 87.5; 14.9408729; 62.5251504; 80; 14.9158106; 62.6117435; 80; 
23; 15.4738462; 35.5; 14.9408729; 25.3673467; 80; 14.9158106; 25.3825026; 80; 15.4738462; 97.5; 14.9408729; 69.6708819; 80; 14.9158106; 69.6997227; 80; 15.4738462; 87.5; 14.9408729; 62.5251504; 80; 14.9158106; 62.5251504; 80; 
24; 15.4738462; 35.5; 14.9408729; 25.3673467; 80; 14.9158106; 25.5755689; 80; 15.4738462; 97.5; 14.9408729; 69.6708819; 80; 14.9158106; 69.6708819; 80; 15.4738462; 87.5; 14.9408729; 62.5251504; 80; 14.9158106; 63.1371898; 80; 
25; 18.0061538; 35.5; 14.7493261; 25.3673467; 80; 14.7493261; 26.1205403; 80; 18.0061538; 97.5; 14.7493261; 69.6708819; 80; 14.7493261; 69.6798211; 80; 18.0061538; 87.5; 14.7493261; 62.5251504; 80; 14.7493261; 63.1310841; 80; 
26; 16; 35.5; 14.7493261; 25.3673467; 80; 14.7493261; 26.0448337; 80; 16; 97.5; 14.7493261; 69.6708819; 80; 14.7493261; 69.679732; 80; 16; 87.5; 14.7493261; 62.5251504; 80; 14.7493261; 62.5251504; 80; 
27; 16; 35.5; 14.7493261; 25.3673467; 80; 14.7493261; 25.5018867; 80; 16; 97.5; 14.7493261; 69.6708819; 80; 14.7493261; 69.6708819; 80; 16; 87.5; 14.7493261; 62.5251504; 80; 14.7493261; 62.5251504; 80; 
28; 16; 35.5; 14.7493261; 25.3673467; 80; 14.7493261; 25.6946033; 80; 16; 97.5; 14.7493261; 69.6708819; 80; 14.7493261; 69.6708819; 80; 16; 87.5; 14.7493261; 62.5251504; 80; 14.7493261; 62.70296; 80; 
29; 16; 35.5; 14.7493261; 25.3673467; 80; 14.7493261; 25.6913386; 80; 16; 97.5; 14.7493261; 69.6708819; 80; 14.7493261; 69.7027927; 80; 16; 87.5; 14.7493261; 62.5251504; 80; 14.7493261; 62.7011862; 80; 
30; 16; 35.5; 14.7493261; 25.3673467; 80; 14.7493261; 25.3673467; 80; 16; 97.5; 14.7493261; 69.6708819; 80; 14.7493261; 69.7217494; 80; 16; 87.5; 14.7493261; 62.5251504; 80; 14.7493261; 62.815824; 80; 
31; 16; 35.5; 14.7493261; 25.3673467; 80; 14.7493261; 25.3673467; 80; 16; 97.5; 14.7493261; 69.6708819; 80; 14.7493261; 69.7208179; 80; 16; 87.5; 14.7493261; 62.5251504; 80; 14.7493261; 62.8129242; 80; 
32; 16; 35.5; 14.7493261; 25.3673467; 80; 14.7493261; 25.7927078; 80; 16; 97.5; 14.7493261; 69.6708819; 80; 14.7493261; 69.7014273; 80; 16; 87.5; 14.7493261; 62.5251504; 80; 14.7493261; 62.7562802; 80; 
33; 16; 35.5; 14.7493261; 25.3673467; 80; 14.7493261; 25.7884644; 80; 16; 97.5; 14.7493261; 69.6708819; 80; 14.7493261; 69.6708819; 80; 16; 87.5; 14.7493261; 62.5251504; 80; 14.7493261; 62.9800378; 80; 
34; 16; 35.5; 14.7493261; 25.3673467; 80; 14.7493261; 25.3673467; 80; 16; 97.5; 14.7493261; 69.6708819; 80; 14.7493261; 69.6708819; 80; 16; 87.5; 14.7493261; 62.5251504; 80; 14.7493261; 63.15418; 80; 
35; 16; 35.5; 14.7493261; 25.3673467; 80; 14.7493261; 25.4048833; 80; 16; 97.5; 14.7493261; 69.6708819; 80; 14.7493261; 69.6997514; 80; 16; 87.5; 14.7493261; 62.5251504; 80; 14.7493261; 62.9263293; 80; 
36; 20.7; 35.5; 17.2506739; 25.3673467; 80; 17.2506739; 25.4602152; 80; 20.7; 97.5; 17.2506739; 69.6708819; 80; 17.2506739; 69.6994634; 80; 20.7; 87.5; 17.2506739; 62.5251504; 80; 17.2506739; 62.6627274; 80; 
37; 20.7; 35.5; 17.2506739; 25.3673467; 80; 17.2506739; 25.4629695; 80; 20.7; 97.5; 17.2506739; 69.6708819; 80; 17.2506739; 69.6708819; 80; 20.7; 87.5; 17.2506739; 62.5251504; 80; 17.2506739; 62.661355; 80; 
38; 20.7; 35.5; 17.2506739; 25.3673467; 80; 17.2506739; 25.4074151; 80; 20.7; 97.5; 17.2506739; 69.6708819; 80; 17.2506739; 69.6708819; 80; 20.7; 87.5; 17.2506739; 62.5251504; 80; 17.2506739; 62.7370678; 80; 
39; 20.7; 35.5; 17.2506739; 25.3673467; 80; 17.2506739; 25.3673467; 80; 20.7; 97.5; 17.2506739; 69.6708819; 80; 17.2506739; 69.6708819; 80; 20.7; 87.5; 17.2506739; 62.5251504; 80; 17.2506739; 62.7349538; 80; 
40; 20.7; 35.5; 17.2506739; 25.3673467; 80; 17.2506739; 26.2369103; 80; 20.7; 97.5; 17.2506739; 69.6708819; 80; 17.2506739; 69.6708819; 80; 20.7; 87.5; 17.2506739; 62.5251504; 80; 17.2506739; 62.5251504; 80; 
41; 20.7; 35.5; 17.2506739; 25.3673467; 80; 17.2506739; 26.2282356; 80; 20.7; 97.5; 17.2506739; 69.6708819; 80; 17.2506739; 69.6708819; 80; 20.7; 87.5; 17.2506739; 62.5251504; 80; 17.2506739; 62.5251504; 80; 
42; 20.7; 35.5; 17.2506739; 25.3673467; 80; 17.2506739; 25.614251; 80; 20.7; 97.5; 17.2506739; 69.6708819; 80; 17.2506739; 69.7219882; 80; 20.7; 87.5; 17.2506739; 62.5251504; 80; 17.2506739; 62.5251504; 80; 
43; 6.52; 35.5; 17.2506739; 28.4356364; 80; 17.2506739; 26.5344487; 80; 6.52; 97.5; 17.2506739; 75.8311002; 80; 17.2506739; 85.0731897; 80; 6.52; 87.5; 17.2506739; 75.0751747; 80; 17.2506739; 68.2013713; 80; 
44; 5.47; 35.5; 7.7994884; 33.4967516; 80; 7.7994884; 29.4873751; 80; 5.47; 97.5; 7.7994884; 75.7696466; 80; 7.7994884; 87.5541478; 80; 5.47; 87.5; 7.7994884; 88.653123; 80; 7.7994884; 81.5272368; 80; 
45; 5.47; 35.5; 9.12220865; 35.5000005; 80; 9.12220865; 32.2092431; 80; 5.47; 97.5; 9.12220865; 97.8709375; 80; 9.12220865; 102.26194; 80; 5.47; 87.5; 9.12220865; 98.4548961; 80; 9.12220865; 97.4236347; 80; 
46; 5.47; 35.5; 7.7994884; 38.4732973; 80; 7.7994884; 39.3162086; 78.4190775; 5.47; 97.5; 7.7994884; 119.056966; 80; 7.7994884; 118.524494; 79.9570689; 5.47; 87.5; 7.7994884; 101.677865; 80; 7.7994884; 101.703859; 79.9015246; 
47; 5.47; 35.5; 7.7994884; 45.4219191; 75; 7.7994884; 47.3220823; 75; 5.47; 97.5; 7.7994884; 122.914848; 75; 7.7994884; 120.772382; 75; 5.47; 87.5; 7.7994884; 108.115716; 75; 7.7994884; 108.694451; 75; 
48; 5.47; 35.5; 5.47; 48.9678436; 75; 5.47; 48.8972683; 75; 5.47; 97.5; 5.47; 133.388661; 75; 5.47; 133.489293; 75; 5.47; 87.5; 5.47; 119.78279; 75; 5.47; 119.835366; 75; 
49; 5.47; 35.5; 5.47; 48.5605067; 75; 5.47; 48.8034757; 75; 5.47; 97.5; 5.47; 133.463747; 75; 5.47; 133.518333; 75; 5.47; 87.5; 5.47; 119.849398; 75; 5.47; 120.043874; 75; 
50; 5.47; 35.5; 5.47; 48.5721119; 75; 5.47; 48.1391571; 75; 5.47; 97.5; 5.47; 133.494817; 75; 5.47; 133.560609; 75; 5.47; 87.5; 5.47; 119.876864; 75; 5.47; 119.856289; 75.007704; 
51; 5.47; 35.5; 5.47; 48.5768179; 75; 5.47; 48.3374911; 75; 5.47; 97.5; 5.47; 133.507081; 75; 5.47; 133.564346; 75.0010593; 5.47; 87.5; 5.47; 119.887187; 75; 5.47; 119.784591; 75; 
52; 5.47; 35.5; 5.47; 48.5768521; 75; 5.47; 48.7406737; 75; 5.47; 97.5; 5.47; 133.50644; 75; 5.47; 133.564509; 75; 5.47; 87.5; 5.47; 119.886112; 75; 5.47; 119.775073; 75; 
53; 5.47; 35.5; 5.47; 48.5747188; 75; 5.47; 48.0857291; 75.374742; 5.47; 97.5; 5.47; 133.499944; 75; 5.47; 133.545247; 75.0056737; 5.47; 87.5; 5.47; 119.879756; 75; 5.47; 119.546306; 75; 
54; 5.47; 35.5; 5.47; 48.5709837; 75; 5.47; 48.1388268; 75; 5.47; 97.5; 5.47; 133.489021; 75; 5.47; 133.534076; 75; 5.47; 87.5; 5.47; 119.869424; 75; 5.47; 119.719439; 75; 
55; 5.47; 35.5; 5.47; 48.56597; 75; 5.47; 48.2228855; 75.3933492; 5.47; 97.5; 5.47; 133.474592; 75; 5.47; 133.518962; 75; 5.47; 87.5; 5.47; 119.85595; 75; 5.47; 120.004078; 75; 
56; 5.47; 35.5; 5.47; 48.5598542; 75; 5.47; 47.832689; 75.0194206; 5.47; 97.5; 5.47; 133.457141; 75; 5.47; 133.47172; 75; 5.47; 87.5; 5.47; 119.839768; 75; 5.47; 119.798192; 75.0155804; 
57; 5.47; 35.5; 5.47; 48.5527231; 75; 5.47; 48.3481239; 75; 5.47; 97.5; 5.47; 133.436906; 75; 5.47; 133.478494; 75; 5.47; 87.5; 5.47; 119.821091; 75; 5.47; 119.748088; 75.0137458; 
58; 5.47; 35.5; 5.47; 48.5446211; 75; 5.47; 48.5775081; 75.1042181; 5.47; 97.5; 5.47; 133.41401; 75; 5.47; 133.486111; 75; 5.47; 87.5; 5.47; 119.800029; 75; 5.47; 119.756524; 75; 
59; 5.47; 35.5; 5.47; 48.5355727; 75; 5.47; 48.2709385; 75.1607005; 5.47; 97.5; 5.47; 133.388519; 75; 5.47; 133.447699; 75; 5.47; 87.5; 5.47; 119.776643; 75; 5.47; 119.653839; 75; 
60; 5.47; 35.5; 5.47; 48.5255931; 75; 5.47; 48.3615737; 75; 5.47; 97.5; 5.47; 133.360475; 75; 5.47; 133.408502; 75.0033621; 5.47; 87.5; 5.47; 119.750969; 75; 5.47; 119.627705; 75; 
61; 5.47; 35.5; 5.47; 48.5146929; 75; 5.47; 47.8991617; 75.6393353; 5.47; 97.5; 5.47; 133.329907; 75; 5.47; 133.377622; 75; 5.47; 87.5; 5.47; 119.723034; 75; 5.47; 119.738285; 75; 
62; 5.47; 35.5; 5.47; 48.5028807; 75; 5.47; 47.7857655; 75.1182608; 5.47; 97.5; 5.47; 133.296839; 75; 5.47; 133.349263; 75; 5.47; 87.5; 5.47; 119.692859; 75; 5.47; 119.678353; 75; 
63; 5.47; 35.5; 5.47; 48.490164; 75; 5.47; 48.1739762; 75.0817731; 5.47; 97.5; 5.47; 133.261292; 75; 5.47; 133.314969; 75; 5.47; 87.5; 5.47; 119.660462; 75; 5.47; 119.635385; 75; 
64; 5.47; 35.5; 5.47; 48.4765499; 75; 5.47; 48.3340641; 75; 5.47; 97.5; 5.47; 133.223284; 75; 5.47; 133.278717; 75.0004995; 5.47; 87.5; 5.47; 119.625861; 75; 5.47; 119.637798; 75; 
65; 5.47; 35.5; 5.47; 48.4620452; 75; 5.47; 48.492711; 75; 5.47; 97.5; 5.47; 133.182835; 75; 5.47; 133.216098; 75.0069928; 5.47; 87.5; 5.47; 119.589073; 75; 5.47; 119.51265; 75; 
66; 5.47; 35.5; 5.47; 48.4466564; 75; 5.47; 48.4339267; 75; 5.47; 97.5; 5.47; 133.139962; 75; 5.47; 133.175324; 75; 5.47; 87.5; 5.47; 119.550113; 75; 5.47; 119.266915; 75; 
67; 5.47; 35.5; 5.47; 48.4303901; 75; 5.47; 48.1448063; 75; 5.47; 97.5; 5.47; 133.094684; 75; 5.47; 133.145309; 75.0016885; 5.47; 87.5; 5.47; 119.508998; 75; 5.47; 119.408968; 75; 
68; 5.47; 35.5; 5.47; 48.4132528; 75; 5.47; 48.2569874; 75; 5.47; 97.5; 5.47; 133.047018; 75; 5.47; 133.088546; 75.0030385; 5.47; 87.5; 5.47; 119.465743; 75; 5.47; 119.569202; 75; 
69; 5.47; 35.5; 5.47; 48.3952508; 75; 5.47; 48.5353212; 75; 5.47; 97.5; 5.47; 132.996981; 75; 5.47; 133.039752; 75.0011013; 5.47; 87.5; 5.47; 119.420365; 75; 5.47; 119.038595; 75.024497; 
70; 5.47; 35.5; 5.47; 48.3763906; 75; 5.47; 48.0788676; 75.3171665; 5.47; 97.5; 5.47; 132.944592; 75; 5.47; 132.994873; 75; 5.47; 87.5; 5.47; 119.372879; 75; 5.47; 119.141934; 75; 
71; 5.47; 35.5; 5.47; 48.3566783; 75; 5.47; 48.0140692; 75.0528605; 5.47; 97.5; 5.47; 132.889866; 75; 5.47; 132.942427; 75; 5.47; 87.5; 5.47; 119.3233; 75; 5.47; 119.461526; 75; 
72; 5.47; 35.5; 5.47; 48.3361202; 75; 5.47; 47.9467307; 75; 5.47; 97.5; 5.47; 132.832823; 75; 5.47; 132.865268; 75; 5.47; 87.5; 5.47; 119.271643; 75; 5.47; 119.254344; 75; 
73; 5.47; 35.5; 5.47; 48.3147227; 75; 5.47; 48.1394258; 75; 5.47; 97.5; 5.47; 132.773478; 75; 5.47; 132.804245; 75; 5.47; 87.5; 5.47; 119.217925; 75; 5.47; 119.010108; 75; 
74; 5.47; 35.5; 5.47; 48.2924917; 75; 5.47; 48.4581228; 75; 5.47; 97.5; 5.47; 132.711848; 75; 5.47; 132.753439; 75; 5.47; 87.5; 5.47; 119.162159; 75; 5.47; 118.71115; 75; 
75; 5.47; 35.5; 5.47; 48.2694334; 75; 5.47; 47.9861505; 75.2895078; 5.47; 97.5; 5.47; 132.64795; 75; 5.47; 132.696949; 75; 5.47; 87.5; 5.47; 119.104362; 75; 5.47; 118.802377; 75; 
76; 5.47; 35.5; 7.88; 48.245554; 75; 8.11; 47.9749044; 75; 5.47; 97.5; 7.88; 132.581801; 75; 8.11; 132.603935; 75; 5.47; 87.5; 7.88; 119.044548; 75; 8.11; 119.08658; 75; 
77; 5.47; 35.5; 9.21975; 36.7430958; 75; 9.2853; 38.0161912; 80; 5.47; 97.5; 9.21975; 123.9559; 78.3031842; 9.2853; 132.505732; 75.0152947; 5.47; 87.5; 9.21975; 118.982731; 75; 9.2853; 109.254596; 79.218451; 
78; 5.47; 35.5; 9.21975; 37.4164075; 80; 10.86; 27.6352854; 80; 5.47; 97.5; 9.21975; 92.4452892; 80; 10.86; 125.481575; 75; 5.47; 87.5; 9.21975; 104.024419; 75; 10.86; 80.8798376; 80; 
79; 5.47; 35.5; 10.47075; 37.2962075; 80; 9.2853; 27.6182895; 80; 5.47; 97.5; 10.47075; 73.1748976; 80; 9.2853; 119.022774; 78.7465596; 5.47; 87.5; 10.47075; 99.3610486; 80; 9.2853; 63.2858823; 80; 
80; 11.8286604; 35.5; 10.7833333; 25.3673467; 80; 10.86; 41.1881505; 76.3301565; 11.8286604; 97.5; 10.7833333; 80.5698201; 80; 10.86; 95.7475587; 80; 11.8286604; 87.5; 10.7833333; 85.8326115; 80; 10.86; 63.5260893; 80; 
81; 11.8286604; 35.5; 10.7833333; 36.6875877; 80; 9.2853; 42.8354766; 80; 11.8286604; 97.5; 10.7833333; 84.6971025; 80; 9.2853; 82.3419319; 75; 11.8286604; 87.5; 10.7833333; 86.9282651; 80; 9.2853; 63.2303392; 80; 
82; 11.8286604; 35.5; 10.7833333; 36.5746583; 80; 10.86; 28.3584381; 80; 11.8286604; 97.5; 10.7833333; 77.2648243; 80; 10.86; 97.4594037; 75; 11.8286604; 87.5; 10.7833333; 86.6848224; 80; 10.86; 62.9804277; 80; 
83; 10.1135047; 35.5; 10.7833333; 35.2771231; 80; 10.6988; 40.1226411; 75.7778587; 10.1135047; 97.5; 10.7833333; 94.8501935; 80; 10.6988; 114.514277; 75; 10.1135047; 87.5; 10.7833333; 87.0592655; 80; 10.6988; 62.6444565; 80; 
84; 10.1135047; 35.5; 10.7833333; 41.9996844; 80; 10.86; 42.7657624; 80; 10.1135047; 97.5; 10.7833333; 120.074435; 76.883378; 10.86; 124.025408; 75; 10.1135047; 87.5; 10.7833333; 86.8145159; 80; 10.86; 64.2990527; 78.303468; 
85; 10.1135047; 35.5; 10.7833333; 32.1207171; 80; 9.2853; 30.5884812; 80; 10.1135047; 97.5; 10.7833333; 115.797427; 80; 9.2853; 102.984961; 75; 10.1135047; 87.5; 10.7833333; 87.2146296; 80; 9.2853; 101.654124; 75; 
86; 10.1135047; 35.5; 9.21975; 35.4086019; 80; 10.86; 29.1426361; 80; 10.1135047; 97.5; 9.21975; 100.636446; 80; 10.86; 77.1060563; 77.9487177; 10.1135047; 87.5; 9.21975; 86.9683302; 80; 10.86; 130.938662; 75; 
87; 13.32; 35.5; 10.7833333; 35.3084314; 80; 10.86; 27.9622858; 80; 13.32; 97.5; 10.7833333; 96.1020431; 80; 10.86; 69.9469964; 80; 13.32; 87.5; 10.7833333; 75.0751747; 80; 10.86; 108.898586; 75; 
88; 13.32; 35.5; 10.7833333; 25.3673467; 80; 10.86; 27.4564672; 80; 13.32; 97.5; 10.7833333; 89.1333377; 80; 10.86; 70.1952113; 80; 13.32; 87.5; 10.7833333; 74.949977; 80; 10.86; 110.468086; 75; 
89; 13.32; 35.5; 10.7833333; 36.9780321; 80; 10.86; 28.7894893; 75.321525; 13.32; 97.5; 10.7833333; 72.9973266; 80; 10.86; 74.7694211; 80; 13.32; 87.5; 10.7833333; 63.7337304; 80; 10.86; 94.9074378; 75; 
90; 13.32; 35.5; 10.7833333; 36.8622052; 80; 10.86; 41.9570638; 75; 13.32; 97.5; 10.7833333; 101.620291; 80; 10.86; 78.9564308; 80; 13.32; 87.5; 10.7833333; 76.2716979; 80; 10.86; 62.8136963; 80; 
91; 13.32; 35.5; 10.7833333; 30.4590709; 80; 10.86; 52.5505215; 75; 13.32; 97.5; 10.7833333; 101.301567; 80; 10.86; 79.7381112; 75.2937476; 13.32; 87.5; 10.7833333; 74.949977; 80; 10.86; 62.8108178; 80; 
92; 13.32; 35.5; 10.7833333; 30.4082764; 80; 10.86; 50.0666438; 75; 13.32; 97.5; 10.7833333; 89.5428247; 80; 10.86; 77.2363638; 80; 13.32; 87.5; 10.7833333; 75.0751747; 80; 10.86; 69.8688217; 80; 
93; 13.32; 35.5; 10.7833333; 36.7041445; 80; 10.86; 39.1402641; 80; 13.32; 97.5; 10.7833333; 89.3445844; 80; 10.86; 85.4346268; 75; 13.32; 87.5; 10.7833333; 74.949977; 80; 10.86; 70.5290808; 80; 
94; 13.32; 35.5; 10.7833333; 41.682774; 80; 10.86; 27.7030112; 80; 13.32; 97.5; 10.7833333; 83.6551946; 80; 10.86; 84.2176655; 80; 13.32; 87.5; 10.7833333; 68.4847856; 80; 10.86; 100.186757; 75; 
95; 13.32; 35.5; 10.7833333; 30.4082764; 80; 10.86; 25.5696174; 80; 13.32; 97.5; 10.7833333; 83.5156887; 80; 10.86; 70.6252778; 80; 13.32; 87.5; 10.7833333; 68.425333; 80; 10.86; 99.1272931; 80; 
96; 13.32; 35.5; 20.93; 40.5774556; 75.2871872; 20.7; 34.7012033; 80; 13.32; 97.5; 20.93; 111.445124; 75; 20.7; 111.175735; 75; 13.32; 87.5; 20.93; 100.014855; 75; 20.7; 97.0348905; 75; 
