optimal value of nominal OPF is: 3.16569e+06

Congested lines in nominal operation are: 
7 to 8 at t13.
7 to 8 at t14.
7 to 8 at t15.
7 to 8 at t16.
7 to 8 at t17.
7 to 8 at t18.
7 to 8 at t19.
7 to 8 at t20.
7 to 8 at t21.
7 to 8 at t22.
7 to 8 at t23.
7 to 8 at t24.
7 to 8 at t25.
7 to 8 at t26.
7 to 8 at t27.
7 to 8 at t28.
7 to 8 at t29.
7 to 8 at t30.
7 to 8 at t31.
7 to 8 at t32.


optimal DR to nominal grid planning prices of bus 7 has cost of: 22995.4
optimal DR to nominal grid planning prices of bus 6 has cost of: 46499.2
optimal DR to nominal grid planning prices of bus 10 has cost of: 66671.7
optimal DR to nominal grid planning prices of bus 16 has cost of: 34190.6
optimal DR to nominal grid planning prices of bus 2 has cost of: 33164.9
optimal DR to nominal grid planning prices of bus 1 has cost of: 36925.8
optimal DR to nominal grid planning prices of bus 20 has cost of: 43764
optimal DR to nominal grid planning prices of bus 18 has cost of: 113855
optimal DR to nominal grid planning prices of bus 9 has cost of: 59833.6
optimal DR to nominal grid planning prices of bus 13 has cost of: 90605.1
831 MW flexible load is cooperating and the initial threshold tau is 1662 MW
maxIters: 1000, primary/secondary strategy: 4/1, acceptable gap: 0.0001
it 50done, CWsubProb on bus 7 has objective 0.60292, and distance 1279.3, CWsubProb on bus 6 has objective 0.7392, and distance 1717.7, CWsubProb on bus 10 has objective 0.7282, and distance 2203.3, CWsubProb on bus 16 has objective 0.59811, and distance 960.31, CWsubProb on bus 2 has objective 0.59811, and distance 995.08, CWsubProb on bus 1 has objective 0.59811, and distance 1072, CWsubProb on bus 20 has objective 0.59811, and distance 1287.8, CWsubProb on bus 18 has objective 0.74196, and distance 3494.7, CWsubProb on bus 9 has objective 0.59811, and distance 1668.7, CWsubProb on bus 13 has objective 0.64845, and distance 2704.7, master obj (lb of Decomp) was: 1.8944e+06
it 100done, CWsubProb on bus 7 has objective 0.20852, and distance 338.04, CWsubProb on bus 6 has objective 0.502, and distance 989.96, CWsubProb on bus 10 has objective 0.26448, and distance 721.44, CWsubProb on bus 16 has objective 0.2637, and distance 392.71, CWsubProb on bus 2 has objective 0.24926, and distance 344.64, CWsubProb on bus 1 has objective 0.59811, and distance 928.63, CWsubProb on bus 20 has objective 0.22164, and distance 389.46, CWsubProb on bus 18 has objective 0.22953, and distance 1021.1, CWsubProb on bus 9 has objective 0.18586, and distance 463.82, CWsubProb on bus 13 has objective 0.098433, and distance 357.23, master obj (lb of Decomp) was: 1.8948e+06
iteration 135, culm. feasible Gap is 1.62151e+03 MW, which is below 1.66200e+03 MW (current tau)
detect. Gap: 7.10955e-04, ub computation returns status2.
it 150done, CWsubProb on bus 7 has objective 0.081296, and distance 136.56, CWsubProb on bus 6 has objective 0.13947, and distance 244.39, CWsubProb on bus 10 has objective 0.091558, and distance 239.82, CWsubProb on bus 16 has objective 0.072564, and distance 96.31, CWsubProb on bus 2 has objective 0.11879, and distance 150.15, CWsubProb on bus 1 has objective 0.072646, and distance 105.27, CWsubProb on bus 20 has objective 0.072591, and distance 124.52, CWsubProb on bus 18 has objective 0.024395, and distance 102.3, CWsubProb on bus 9 has objective 0.080487, and distance 192.56, CWsubProb on bus 13 has objective 0.055849, and distance 204.4, master obj (lb of Decomp) was: 1.8951e+06
iteration 177, culm. feasible Gap is 9.39310e+02 MW, which is below 9.88890e+02 MW (current tau)
detect. Gap: 3.35646e-04, ub computation returns status2.
it 200done, CWsubProb on bus 7 has objective 0.04341, and distance 71.173, CWsubProb on bus 6 has objective 0.07081, and distance 128.91, CWsubProb on bus 10 has objective 0.084949, and distance 223.41, CWsubProb on bus 16 has objective 0.044735, and distance 57.288, CWsubProb on bus 2 has objective 0.076475, and distance 94.704, CWsubProb on bus 1 has objective 0.059012, and distance 78.637, CWsubProb on bus 20 has objective 0.10725, and distance 176.05, CWsubProb on bus 18 has objective 0.014635, and distance 65.85, CWsubProb on bus 9 has objective 0.095717, and distance 222.83, CWsubProb on bus 13 has objective 0.048042, and distance 168.45, master obj (lb of Decomp) was: 1.8952e+06
iteration 221, culm. feasible Gap is 4.94715e+02 MW, which is below 5.88390e+02 MW (current tau)
detect. Gap: 2.48954e-04, ub computation returns status2.
it 250done, CWsubProb on bus 7 has objective 0.01612, and distance 27.964, CWsubProb on bus 6 has objective 0.030936, and distance 57.992, CWsubProb on bus 10 has objective 0.014643, and distance 37.396, CWsubProb on bus 16 has objective 0.069495, and distance 89.819, CWsubProb on bus 2 has objective 0.039788, and distance 47.811, CWsubProb on bus 1 has objective 0.017387, and distance 25.665, CWsubProb on bus 20 has objective 0.037128, and distance 64.153, CWsubProb on bus 18 has objective 0.00013512, and distance 0.58849, CWsubProb on bus 9 has objective 0.014569, and distance 31.718, CWsubProb on bus 13 has objective 0.018627, and distance 65.996, master obj (lb of Decomp) was: 1.8952e+06
iteration 268, culm. feasible Gap is 3.20021e+02 MW, which is below 3.50092e+02 MW (current tau)
detect. Gap: 1.07795e-04, ub computation returns status2.
iteration 269, culm. feasible Gap is 2.89128e+02 MW, which is below 3.50092e+02 MW (current tau)
detect. Gap: 1.02396e-04, ub computation returns status2.
iteration 275, culm. feasible Gap is 3.17382e+02 MW, which is below 3.50092e+02 MW (current tau)
detect. Gap: 1.09379e-04, ub computation returns status2.
iteration 284, culm. feasible Gap is 2.99220e+02 MW, which is below 3.50092e+02 MW (current tau)
detect. Gap: 1.02148e-04, ub computation returns status2.
iteration 295, culm. feasible Gap is 2.66135e+02 MW, which is below 3.50092e+02 MW (current tau)
detect. Gap: 8.29933e-05, ub computation returns status2.
breaking the loop due to sufficently accurate feasible point in it295!
done, masterPplant and accepted solution are: 
bus 7: 
53.535; 53.536
44.661; 44.661
44.661; 44.661
59.704; 59.704
59.554; 59.554
44.661; 44.661
44.661; 44.661
44.661; 44.661
44.661; 44.661
44.661; 44.661
44.661; 44.661
44.661; 44.661
44.661; 44.661
44.661; 44.661
44.661; 44.661
44.661; 44.661
44.661; 44.661
44.661; 44.661
44.661; 44.661
44.661; 44.661
44.661; 44.661
44.661; 44.661
44.661; 44.661
44.661; 44.661
44.661; 44.661
44.661; 44.661
44.661; 44.661
44.661; 44.661
44.661; 44.661
44.661; 44.661
44.661; 44.661
44.661; 44.661
44.661; 44.661
44.661; 44.661
44.661; 44.661
44.661; 44.661
44.661; 44.661
44.661; 44.661
44.661; 44.661
44.661; 44.661
64.714; 64.714
77.395; 77.425
67.285; 68.749
58.008; 58.008
62.394; 62.394
64.231; 64.231
64.7; 64.7
71.433; 71.433
74.525; 74.525
75.935; 75.935
75.663; 75.663
77.049; 77.049
73.827; 73.827
79.803; 79.803
85.39; 85.39
86.538; 86.538
87.743; 86.548
86.402; 86.402
86.355; 86.452
86.624; 86.559
86.842; 86.494
86.461; 86.481
86.498; 86.466
86.531; 86.449
86.281; 86.352
86.337; 86.337
86.407; 86.407
86.573; 86.379
86.301; 86.301
86.132; 86.293
86.437; 86.303
73.6; 73.6
79.464; 79.54
92.183; 91.945
86.207; 86.093
85.671; 85.671
85.422; 85.422
64.95; 65.014
71.439; 71.439
71.172; 71.172
62.324; 62.499
88.926; 88.926
91.776; 91.501
85.164; 85.374
85.357; 85.357
65.245; 65.245
44.661; 44.964
44.661; 44.661
54.805; 54.805
54.703; 54.703
44.661; 44.661
44.661; 44.661
44.661; 44.661
44.661; 44.661
44.661; 44.661
71.439; 71.439

bus 6: 
58.246; 58.247
48.591; 48.591
48.591; 48.591
48.591; 48.591
48.591; 48.591
48.591; 48.591
48.591; 48.591
48.591; 48.591
48.591; 48.591
48.591; 48.591
48.591; 48.591
48.591; 48.591
48.591; 48.591
48.591; 48.591
48.591; 48.591
48.591; 48.591
48.591; 48.591
48.591; 48.591
48.591; 48.591
48.591; 48.591
48.591; 48.591
48.591; 48.591
48.591; 48.591
48.591; 48.591
48.591; 48.591
48.591; 48.591
48.591; 48.591
48.591; 48.591
48.591; 48.591
48.591; 48.591
48.591; 48.591
48.591; 48.591
48.591; 48.591
48.591; 48.591
48.591; 48.591
48.591; 48.591
48.591; 48.591
48.591; 48.591
48.591; 48.591
48.591; 48.591
48.591; 48.591
48.591; 48.591
59.616; 62.379
81.145; 81.145
70.772; 70.772
66.764; 67.943
73.971; 73.971
67.03; 67.03
75.503; 75.503
83.675; 83.675
84.878; 84.878
90.233; 90.233
90.224; 90.224
89.979; 89.979
89.425; 89.425
90.36; 90.36
95.835; 94.172
93.987; 93.631
93.773; 93.627
93.625; 93.62
93.696; 93.609
93.897; 93.595
93.812; 93.58
93.694; 93.562
93.534; 93.534
93.762; 93.517
93.845; 93.503
93.597; 93.474
93.444; 93.444
93.62; 93.418
93.731; 93.393
93.63; 93.359
93.528; 93.326
93.261; 93.261
70.76; 70.79
48.591; 48.939
77.726; 77.726
102.03; 102.03
95.214; 95.214
92.828; 92.828
93.576; 93.19
71.384; 71.384
65.59; 66.293
94.555; 94.555
99.338; 99.338
70.275; 70.275
77.726; 77.726
77.435; 77.435
48.591; 48.591
48.591; 48.591
48.591; 48.591
48.591; 48.591
60.762; 60.762
89.776; 89.776
77.435; 77.435
77.726; 77.726

bus 10: 
83.515; 83.516
69.671; 69.671
69.672; 69.672
69.671; 69.672
69.671; 69.671
69.671; 69.671
69.671; 69.671
69.671; 69.671
69.671; 69.671
69.671; 69.671
69.671; 69.671
69.671; 69.671
69.671; 69.671
69.671; 69.671
69.671; 69.671
69.671; 69.671
69.671; 69.671
69.671; 69.671
69.671; 69.671
69.671; 69.671
69.671; 69.671
69.671; 69.671
69.671; 69.671
69.671; 69.671
69.671; 69.671
69.671; 69.671
69.671; 69.671
69.671; 69.671
69.671; 69.671
69.671; 69.671
69.671; 69.671
69.671; 69.671
69.671; 69.671
69.671; 69.671
69.671; 69.671
69.671; 69.671
69.671; 69.671
69.671; 69.671
69.671; 69.671
69.671; 69.671
69.671; 69.671
69.671; 69.671
69.671; 69.671
69.671; 69.671
103.27; 103.83
122.03; 122.03
109.09; 109.09
114.33; 114.33
111.89; 111.89
116.93; 116.93
126.71; 126.71
127.24; 127.24
125.2; 125.2
127.68; 127.68
131.74; 131.74
133.1; 133.1
135.53; 134.79
134.27; 134
134.17; 133.99
134.24; 133.97
134.07; 133.96
134.01; 133.94
134.08; 133.91
134.01; 133.89
134.03; 133.86
133.93; 133.83
133.63; 133.63
133.6; 133.6
133.69; 133.69
133.76; 133.67
133.79; 133.65
133.66; 133.59
133.24; 133.24
133.46; 133.33
133.72; 133.58
133.38; 133.38
133.45; 133.33
101.48; 101.48
69.671; 70.954
110.33; 110.33
122.86; 122.86
124.25; 124.25
138.75; 138.75
131.53; 131.51
103.74; 103.74
69.671; 70.739
111.45; 111.45
145.19; 145.19
103.5; 103.5
69.671; 69.671
79.39; 79.39
121.07; 121.07
111.03; 111.03
69.671; 69.671
69.671; 69.671
111.45; 111.45

bus 16: 
42.828; 42.829
49.539; 49.54
49.402; 49.402
40.582; 40.582
51.872; 51.872
46.954; 46.954
43.896; 43.896
57.971; 57.971
51.365; 51.365
37.333; 37.333
35.728; 35.729
35.728; 35.729
35.728; 35.729
35.728; 35.729
35.728; 35.729
35.728; 35.729
35.728; 35.729
35.728; 35.729
35.728; 35.729
35.728; 35.729
35.728; 35.729
35.728; 35.729
35.728; 35.729
35.728; 35.729
35.728; 35.729
35.728; 35.729
35.728; 35.729
35.728; 35.729
35.728; 35.729
35.728; 35.729
35.728; 35.729
35.728; 35.729
46.784; 46.784
58.718; 58.718
51.986; 51.986
43.604; 43.604
53.319; 53.319
49.629; 49.629
45.325; 45.325
45.229; 45.229
35.729; 35.729
35.729; 35.729
35.729; 35.729
35.729; 35.729
35.729; 35.729
35.729; 36.196
54.904; 54.904
61.575; 61.575
55.592; 55.592
59.214; 59.214
59.235; 59.235
66.332; 66.332
70.483; 70.483
67.361; 67.361
64.283; 64.283
68.361; 67.598
71.098; 70.655
69.559; 69.219
69.466; 69.21
69.296; 69.199
69.303; 69.186
69.513; 69.172
69.492; 69.156
69.371; 69.14
69.714; 69.121
69.519; 69.102
69.287; 69.081
69.41; 69.059
69.567; 69.036
69.64; 69.012
69.117; 68.986
69.018; 68.959
52.439; 52.439
35.729; 35.912
35.729; 35.729
57.151; 57.151
75.516; 75.475
71.361; 70.721
59.377; 59.377
63.667; 63.667
56.938; 56.938
35.729; 36.303
57.151; 57.151
56.938; 56.938
35.729; 35.729
57.151; 57.151
75.268; 75.268
64.33; 64.33
46.079; 46.079
35.729; 35.729
35.729; 35.729
35.729; 35.729
35.729; 35.729
35.728; 35.729
35.728; 35.729
35.728; 38.388

bus 2: 
41.543; 41.544
44.531; 44.531
44.433; 44.433
45.733; 45.733
45.622; 45.622
46.847; 46.847
46.725; 46.725
34.657; 34.657
34.657; 34.657
34.657; 34.657
34.657; 34.657
34.657; 34.657
34.657; 34.657
34.657; 34.657
34.657; 34.657
34.657; 34.657
34.657; 34.657
34.657; 34.657
34.657; 34.657
34.657; 34.657
34.657; 34.657
34.657; 34.657
34.657; 34.657
34.657; 34.657
34.657; 34.657
34.657; 34.657
34.657; 34.657
34.657; 34.657
34.657; 34.657
34.657; 34.657
34.657; 34.657
34.657; 34.657
34.657; 34.657
34.657; 34.657
34.657; 34.657
34.657; 34.657
34.657; 34.657
34.657; 34.657
34.657; 34.657
34.657; 35.549
42.928; 44.365
52.615; 52.615
54.954; 54.954
49.91; 49.91
41.068; 41.248
45.281; 45.281
54.195; 54.195
57.473; 57.473
59.153; 59.153
58.683; 58.683
60.917; 60.917
60.936; 60.936
62.534; 62.534
67.609; 67.609
66.818; 66.818
66.563; 66.825
67.368; 67.024
67.213; 67.018
67.155; 67.011
67.005; 67.001
67.056; 66.989
66.978; 66.977
66.957; 66.963
67.034; 66.947
67.152; 66.931
67.084; 66.913
66.912; 66.894
67.022; 66.874
67.007; 66.852
66.949; 66.83
67.003; 66.806
66.583; 66.583
66.592; 66.65
66.988; 66.818
66.838; 66.698
66.749; 66.668
66.737; 66.638
66.737; 66.606
66.289; 66.289
66.503; 66.389
66.875; 66.632
50.48; 50.491
34.657; 34.657
34.657; 34.657
34.657; 34.657
34.657; 34.657
34.657; 34.657
34.657; 34.657
34.657; 34.657
34.657; 34.657
34.657; 34.657
34.657; 34.657
34.657; 34.657
53.998; 53.998
53.805; 53.805
55.437; 55.437

bus 1: 
46.254; 46.255
54.844; 54.844
54.683; 54.683
50.863; 50.863
50.741; 50.741
50.35; 50.35
50.232; 50.232
38.587; 38.587
38.587; 38.587
38.587; 38.587
38.587; 38.587
38.587; 38.587
38.587; 38.587
38.587; 38.587
38.587; 38.587
38.587; 38.587
38.587; 38.587
38.587; 38.587
38.587; 38.587
38.587; 38.587
38.587; 38.587
38.587; 38.587
38.587; 38.587
38.587; 38.587
38.587; 38.587
38.587; 38.587
38.587; 38.587
38.587; 38.587
38.587; 38.587
38.587; 38.587
38.587; 38.587
38.587; 38.587
38.587; 38.587
38.587; 38.587
38.587; 38.587
38.587; 38.587
38.587; 38.587
38.587; 38.587
38.587; 38.587
38.587; 38.587
57.883; 57.883
72.859; 72.859
59.776; 60.097
56.485; 56.485
54.648; 54.648
56.509; 56.509
59.175; 59.175
58.742; 58.742
65.731; 65.731
70.962; 70.962
74.244; 74.244
72.933; 72.933
72.053; 72.053
72.858; 72.858
73.748; 73.748
74.06; 74.06
74.645; 74.401
74.737; 74.616
74.819; 74.499
74.788; 74.486
74.763; 74.47
74.677; 74.453
74.76; 74.434
74.87; 74.414
74.657; 74.393
74.643; 74.37
74.625; 74.346
74.535; 74.32
74.576; 74.294
74.444; 74.266
74.332; 74.236
74.406; 74.206
56.442; 56.442
61.723; 61.864
81.061; 80.63
57.96; 57.96
38.587; 39.008
55.049; 55.877
78.022; 78.022
66.877; 66.877
67.054; 67.054
61.493; 61.493
38.587; 39.375
38.587; 38.587
61.723; 61.723
61.493; 61.493
38.587; 38.587
38.587; 38.587
61.723; 61.723
80.931; 80.931
57.832; 57.832
38.587; 38.587
38.587; 38.587
38.587; 38.587
38.587; 38.587
39.958; 40.963

bus 20: 
54.82; 54.821
45.732; 45.733
45.733; 45.733
45.733; 45.733
45.733; 45.733
45.733; 45.733
45.733; 45.733
45.733; 45.733
45.733; 45.733
45.732; 45.733
45.732; 45.733
45.732; 45.733
45.732; 45.733
45.732; 45.733
45.732; 45.733
45.732; 45.733
45.732; 45.733
45.732; 45.733
45.732; 45.733
45.732; 45.733
45.732; 45.733
45.732; 45.733
45.732; 45.733
45.732; 45.733
45.732; 45.733
45.732; 45.733
45.732; 45.733
45.732; 45.733
45.732; 45.733
45.732; 45.733
45.732; 45.733
45.732; 45.733
45.732; 45.733
45.733; 45.733
45.733; 45.733
45.733; 45.733
45.733; 45.733
45.733; 45.733
45.733; 45.733
45.733; 45.733
45.733; 45.733
45.733; 46.569
45.733; 47.822
55.602; 55.602
68.577; 68.577
60.621; 60.621
63.226; 63.226
74.478; 74.478
73.063; 73.063
82.244; 82.244
87.965; 87.965
82.203; 82.516
82.627; 82.627
84.523; 84.523
85.087; 85.154
88.607; 88.452
88.694; 87.884
87.685; 87.881
87.921; 87.875
88.077; 87.866
88.239; 87.854
87.983; 87.841
87.754; 87.754
87.689; 87.771
87.91; 87.822
88.112; 87.769
87.865; 87.747
87.968; 87.724
87.952; 87.698
87.476; 87.487
87.546; 87.546
87.81; 87.697
87.735; 87.581
87.853; 87.547
87.801; 87.513
87.477; 87.477
66.434; 66.491
45.733; 45.733
73.154; 73.154
72.88; 72.88
73.154; 73.154
72.88; 72.88
73.154; 73.154
72.88; 72.88
73.154; 73.154
72.88; 72.88
73.154; 73.154
72.88; 72.88
73.154; 73.154
95.119; 95.119
67.75; 67.75
63.338; 63.338
63.162; 63.162
53.891; 53.891
53.81; 53.81
73.154; 73.154

bus 18: 
142.62; 142.62
148.43; 148.43
148.13; 148.13
118.98; 118.98
118.98; 118.98
118.98; 118.98
118.98; 118.98
118.98; 118.98
118.98; 118.98
118.98; 118.98
118.98; 118.98
118.98; 118.98
118.98; 118.98
118.98; 118.98
118.98; 118.98
118.98; 118.98
118.98; 118.98
118.98; 118.98
118.98; 118.98
118.98; 118.98
118.98; 118.98
118.98; 118.98
118.98; 118.98
118.98; 118.98
118.98; 118.98
118.98; 118.98
118.98; 118.98
118.98; 118.98
118.98; 118.98
118.98; 118.98
118.98; 118.98
118.98; 118.98
118.98; 118.98
118.98; 118.98
118.98; 118.98
118.98; 118.98
118.98; 118.99
118.98; 118.99
118.98; 118.98
118.98; 118.98
119.06; 119.07
126.18; 126.18
181.63; 181.63
206.07; 206.07
182.8; 182.8
183.11; 183.11
183.55; 183.55
183.97; 183.97
184.42; 184.42
187.96; 187.96
206.03; 206.03
225.19; 225.19
229.69; 229.69
229.78; 229.78
229.78; 229.78
229.79; 229.79
229.79; 229.79
229.77; 229.77
229.74; 229.74
229.71; 229.71
229.68; 229.68
229.64; 229.64
229.6; 229.59
229.55; 229.55
229.49; 229.49
229.44; 229.44
229.37; 229.37
229.31; 229.31
229.24; 229.24
229.17; 229.17
225.7; 225.7
227.22; 227.22
230.46; 230.46
203.71; 203.71
215.46; 215.46
240.05; 240.03
228.4; 228.39
228.28; 228.28
177.82; 177.82
123.42; 123.43
118.98; 118.98
190.31; 190.31
189.6; 189.6
118.98; 118.98
143.69; 143.69
190.62; 190.62
184.58; 184.58
176.12; 176.12
157.02; 157.02
183.86; 183.86
183.21; 183.21
118.98; 118.98
118.98; 118.98
190.31; 190.31
189.6; 189.6
190.31; 190.31

bus 9: 
74.949; 74.95
88.929; 88.929
88.666; 88.666
83.523; 83.523
88.684; 88.684
87.035; 87.035
88.532; 88.532
80.824; 80.824
73.776; 73.776
62.525; 62.526
62.525; 62.525
62.525; 62.525
62.525; 62.525
62.525; 62.525
62.525; 62.525
62.525; 62.525
62.525; 62.525
62.525; 62.525
62.525; 62.525
62.525; 62.525
62.525; 62.525
62.525; 62.525
62.525; 62.525
62.525; 62.525
62.525; 62.525
62.525; 62.525
62.525; 62.525
62.525; 62.525
62.525; 62.525
62.525; 62.525
62.525; 62.525
62.525; 62.525
62.525; 62.525
70.498; 70.498
84.306; 84.306
76.274; 76.274
62.525; 62.525
62.525; 62.525
79.707; 79.707
95.387; 95.387
92.004; 92.004
92.523; 92.523
91.026; 91.739
94.935; 94.935
94.414; 94.414
85.982; 85.982
95.05; 95.05
108.64; 108.64
107.27; 107.27
106.35; 106.35
109.04; 109.04
114.92; 114.92
119.68; 119.68
120.04; 120.04
121.37; 121.37
120.92; 120.92
122.11; 121.52
121.68; 121.63
121.45; 121.45
121.36; 121.36
121.38; 121.37
121.46; 121.41
121.64; 121.34
121.59; 121.31
121.5; 121.28
121.21; 121.21
121.04; 121.04
121.25; 121.09
121.18; 121.18
120.75; 120.75
121.11; 120.85
121.39; 121.11
120.96; 120.91
120.64; 120.64
120.26; 120.45
120.72; 120.72
91.784; 91.784
62.525; 62.727
62.525; 62.525
62.525; 62.525
100.01; 100.01
99.641; 99.641
62.525; 62.525
62.525; 62.525
62.525; 62.525
62.525; 62.525
62.525; 62.525
62.525; 62.525
62.525; 62.525
62.525; 62.525
62.525; 62.525
66.572; 66.572
104.02; 104.02
132.22; 132.21
94.78; 94.78
62.525; 63.098

bus 13: 
113.49; 113.5
94.68; 94.681
94.682; 94.682
94.681; 94.682
94.681; 94.681
94.681; 94.681
94.681; 94.681
94.681; 94.681
94.681; 94.681
94.681; 94.681
94.681; 94.681
94.68; 94.681
94.68; 94.681
94.68; 94.681
94.68; 94.681
94.68; 94.681
94.68; 94.681
94.68; 94.681
94.68; 94.681
94.68; 94.681
94.68; 94.681
94.68; 94.681
94.68; 94.681
94.68; 94.681
94.68; 94.681
94.68; 94.681
94.68; 94.681
94.68; 94.681
94.68; 94.681
94.68; 94.681
94.68; 94.681
94.68; 94.681
94.68; 94.681
94.681; 94.681
94.681; 94.681
94.681; 94.681
94.68; 94.681
94.68; 94.681
94.681; 94.681
94.681; 94.681
94.681; 94.681
94.681; 94.681
94.681; 94.681
94.681; 94.681
117.79; 118.18
152.5; 152.5
142.87; 142.87
138.93; 138.93
157.58; 157.58
165.21; 165.21
160.87; 160.87
162.65; 162.65
171.66; 171.66
174.4; 174.4
179.95; 179.95
181.8; 181.8
183.22; 182.53
182.49; 182.2
182.46; 182.19
182.3; 182.17
181.97; 182.04
182.02; 182.02
182.06; 182.06
182.48; 182.05
182.46; 182.06
182.05; 182
182.01; 181.96
181.98; 181.91
182.1; 181.86
181.84; 181.81
181.54; 181.56
181.68; 181.59
181.72; 181.72
181.82; 181.57
182.03; 181.5
181.82; 181.43
181.48; 181.35
181.79; 181.28
181.3; 181.2
181.17; 181.11
137.98; 137.98
94.681; 95
151.45; 151.45
199.33; 198.67
186.1; 185.15
180.84; 180.53
137.39; 137.39
94.681; 94.702
142.99; 142.99
142.51; 142.51
151.45; 151.45
197.74; 197.74
141.07; 141.07
94.68; 94.681
94.68; 94.681
94.68; 97.596

computed cost is: 1.8954e+06. It improved the nominal case cost by 40.128% of the nominal cost.
Spent 366.43 sec in Master, 1.8357 sec trying to compute acceptably good feas Points, and 90.028 sec in subProblem stage.
Average CPU time per iteration is: 1.5535 sec.
Congested lines in disaggregated operation are: 


