congInd; nominalCost; DisCost; DisRelCostSav; 1stBus; nomECost; DR_Cost; DR_RelECostSav; disECost; disaggRelECostSav 
L; 1813696; 1804476; 0.5083413; 5; 18301.12; 15829.99; 13.5026; 16034.97; 12.38258
s; 1813696; 1804472; 0.5085938; 5; 18301.12; 15829.99; 13.5026; 16030.5; 12.40702
m; 1813696; 1804435; 0.5106208; 5; 18301.12; 15829.99; 13.5026; 16053.7; 12.28023
