t; nomPriceB7; nomPlPowB7; disagg_price_bus7; PlPowB7; disaggT_in_B7; nomPriceB6; nomPlPowB6; disagg_price_bus6; PlPowB6; disaggT_in_B6; nomPriceB10; nomPlPowB10; disagg_price_bus10; PlPowB10; disaggT_in_B10; nomPriceB16; nomPlPowB16; disagg_price_bus16; PlPowB16; disaggT_in_B16; nomPriceB2; nomPlPowB2; disagg_price_bus2; PlPowB2; disaggT_in_B2; nomPriceB1; nomPlPowB1; disagg_price_bus1; PlPowB1; disaggT_in_B1;  initFeasThres; finalFeasThres; accept_gap; iterations; CPUmaster; CPUsubproblem; CPUsubsolve; CPUsubcutgen; CPUfeasPt; finalDetectGap; nomCongestionCost; disaggCongestionCost; Objective; nomImprovPercent; CoopPotentialPercent; nominalCost; integratedCost
1; 13.32; 62.5; 16.8516667; 53.5356974; 80; 13.32; 68; 16.8516667; 58.2468388; 80; 13.32; 97.5; 16.8516667; 83.515688; 80; 13.32; 50; 16.8516667; 42.8285579; 80; 13.32; 48.5; 16.8516667; 41.5437012; 80; 13.32; 54; 16.8516667; 46.2548426; 80; 761; 169.117667; 0.0001; 147; 13.1580744; 56.6417351; 49.6944122; 6.94561911; 4.21603298; 8.27584806e-05; 265630.734; -5.05166586e-10; 1830883.02; 18.9750721; 2259654; 
2; 13.32; 62.5; 10.89; 44.6608217; 80; 13.32; 68; 10.89; 57.3645647; 80; 13.32; 97.5; 10.89; 69.6708819; 80; 13.32; 50; 10.89; 35.7286574; 80; 13.32; 48.5; 10.89; 34.6567977; 80; 13.32; 54; 10.89; 38.58695; 80; 
3; 13.32; 62.5; 16.8516667; 44.6612523; 80; 13.32; 68; 16.8516667; 57.2777391; 80; 13.32; 97.5; 16.8516667; 69.6715536; 80; 13.32; 50; 16.8516667; 35.7290019; 80; 13.32; 48.5; 16.8516667; 34.6571318; 80; 13.32; 54; 16.8516667; 38.587322; 80; 
4; 13.32; 62.5; 16.8516667; 44.661248; 80; 13.32; 68; 16.8516667; 48.5916659; 80; 13.32; 97.5; 16.8516667; 69.6715469; 80; 13.32; 50; 16.8516667; 35.7289984; 80; 13.32; 48.5; 16.8516667; 34.6571285; 80; 13.32; 54; 16.8516667; 38.5873183; 80; 
5; 13.32; 62.5; 16.8516667; 44.6608217; 80; 13.32; 68; 16.8516667; 48.590974; 80; 13.32; 97.5; 16.8516667; 69.6708819; 80; 13.32; 50; 16.8516667; 35.7286574; 80; 13.32; 48.5; 16.8516667; 34.6567977; 80; 13.32; 54; 16.8516667; 38.58695; 80; 
6; 13.32; 62.5; 16.8516667; 44.6608217; 80; 13.32; 68; 16.8516667; 48.590974; 80; 13.32; 97.5; 16.8516667; 69.6708819; 80; 13.32; 50; 16.8516667; 35.7286574; 80; 13.32; 48.5; 16.8516667; 34.6567977; 80; 13.32; 54; 16.8516667; 38.58695; 80; 
7; 13.32; 62.5; 16.8516667; 44.6608217; 80; 13.32; 68; 16.8516667; 48.590974; 80; 13.32; 97.5; 16.8516667; 69.6708819; 80; 13.32; 50; 16.8516667; 35.7286574; 80; 13.32; 48.5; 16.8516667; 34.6567977; 80; 13.32; 54; 16.8516667; 38.58695; 80; 
8; 13.32; 62.5; 16.8516667; 44.6608217; 80; 13.32; 68; 16.8516667; 48.590974; 80; 13.32; 97.5; 16.8516667; 69.6708819; 80; 13.32; 50; 16.8516667; 35.7286574; 80; 13.32; 48.5; 16.8516667; 34.6567977; 80; 13.32; 54; 16.8516667; 38.58695; 80; 
9; 13.32; 62.5; 22.7491172; 44.6608217; 80; 13.32; 68; 22.7491172; 48.590974; 80; 13.32; 97.5; 22.7491172; 69.6708819; 80; 13.32; 50; 22.7491172; 35.7286574; 80; 13.32; 48.5; 22.7491172; 34.6567977; 80; 13.32; 54; 22.7491172; 38.58695; 80; 
10; 30.2533693; 62.5; 22.7491172; 44.6608217; 80; 30.2533693; 68; 22.7491172; 48.590974; 80; 30.2533693; 97.5; 22.7491172; 69.6708819; 80; 30.2533693; 50; 22.7491172; 35.7286574; 80; 30.2533693; 48.5; 22.7491172; 34.6567977; 80; 30.2533693; 54; 22.7491172; 38.58695; 80; 
11; 25.8666307; 62.5; 22.7491172; 44.6608217; 80; 25.8666307; 68; 22.7491172; 48.590974; 80; 25.8666307; 97.5; 22.7491172; 69.6708819; 80; 25.8666307; 50; 22.7491172; 35.7286574; 80; 25.8666307; 48.5; 22.7491172; 34.6567977; 80; 25.8666307; 54; 22.7491172; 38.58695; 80; 
12; 46.55; 62.5; 22.7491172; 44.6608217; 80; 46.55; 68; 22.7491172; 48.590974; 80; 46.55; 97.5; 22.7491172; 69.6708819; 80; 46.55; 50; 22.7491172; 35.7286574; 80; 46.55; 48.5; 22.7491172; 34.6567977; 80; 46.55; 54; 22.7491172; 38.58695; 80; 
13; 46.55; 62.5; 22.7491172; 44.6608217; 80; 46.55; 68; 22.7491172; 48.590974; 80; 46.55; 97.5; 22.7491172; 69.6708819; 80; 46.55; 50; 22.7491172; 35.7286574; 80; 46.55; 48.5; 22.7491172; 34.6567977; 80; 46.55; 54; 22.7491172; 38.58695; 80; 
14; 20.7; 62.5; 22.7491172; 44.6608217; 80; 46.55; 68; 22.7491172; 48.590974; 80; 46.55; 97.5; 22.7491172; 69.6708819; 80; 46.55; 50; 22.7491172; 35.7286574; 80; 46.55; 48.5; 22.7491172; 34.6567977; 80; 46.55; 54; 22.7491172; 38.58695; 80; 
15; 20.7; 62.5; 22.7491172; 44.6608217; 80; 46.55; 68; 22.7491172; 48.590974; 80; 46.55; 97.5; 22.7491172; 69.6708819; 80; 46.55; 50; 22.7491172; 35.7286574; 80; 46.55; 48.5; 22.7491172; 34.6567977; 80; 46.55; 54; 22.7491172; 38.58695; 80; 
16; 20.7; 62.5; 22.7491172; 44.6608217; 80; 46.55; 68; 22.7491172; 48.590974; 80; 46.55; 97.5; 22.7491172; 69.6708819; 80; 46.55; 50; 22.7491172; 35.7286574; 80; 46.55; 48.5; 22.7491172; 34.6567977; 80; 46.55; 54; 22.7491172; 38.58695; 80; 
17; 20.7; 62.5; 22.7491172; 44.6608217; 80; 46.55; 68; 22.7491172; 48.590974; 80; 46.55; 97.5; 22.7491172; 69.6708819; 80; 46.55; 50; 22.7491172; 35.7286574; 80; 46.55; 48.5; 22.7491172; 34.6567977; 80; 46.55; 54; 22.7491172; 38.58695; 80; 
18; 20.7; 62.5; 19.4504952; 44.6608217; 80; 46.55; 68; 19.4504952; 48.590974; 80; 46.55; 97.5; 19.4504952; 69.6708819; 80; 46.55; 50; 19.4504952; 35.7286574; 80; 46.55; 48.5; 19.4504952; 34.6567977; 80; 46.55; 54; 19.4504952; 38.58695; 80; 
19; 20.7; 62.5; 22.7491172; 44.6608217; 80; 46.55; 68; 22.7491172; 48.590974; 80; 46.55; 97.5; 22.7491172; 69.6708819; 80; 46.55; 50; 22.7491172; 35.7286574; 80; 46.55; 48.5; 22.7491172; 34.6567977; 80; 46.55; 54; 22.7491172; 38.58695; 80; 
20; 20.7; 62.5; 20.7; 44.6608217; 80; 46.55; 68; 20.7; 48.590974; 80; 46.55; 97.5; 20.7; 69.6708819; 80; 46.55; 50; 20.7; 35.7286574; 80; 46.55; 48.5; 20.7; 34.6567977; 80; 46.55; 54; 20.7; 38.58695; 80; 
21; 20.7; 62.5; 20.7; 44.6608217; 80; 46.55; 68; 20.7; 48.590974; 80; 46.55; 97.5; 20.7; 69.6708819; 80; 46.55; 50; 20.7; 35.7286574; 80; 46.55; 48.5; 20.7; 34.6567977; 80; 46.55; 54; 20.7; 38.58695; 80; 
22; 20.7; 62.5; 20.7; 44.6608217; 80; 46.55; 68; 20.7; 48.590974; 80; 46.55; 97.5; 20.7; 69.6708819; 80; 46.55; 50; 20.7; 35.7286574; 80; 46.55; 48.5; 20.7; 34.6567977; 80; 46.55; 54; 20.7; 38.58695; 80; 
23; 20.7; 62.5; 20.7; 44.6608217; 80; 46.55; 68; 20.7; 48.590974; 80; 46.55; 97.5; 20.7; 69.6708819; 80; 46.55; 50; 20.7; 35.7286574; 80; 46.55; 48.5; 20.7; 34.6567977; 80; 46.55; 54; 20.7; 38.58695; 80; 
24; 20.7; 62.5; 20.7; 44.6608217; 80; 46.55; 68; 20.7; 48.590974; 80; 46.55; 97.5; 20.7; 69.6708819; 80; 46.55; 50; 20.7; 35.7286574; 80; 46.55; 48.5; 20.7; 34.6567977; 80; 46.55; 54; 20.7; 38.58695; 80; 
25; 20.7; 62.5; 21.937732; 44.6608217; 80; 274.513595; 68; 21.937732; 48.590974; 80; 274.513595; 97.5; 21.937732; 69.6708819; 80; 274.513595; 50; 21.937732; 35.7286574; 80; 274.513595; 48.5; 21.937732; 34.6567977; 80; 274.513595; 54; 21.937732; 38.58695; 80; 
26; 20.7; 62.5; 19.462268; 44.6608217; 80; 234.709124; 68; 19.462268; 48.590974; 80; 234.709124; 97.5; 19.462268; 69.6708819; 80; 234.709124; 50; 19.462268; 35.7286574; 80; 234.709124; 48.5; 19.462268; 34.6567977; 80; 234.709124; 54; 19.462268; 38.58695; 80; 
27; 20.7; 62.5; 20.7; 44.6608217; 80; 274.513595; 68; 20.7; 48.590974; 80; 274.513595; 97.5; 20.7; 69.6708819; 80; 274.513595; 50; 20.7; 35.7286574; 80; 274.513595; 48.5; 20.7; 34.6567977; 80; 274.513595; 54; 20.7; 38.58695; 80; 
28; 20.7; 62.5; 22.7628866; 44.6608217; 80; 274.513595; 68; 22.7628866; 48.590974; 80; 274.513595; 97.5; 22.7628866; 69.6708819; 80; 274.513595; 50; 22.7628866; 35.7286574; 80; 274.513595; 48.5; 22.7628866; 34.6567977; 80; 274.513595; 54; 22.7628866; 38.58695; 80; 
29; 20.7; 62.5; 22.7628866; 44.6608217; 80; 274.513595; 68; 22.7628866; 48.590974; 80; 274.513595; 97.5; 22.7628866; 69.6708819; 80; 274.513595; 50; 22.7628866; 35.7286574; 80; 274.513595; 48.5; 22.7628866; 34.6567977; 80; 274.513595; 54; 22.7628866; 38.58695; 80; 
30; 20.7; 62.5; 19.462268; 44.6608217; 80; 22.8382026; 68; 19.462268; 48.590974; 80; 22.8382026; 97.5; 19.462268; 69.6708819; 80; 22.8382026; 50; 19.462268; 35.7286574; 80; 22.8382026; 48.5; 19.462268; 34.6567977; 80; 22.8382026; 54; 19.462268; 38.58695; 80; 
31; 20.7; 62.5; 22.7628866; 44.6608217; 80; 22.8382026; 68; 22.7628866; 48.590974; 80; 22.8382026; 97.5; 22.7628866; 69.6708819; 80; 22.8382026; 50; 22.7628866; 35.7286574; 80; 22.8382026; 48.5; 22.7628866; 34.6567977; 80; 22.8382026; 54; 22.7628866; 38.58695; 80; 
32; 22.8382026; 62.5; 19.462268; 44.6608217; 80; 22.8382026; 68; 19.462268; 48.590974; 80; 22.8382026; 97.5; 19.462268; 69.6708819; 80; 22.8382026; 50; 19.462268; 35.7286574; 80; 22.8382026; 48.5; 19.462268; 34.6567977; 80; 22.8382026; 54; 19.462268; 38.58695; 80; 
33; 22.8382026; 62.5; 19.462268; 44.6608217; 80; 22.8382026; 68; 19.462268; 48.590974; 80; 22.8382026; 97.5; 19.462268; 69.6708819; 80; 22.8382026; 50; 19.462268; 35.7286574; 80; 22.8382026; 48.5; 19.462268; 34.6567977; 80; 22.8382026; 54; 19.462268; 38.58695; 80; 
34; 22.8382026; 62.5; 19.462268; 44.6608217; 80; 22.8382026; 68; 19.462268; 48.590974; 80; 22.8382026; 97.5; 19.462268; 69.6708819; 80; 22.8382026; 50; 19.462268; 35.7286574; 80; 22.8382026; 48.5; 19.462268; 34.6567977; 80; 22.8382026; 54; 19.462268; 38.58695; 80; 
35; 22.8382026; 62.5; 19.462268; 44.6608217; 80; 22.8382026; 68; 19.462268; 48.590974; 80; 22.8382026; 97.5; 19.462268; 69.6708819; 80; 22.8382026; 50; 19.462268; 35.7286574; 80; 22.8382026; 48.5; 19.462268; 34.6567977; 80; 22.8382026; 54; 19.462268; 38.58695; 80; 
36; 22.8382026; 62.5; 20.7; 44.6608217; 80; 22.8382026; 68; 20.7; 48.590974; 80; 22.8382026; 97.5; 20.7; 69.6708819; 80; 22.8382026; 50; 20.7; 35.7286574; 80; 22.8382026; 48.5; 20.7; 34.6567977; 80; 22.8382026; 54; 20.7; 38.58695; 80; 
37; 26.7113481; 62.5; 22.7628866; 44.6608217; 80; 26.7113481; 68; 22.7628866; 48.590974; 80; 26.7113481; 97.5; 22.7628866; 69.6708819; 80; 26.7113481; 50; 22.7628866; 35.7286574; 80; 26.7113481; 48.5; 22.7628866; 34.6567977; 80; 26.7113481; 54; 22.7628866; 38.58695; 80; 
38; 26.7113481; 62.5; 22.7628866; 44.6608217; 80; 26.7113481; 68; 22.7628866; 48.590974; 80; 26.7113481; 97.5; 22.7628866; 69.6708819; 80; 26.7113481; 50; 22.7628866; 35.7286574; 80; 26.7113481; 48.5; 22.7628866; 34.7133834; 80; 26.7113481; 54; 22.7628866; 38.58695; 80; 
39; 26.7113481; 62.5; 22.7628866; 44.6608217; 80; 26.7113481; 68; 22.7628866; 48.590974; 80; 26.7113481; 97.5; 22.7628866; 70.5392537; 80; 26.7113481; 50; 22.7628866; 35.7286574; 80; 26.7113481; 48.5; 22.7628866; 34.7128189; 80; 26.7113481; 54; 22.7628866; 38.58695; 80; 
40; 26.7113481; 62.5; 22.7628866; 44.6608217; 80; 26.7113481; 68; 22.7628866; 48.590974; 80; 26.7113481; 97.5; 22.7628866; 70.530591; 80; 26.7113481; 50; 22.7628866; 37.1971289; 80; 26.7113481; 48.5; 22.7628866; 34.6567977; 80; 26.7113481; 54; 22.7628866; 38.58695; 80; 
41; 26.7113481; 62.5; 22.7628866; 44.6608217; 80; 26.7113481; 68; 22.7628866; 48.590974; 80; 26.7113481; 97.5; 22.7628866; 69.6708819; 80; 26.7113481; 50; 22.7628866; 37.1824796; 80; 26.7113481; 48.5; 22.7628866; 34.6567977; 80; 26.7113481; 54; 22.7628866; 38.58695; 80; 
42; 26.7113481; 62.5; 14.3278489; 44.6608217; 80; 26.7113481; 68; 14.3278489; 57.6616688; 80; 26.7113481; 97.5; 14.3278489; 69.6708819; 80; 26.7113481; 50; 14.3278489; 36.2443302; 80; 26.7113481; 48.5; 14.3278489; 34.6567977; 80; 26.7113481; 54; 14.3278489; 40.0760676; 80; 
43; 26.7113481; 62.5; 16.7577181; 64.6222089; 80; 26.7113481; 68; 16.7577181; 69.8431671; 80; 26.7113481; 97.5; 16.7577181; 71.1211264; 80; 26.7113481; 50; 16.7577181; 36.9326525; 80; 26.7113481; 48.5; 16.7577181; 34.6567977; 80; 26.7113481; 54; 16.7577181; 44.9412037; 80; 
44; 22.8382026; 62.5; 14.3278489; 73.4571307; 80; 22.8382026; 68; 14.3278489; 60.7405366; 80; 22.8382026; 97.5; 14.3278489; 82.4279704; 80; 22.8382026; 50; 14.3278489; 49.143624; 80; 22.8382026; 48.5; 14.3278489; 34.9580267; 80; 22.8382026; 54; 14.3278489; 55.6904837; 80; 
45; 26.7113481; 62.5; 16.7577181; 63.6470491; 80; 26.7113481; 68; 16.7577181; 61.7760195; 80; 26.7113481; 97.5; 16.7577181; 94.6304893; 80; 26.7113481; 50; 16.7577181; 55.7814766; 80; 26.7113481; 48.5; 16.7577181; 52.0539623; 79.9069755; 26.7113481; 54; 16.7577181; 58.3954506; 80; 
46; 5.47; 62.5; 12.9005874; 68.9999715; 79.6790543; 5.47; 68; 12.9005874; 74.5170135; 80; 5.47; 97.5; 12.9005874; 113.422246; 78.0687742; 5.47; 50; 12.9005874; 48.1106332; 80; 5.47; 48.5; 12.9005874; 60.8539502; 80; 5.47; 54; 12.9005874; 62.0614648; 77.1605006; 
47; 5.47; 62.5; 12.9005874; 74.4517761; 78.0711154; 5.47; 68; 12.9005874; 75.3186732; 80; 5.47; 97.5; 12.9005874; 119.995588; 79.915193; 5.47; 50; 12.9005874; 55.3702937; 78.357515; 5.47; 48.5; 12.9005874; 53.2304888; 79.8969175; 5.47; 54; 12.9005874; 69.8625331; 75; 
48; 5.47; 62.5; 12.9005874; 80.4653215; 75.0838909; 5.47; 68; 12.9005874; 79.2591981; 76.0817746; 5.47; 97.5; 12.9005874; 115.306338; 76.2194845; 5.47; 50; 12.9005874; 64.0653645; 77.3565401; 5.47; 48.5; 12.9005874; 58.5700814; 76.0822646; 5.47; 54; 12.9005874; 71.3311267; 75; 
49; 5.47; 62.5; 15.0884063; 83.6318401; 75.1942646; 5.47; 68; 15.0884063; 87.6513191; 75; 5.47; 97.5; 15.0884063; 126.873635; 75; 5.47; 50; 15.0884063; 65.3526695; 75.0665831; 5.47; 48.5; 15.0884063; 63.8510461; 75; 5.47; 54; 15.0884063; 73.5960701; 75; 
50; 5.47; 62.5; 10.0123993; 84.6151445; 75; 5.47; 68; 10.0123993; 93.2074243; 75; 5.47; 97.5; 10.0123993; 133.439845; 75; 5.47; 50; 10.0123993; 67.7657202; 75.0215645; 5.47; 48.5; 10.0123993; 65.7118138; 75; 5.47; 54; 10.0123993; 73.9180306; 75.614383; 
51; 5.47; 62.5; 10.0123993; 86.3956249; 75; 5.47; 68; 10.0123993; 93.2507469; 75.1469578; 5.47; 97.5; 10.0123993; 133.334529; 75; 5.47; 50; 10.0123993; 68.2357041; 75; 5.47; 48.5; 10.0123993; 66.8912001; 75.1268389; 5.47; 54; 10.0123993; 73.7823951; 75; 
52; 5.47; 62.5; 10.0123993; 85.5194763; 75.2022615; 5.47; 68; 10.0123993; 93.1148836; 75.266054; 5.47; 97.5; 10.0123993; 133.353834; 75; 5.47; 50; 10.0123993; 68.4418738; 75.0467951; 5.47; 48.5; 10.0123993; 66.3567537; 75; 5.47; 54; 10.0123993; 73.7850455; 75.1717259; 
53; 5.47; 62.5; 10.0123993; 85.4423932; 75.0488455; 5.47; 68; 10.0123993; 93.0652766; 75.1807481; 5.47; 97.5; 10.0123993; 133.36087; 75; 5.47; 50; 10.0123993; 68.4447294; 75.1062987; 5.47; 48.5; 10.0123993; 66.360831; 75.0562659; 5.47; 54; 10.0123993; 73.7440155; 75.1644002; 
54; 5.47; 62.5; 10.0123993; 85.5296293; 75.009959; 5.47; 68; 10.0123993; 93.2453477; 75.1101959; 5.47; 97.5; 10.0123993; 133.357942; 75.06819; 5.47; 50; 10.0123993; 68.4443572; 75; 5.47; 48.5; 10.0123993; 66.3590189; 75.0059703; 5.47; 54; 10.0123993; 72.9002236; 75.2355991; 
55; 5.47; 62.5; 10.0123993; 85.5979376; 75.0906914; 5.47; 68; 10.0123993; 93.2988181; 75.155796; 5.47; 97.5; 10.0123993; 133.350572; 75.0281136; 5.47; 50; 10.0123993; 68.4405358; 75.1590961; 5.47; 48.5; 10.0123993; 66.35546; 75.0108201; 5.47; 54; 10.0123993; 73.3264576; 75; 
56; 5.47; 62.5; 10.0123993; 85.4740039; 75.1314406; 5.47; 68; 10.0123993; 93.2645067; 75; 5.47; 97.5; 10.0123993; 133.339334; 75.0813063; 5.47; 50; 10.0123993; 68.4079944; 75.0379287; 5.47; 48.5; 10.0123993; 66.3500486; 75.0181695; 5.47; 54; 10.0123993; 74.1423642; 75; 
57; 5.47; 62.5; 10.0123993; 85.5000744; 75.0537678; 5.47; 68; 10.0123993; 93.2547487; 75; 5.47; 97.5; 10.0123993; 133.324895; 75.1209342; 5.47; 50; 10.0123993; 68.4021486; 75.020732; 5.47; 48.5; 10.0123993; 66.3430765; 75.0712738; 5.47; 54; 10.0123993; 73.7461461; 75; 
58; 5.47; 62.5; 10.0123993; 85.5648587; 75.0966554; 5.47; 68; 10.0123993; 93.2428797; 75; 5.47; 97.5; 10.0123993; 133.307575; 75.0315685; 5.47; 50; 10.0123993; 68.4200388; 75; 5.47; 48.5; 10.0123993; 66.3346862; 75.018102; 5.47; 54; 10.0123993; 73.7342324; 75; 
59; 5.47; 62.5; 10.52; 85.5136468; 75.0171281; 5.47; 68; 10.52; 93.2290665; 75; 5.47; 97.5; 10.52; 133.287538; 75.062077; 5.47; 50; 10.52; 68.4087295; 75.0686618; 5.47; 48.5; 10.52; 66.3249497; 75.0408823; 5.47; 54; 10.52; 73.7208614; 75; 
60; 10.301665; 62.5; 10.52; 85.4972024; 75.1253721; 10.301665; 68; 10.52; 93.2133944; 75; 10.301665; 97.5; 10.52; 133.264868; 75; 10.301665; 50; 10.52; 68.3971431; 75.0140775; 10.301665; 48.5; 10.52; 66.3139059; 75.036609; 10.301665; 54; 10.52; 73.706064; 75.2323075; 
61; 10.301665; 62.5; 10.52; 85.3944783; 75.0002606; 10.301665; 68; 10.52; 93.1959104; 75.3201422; 10.301665; 97.5; 10.52; 133.037453; 75; 10.301665; 50; 10.52; 68.3842128; 75.087716; 10.301665; 48.5; 10.52; 66.3015779; 75.0374776; 10.301665; 54; 10.52; 73.6394077; 75.1326184; 
62; 10.301665; 62.5; 10.52; 85.4147172; 75; 10.301665; 68; 10.52; 92.8627669; 75; 10.301665; 97.5; 10.52; 133.090357; 75; 10.301665; 50; 10.52; 68.3699665; 75.0462394; 10.301665; 48.5; 10.52; 66.2879816; 75.0378352; 10.301665; 54; 10.52; 73.6225993; 75.2190548; 
63; 10.301665; 62.5; 10.52; 85.4766117; 75.1193049; 10.301665; 68; 10.52; 92.9898229; 75; 10.301665; 97.5; 10.52; 133.265656; 75; 10.301665; 50; 10.52; 68.3544224; 75; 10.301665; 48.5; 10.52; 66.2731294; 75.0399554; 10.301665; 54; 10.52; 73.6539619; 75.1187676; 
64; 10.301665; 62.5; 10.52; 85.3475457; 75.1056316; 10.301665; 68; 10.52; 93.2755383; 75.2235576; 10.301665; 97.5; 10.52; 133.154316; 75; 10.301665; 50; 10.52; 68.3375939; 75.040547; 10.301665; 48.5; 10.52; 66.2570318; 75.0372548; 10.301665; 54; 10.52; 73.6337783; 75.1662839; 
65; 10.301665; 62.5; 10.52; 85.3548214; 75.0387001; 10.301665; 68; 10.52; 93.1067289; 75; 10.301665; 97.5; 10.52; 133.112274; 75; 10.301665; 50; 10.52; 68.3194923; 75; 10.301665; 48.5; 10.52; 66.2396988; 75; 10.301665; 54; 10.52; 73.6068645; 75; 
66; 10.301665; 62.5; 10.52; 85.3949079; 75.1044532; 10.301665; 68; 10.52; 93.0805165; 75.3041164; 10.301665; 97.5; 10.52; 133.074519; 75.1268581; 10.301665; 50; 10.52; 68.3001279; 75.0543474; 10.301665; 48.5; 10.52; 66.2211395; 75.0586525; 10.301665; 54; 10.52; 73.5863577; 75; 
67; 10.301665; 62.5; 10.52; 85.3332151; 75.0095845; 10.301665; 68; 10.52; 93.0525992; 75; 10.301665; 97.5; 10.52; 133.028957; 75; 10.301665; 50; 10.52; 68.2795102; 75; 10.301665; 48.5; 10.52; 66.2013633; 75.0377813; 10.301665; 54; 10.52; 73.5672013; 75; 
68; 10.301665; 62.5; 10.52; 85.3056054; 75; 10.301665; 68; 10.52; 93.0229894; 75.1189927; 10.301665; 97.5; 10.52; 132.988864; 75.1652757; 10.301665; 50; 10.52; 68.2576488; 75.0301658; 10.301665; 48.5; 10.52; 66.1803791; 75.0469624; 10.301665; 54; 10.52; 73.5390722; 75; 
69; 8.80792361; 62.5; 10.52; 85.2780967; 75; 8.80792361; 68; 10.52; 92.9015095; 75.3443029; 8.80792361; 97.5; 10.52; 132.949103; 75; 8.80792361; 50; 10.52; 68.2345528; 75.0233567; 8.80792361; 48.5; 10.52; 66.1581957; 75.033815; 8.80792361; 54; 10.52; 73.5120553; 75; 
70; 8.80792361; 62.5; 10.0123993; 85.2444652; 75; 8.80792361; 68; 10.0123993; 92.9111035; 75; 8.80792361; 97.5; 10.0123993; 132.899217; 75; 8.80792361; 50; 10.0123993; 68.2102314; 75.0029866; 8.80792361; 48.5; 10.0123993; 66.1348221; 75.0407745; 8.80792361; 54; 10.0123993; 73.4837284; 75; 
71; 8.80792361; 62.5; 10.0123993; 85.2107934; 75; 8.80792361; 68; 10.0123993; 92.9651335; 75.2115364; 8.80792361; 97.5; 10.0123993; 132.849424; 75; 8.80792361; 50; 10.0123993; 68.1846934; 75.0347759; 8.80792361; 48.5; 10.0123993; 66.1102669; 75.0302354; 8.80792361; 54; 10.0123993; 73.4541019; 75; 
72; 8.80792361; 62.5; 10.0123993; 85.1756251; 75; 8.80792361; 68; 10.0123993; 92.8590859; 75.1649075; 8.80792361; 97.5; 10.0123993; 132.797277; 75; 8.80792361; 50; 10.0123993; 68.1579479; 75; 8.80792361; 48.5; 10.0123993; 66.0845388; 75; 8.80792361; 54; 10.0123993; 73.4231859; 75; 
73; 8.80792361; 62.5; 10.0123993; 85.1389711; 75; 8.80792361; 68; 10.0123993; 92.8345674; 75.1768107; 8.80792361; 97.5; 10.0123993; 132.742792; 75; 8.80792361; 50; 10.0123993; 68.1300038; 75; 8.80792361; 48.5; 10.0123993; 66.0576464; 75.063984; 8.80792361; 54; 10.0123993; 73.3909901; 75.088014; 
74; 8.80792361; 62.5; 10.0123993; 85.1008424; 75; 8.80792361; 68; 10.0123993; 92.8229065; 75.1640641; 8.80792361; 97.5; 10.0123993; 132.685986; 75.0574448; 8.80792361; 50; 10.0123993; 68.0636064; 75; 8.80792361; 48.5; 10.0123993; 66.0295982; 75.0301163; 8.80792361; 54; 10.0123993; 73.3575239; 75; 
75; 8.80792361; 62.5; 10.0123993; 85.0612499; 75; 8.80792361; 68; 10.0123993; 92.7687734; 75.1685091; 8.80792361; 97.5; 10.0123993; 132.626878; 75.0510728; 8.80792361; 50; 10.0123993; 68.0508718; 75; 8.80792361; 48.5; 10.0123993; 66.0004028; 75; 8.80792361; 54; 10.0123993; 73.3227967; 75; 
76; 8.80792361; 62.5; 10.0123993; 85.0202042; 75; 8.80792361; 68; 10.0123993; 92.6610566; 75.2277665; 8.80792361; 97.5; 10.0123993; 132.565483; 75.0887598; 8.80792361; 50; 10.0123993; 68.056008; 75; 8.80792361; 48.5; 10.0123993; 65.9700685; 75.0115276; 8.80792361; 54; 10.0123993; 73.2868178; 75; 
77; 8.80792361; 62.5; 13.3339158; 84.977716; 75; 8.80792361; 68; 13.3339158; 92.3368784; 75.3230657; 8.80792361; 97.5; 13.3339158; 132.450191; 75.1593042; 8.80792361; 50; 13.3339158; 68.0062248; 75; 8.80792361; 48.5; 13.3339158; 65.9303344; 75.0976934; 8.80792361; 54; 13.3339158; 73.2495964; 75; 
78; 13.9074065; 62.5; 14.0346445; 72.1535747; 75; 13.9074065; 68; 14.0346445; 70.2576325; 80; 13.9074065; 97.5; 14.0346445; 132.322405; 75; 13.9074065; 50; 14.0346445; 67.9724193; 75; 13.9074065; 48.5; 14.0346445; 65.8973225; 75; 13.9074065; 54; 14.0346445; 73.2111415; 75; 
79; 13.9074065; 62.5; 14.0346445; 78.1378549; 75; 13.9074065; 68; 14.0346445; 48.6114308; 80; 13.9074065; 97.5; 14.0346445; 132.338752; 75.148408; 13.9074065; 50; 14.0346445; 67.9374669; 75; 13.9074065; 48.5; 14.0346445; 65.856805; 75; 13.9074065; 54; 14.0346445; 73.1714623; 75; 
80; 13.9074065; 62.5; 14.0346445; 84.0615528; 79.1484929; 13.9074065; 68; 14.0346445; 48.590974; 80; 13.9074065; 97.5; 14.0346445; 132.332653; 75; 13.9074065; 50; 14.0346445; 51.7435402; 75; 13.9074065; 48.5; 14.0346445; 50.1629795; 75; 13.9074065; 54; 14.0346445; 73.1305677; 75; 
81; 13.9074065; 62.5; 14.0346445; 58.0814816; 80; 13.9074065; 68; 14.0346445; 48.590974; 80; 13.9074065; 97.5; 14.0346445; 132.227238; 75; 13.9074065; 50; 14.0346445; 57.1513459; 76.7800986; 13.9074065; 48.5; 14.0346445; 55.4368055; 75; 13.9074065; 54; 14.0346445; 73.0884666; 75; 
82; 13.9074065; 62.5; 14.0346445; 44.6608217; 76.0777879; 13.9074065; 68; 14.0346445; 48.590974; 78.6657228; 13.9074065; 97.5; 14.0346445; 131.998665; 75; 13.9074065; 50; 14.0346445; 56.9376355; 75; 13.9074065; 48.5; 14.0346445; 71.7798759; 75; 13.9074065; 54; 14.0346445; 73.0393981; 75; 
83; 11.8908325; 62.5; 14.0346445; 71.4391823; 75; 11.8908325; 68; 14.0346445; 77.7258304; 75; 11.8908325; 97.5; 14.0346445; 131.9928; 75; 11.8908325; 50; 14.0346445; 57.1513459; 75; 11.8908325; 48.5; 14.0346445; 51.1637953; 80; 11.8908325; 54; 14.0346445; 55.7131148; 75; 
84; 11.8908325; 62.5; 14.0346445; 93.2989294; 75; 11.8908325; 68; 14.0346445; 101.834159; 75; 11.8908325; 97.5; 14.0346445; 132.043999; 75; 11.8908325; 50; 14.0346445; 56.9376355; 79.2716957; 11.8908325; 48.5; 14.0346445; 34.7773161; 75.992427; 11.8908325; 54; 14.0346445; 38.58695; 80; 
85; 11.8908325; 62.5; 14.0346445; 66.633583; 75; 11.8908325; 68; 14.0346445; 94.8247691; 75; 11.8908325; 97.5; 14.0346445; 131.758732; 75; 11.8908325; 50; 14.0346445; 57.1513459; 75; 11.8908325; 48.5; 14.0346445; 55.4368055; 75; 11.8908325; 54; 14.0346445; 38.58695; 80; 
86; 11.8908325; 62.5; 14.0346445; 71.4391823; 75; 11.8908325; 68; 14.0346445; 92.4704693; 75; 11.8908325; 97.5; 14.0346445; 100.481093; 80; 11.8908325; 50; 14.0346445; 56.9376355; 75; 11.8908325; 48.5; 14.0346445; 55.2295065; 75; 11.8908325; 54; 14.0346445; 38.58695; 80; 
87; 11.8908325; 62.5; 14.0346445; 71.1720444; 80; 11.8908325; 68; 14.0346445; 70.392813; 80; 11.8908325; 97.5; 14.0346445; 69.6708819; 75.934107; 11.8908325; 50; 14.0346445; 57.1513459; 75; 11.8908325; 48.5; 14.0346445; 55.4368055; 75.245344; 11.8908325; 54; 14.0346445; 61.7234535; 75; 
88; 11.8908325; 62.5; 14.0346445; 44.7254596; 80; 11.8908325; 68; 14.0346445; 48.590974; 76.1006579; 11.8908325; 97.5; 14.0346445; 78.2686162; 80; 11.8908325; 50; 14.0346445; 56.9376355; 75; 11.8908325; 48.5; 14.0346445; 71.7901892; 75; 11.8908325; 54; 14.0346445; 61.4926464; 75; 
89; 19.7347614; 62.5; 11.9996211; 44.6608217; 80; 19.7347614; 68; 11.9996211; 77.7258304; 75; 19.7347614; 97.5; 11.9996211; 78.1828462; 80; 19.7347614; 50; 11.9996211; 35.7286574; 78.4076508; 19.7347614; 48.5; 11.9996211; 54.154259; 75; 19.7347614; 54; 11.9996211; 40.0814162; 77.3589924; 
90; 19.7347614; 62.5; 14.0346445; 44.6608217; 78.1696695; 19.7347614; 68; 14.0346445; 101.645143; 75; 19.7347614; 97.5; 14.0346445; 69.6708819; 78.035737; 19.7347614; 50; 14.0346445; 47.2628766; 80; 19.7347614; 48.5; 14.0346445; 37.7278387; 80; 19.7347614; 54; 14.0346445; 40.0665075; 80; 
91; 19.7347614; 62.5; 14.0346445; 71.4391823; 75; 19.7347614; 68; 14.0346445; 72.9479344; 75; 19.7347614; 97.5; 14.0346445; 69.6708819; 80; 19.7347614; 50; 14.0346445; 47.1478125; 80; 19.7347614; 48.5; 14.0346445; 34.6567994; 77.7798138; 19.7347614; 54; 14.0346445; 38.58695; 78.6293826; 
92; 19.7347614; 62.5; 14.0346445; 71.1720444; 80; 19.7347614; 68; 14.0346445; 75.2488927; 75; 19.7347614; 97.5; 14.0346445; 69.6708819; 80; 19.7347614; 50; 14.0346445; 35.7286574; 80; 19.7347614; 48.5; 14.0346445; 34.6567993; 79.1607819; 19.7347614; 54; 14.0346445; 61.7234535; 75; 
93; 19.7347614; 62.5; 14.0346445; 44.6608217; 76.4210215; 19.7347614; 68; 14.0346445; 74.9829587; 75; 19.7347614; 97.5; 14.0346445; 69.6708819; 80; 19.7347614; 50; 14.0346445; 35.7286574; 80; 19.7347614; 48.5; 14.0346445; 34.6567977; 79.136835; 19.7347614; 54; 14.0346445; 61.4926464; 75; 
94; 19.7347614; 62.5; 14.0346445; 64.202843; 80; 19.7347614; 68; 14.0346445; 48.9679816; 80; 19.7347614; 97.5; 14.0346445; 69.6708819; 80; 19.7347614; 50; 14.0346445; 35.7286574; 78.0777439; 19.7347614; 48.5; 14.0346445; 34.6567977; 79.1259064; 19.7347614; 54; 14.0346445; 53.7074315; 75; 
95; 19.7347614; 62.5; 11.9996211; 64.007894; 80; 19.7347614; 68; 11.9996211; 48.590974; 80; 19.7347614; 97.5; 11.9996211; 69.6708819; 80; 19.7347614; 50; 11.9996211; 35.7286574; 80; 19.7347614; 48.5; 11.9996211; 34.6567977; 79.1046284; 19.7347614; 54; 11.9996211; 53.5565913; 80; 
96; 20.7; 62.5; 36.0657344; 45.6565154; 76.2523003; 20.7; 68; 36.0657344; 62.6188483; 75; 20.7; 97.5; 36.0657344; 111.445124; 76.941872; 20.7; 50; 36.0657344; 57.1513459; 75; 20.7; 48.5; 36.0657344; 55.4368055; 75; 20.7; 54; 36.0657344; 39.8924635; 80; 
