t; nomPriceB5; nomPlPowB5; integrPriceB5; integrPlPowB5; integrT_in_B5; disagg_price_bus5; PlPowB5; disaggT_in_B5; nomPriceB10; nomPlPowB10; integrPriceB10; integrPlPowB10; integrT_in_B10; disagg_price_bus10; PlPowB10; disaggT_in_B10;  initFeasThres; finalFeasThres; accept_gap; iterations; CPUmaster; CPUsubproblem; CPUfeasPt; finalDetectGap; nomCongestionCost; intCongestionCost; disaggCongestionCost; Objective; nomImprovPercent; CoopPotentialPercent; nominalCost; integratedCost
1; 10.52; 35.5; 10.52; 30.4082761; 80; 10.52; 30.4082761; 80; 10.52; 97.5; 10.52; 83.515688; 80; 10.52; 83.515688; 80; 266; 266; 0.0001; 51; 2.07620436; 4.12705759; 0.506121223; 5.89770648e-05; 5.12625835e-10; 3.40752473e-10; 1.72405514e-10; 1805421.63; 0.903896464; 99.6195739; 1821889.63; 1805358.74
2; 10.52; 35.5; 10.52; 34.2267928; 80; 10.52; 25.3673467; 80; 10.52; 97.5; 10.52; 69.6708819; 80; 10.52; 89.1340571; 80; 
3; 10.52; 35.5; 10.52; 34.1384119; 80; 10.52; 25.3675913; 80; 10.52; 97.5; 10.52; 69.6708819; 80; 10.52; 95.1346892; 80; 
4; 10.52; 35.5; 10.52; 25.3673467; 80; 10.52; 25.3675889; 80; 10.52; 97.5; 10.52; 79.4369053; 80; 10.52; 96.7903558; 80; 
5; 10.52; 35.5; 10.52; 29.3215922; 80; 10.52; 25.3673467; 80; 10.52; 97.5; 10.52; 93.3237932; 80; 10.52; 90.4489831; 80; 
6; 10.52; 35.5; 10.52; 39.0730112; 80; 10.52; 25.3673467; 80; 10.52; 97.5; 10.52; 105.949589; 80; 10.52; 91.8112956; 80; 
7; 10.52; 35.5; 10.52; 35.0605403; 80; 10.52; 25.3673467; 80; 10.52; 97.5; 10.52; 105.324447; 80; 10.52; 105.033424; 80; 
8; 10.52; 35.5; 10.52; 32.7847825; 80; 10.52; 25.3673467; 80; 10.52; 97.5; 10.52; 96.9645464; 80; 10.52; 104.381528; 79.9758822; 
9; 10.52; 35.5; 10.52; 32.710787; 80; 10.52; 25.3673467; 80; 10.52; 97.5; 10.52; 90.5609097; 80; 10.52; 97.9040164; 80; 
10; 10.52; 35.5; 10.52; 25.3673467; 80; 13.5363881; 25.3673467; 80; 10.52; 97.5; 10.52; 76.6458206; 80; 13.5363881; 76.6464198; 80; 
11; 14.59; 35.5; 14.59; 25.3673467; 80; 11.5736119; 25.3673467; 80; 14.59; 97.5; 14.59; 69.6708819; 80; 11.5736119; 69.6708819; 80; 
12; 15.5475; 35.5; 15.1991128; 25.3673467; 80; 15.1991128; 25.3673467; 80; 15.5475; 97.5; 15.1991128; 69.6708819; 80; 15.1991128; 69.6708819; 80; 
13; 15.5475; 35.5; 15.1991128; 25.3673467; 80; 15.1991128; 25.3673467; 80; 15.5475; 97.5; 15.1991128; 69.6708819; 80; 15.1991128; 69.6708819; 80; 
14; 15.5475; 35.5; 15.1991128; 25.3673467; 80; 15.1991128; 25.3673467; 80; 15.5475; 97.5; 15.1991128; 69.6708819; 80; 15.1991128; 69.6708819; 80; 
15; 15.5475; 35.5; 15.1991128; 25.3673467; 80; 15.1991128; 25.3673467; 80; 15.5475; 97.5; 15.1991128; 69.6708819; 80; 15.1991128; 69.6708819; 80; 
16; 15.5475; 35.5; 15.1991128; 25.3673467; 80; 15.1991128; 25.3673467; 80; 15.5475; 97.5; 15.1991128; 69.6708819; 80; 15.1991128; 69.6708819; 80; 
17; 15.5475; 35.5; 15.1991128; 25.3673467; 80; 15.1991128; 25.3673467; 80; 15.5475; 97.5; 15.1991128; 69.6708819; 80; 15.1991128; 69.6708819; 80; 
18; 15.5475; 35.5; 15.1991128; 25.3673467; 80; 15.1991128; 25.3673467; 80; 15.5475; 97.5; 15.1991128; 69.6708819; 80; 15.1991128; 69.6708819; 80; 
19; 15.5475; 35.5; 15.1991128; 25.3673467; 80; 15.1991128; 25.3673467; 80; 15.5475; 97.5; 15.1991128; 69.6708819; 80; 15.1991128; 69.6708819; 80; 
20; 15.5475; 35.5; 15.1991128; 25.3673467; 80; 15.1991128; 25.3673467; 80; 15.5475; 97.5; 15.1991128; 69.6708819; 80; 15.1991128; 69.6708819; 80; 
21; 15.5475; 35.5; 15.1991128; 25.3673467; 80; 15.1991128; 25.3673467; 80; 15.5475; 97.5; 15.1991128; 69.6708819; 80; 15.1991128; 69.6708819; 80; 
22; 15.5475; 35.5; 15.1991128; 25.3673467; 80; 15.1991128; 25.3673467; 80; 15.5475; 97.5; 15.1991128; 69.6708819; 80; 15.1991128; 69.6708819; 80; 
23; 15.5475; 35.5; 15.1991128; 25.3673467; 80; 15.1991128; 25.3673467; 80; 15.5475; 97.5; 15.1991128; 69.6708819; 80; 15.1991128; 69.6708819; 80; 
24; 15.5475; 35.5; 15.1991128; 25.3673467; 80; 15.1991128; 25.3673467; 80; 15.5475; 97.5; 15.1991128; 69.6708819; 80; 15.1991128; 69.6708819; 80; 
25; 17.81; 35.5; 15.6215334; 25.3673467; 80; 15.6215334; 25.3673467; 80; 17.81; 97.5; 15.6215334; 69.6708819; 80; 15.6215334; 69.6708819; 80; 
26; 16; 35.5; 15.6215334; 25.3673467; 80; 15.6215334; 25.3673467; 80; 16; 97.5; 15.6215334; 69.6708819; 80; 15.6215334; 69.6708819; 80; 
27; 16; 35.5; 15.6215334; 25.3673467; 80; 15.6215334; 25.3673467; 80; 16; 97.5; 15.6215334; 69.6708819; 80; 15.6215334; 69.6708819; 80; 
28; 16; 35.5; 16; 25.3673467; 80; 16.1369331; 25.3673467; 80; 16; 97.5; 16; 69.6708819; 80; 16.1369331; 69.6708819; 80; 
29; 16; 35.5; 16; 25.3673467; 80; 16; 25.3673467; 80; 16; 97.5; 16; 69.6708819; 80; 16; 69.6708819; 80; 
30; 16; 35.5; 15.6215334; 25.3673467; 80; 15.6215334; 25.3673467; 80; 16; 97.5; 15.6215334; 69.6708819; 80; 15.6215334; 69.6708819; 80; 
31; 16; 35.5; 15.6215334; 25.3673467; 80; 15.6215334; 25.3673467; 80; 16; 97.5; 15.6215334; 69.6708819; 80; 15.6215334; 69.6708819; 80; 
32; 16; 35.5; 15.6215334; 25.3673467; 80; 15.6215334; 25.3673467; 80; 16; 97.5; 15.6215334; 69.6708819; 80; 15.6215334; 69.6708819; 80; 
33; 16; 35.5; 15.6215334; 25.3673467; 80; 15.6215334; 25.3673467; 80; 16; 97.5; 15.6215334; 69.6708819; 80; 15.6215334; 69.6708819; 80; 
34; 16; 35.5; 15.6215334; 25.3673467; 80; 15.6215334; 25.3673467; 80; 16; 97.5; 15.6215334; 69.6708819; 80; 15.6215334; 69.6708819; 80; 
35; 16; 35.5; 15.6215334; 25.3673467; 80; 15.6215334; 25.3673467; 80; 16; 97.5; 15.6215334; 69.6708819; 80; 15.6215334; 69.6708819; 80; 
36; 16.27; 35.5; 15.6215334; 25.3673467; 80; 15.6215334; 25.3673467; 80; 16.27; 97.5; 15.6215334; 69.6708819; 80; 15.6215334; 69.6708819; 80; 
37; 20.7; 35.5; 18.2707993; 25.3673467; 80; 18.2707993; 27.6435465; 80; 20.7; 97.5; 18.2707993; 69.6708819; 80; 18.2707993; 69.6708819; 80; 
38; 20.7; 35.5; 18.2707993; 25.3673467; 80; 18.2707993; 27.6208394; 80; 20.7; 97.5; 18.2707993; 69.6708819; 80; 18.2707993; 69.6708819; 80; 
39; 20.7; 35.5; 18.2707993; 25.3673467; 80; 18.2707993; 25.3673467; 80; 20.7; 97.5; 18.2707993; 69.6708819; 80; 18.2707993; 69.6708819; 80; 
40; 20.7; 35.5; 18.2707993; 25.3673467; 80; 18.2707993; 25.3673467; 80; 20.7; 97.5; 18.2707993; 69.6708819; 80; 18.2707993; 69.6708819; 80; 
41; 20.7; 35.5; 18.2707993; 25.3673467; 80; 18.2707993; 25.3673467; 80; 20.7; 97.5; 18.2707993; 69.6708819; 80; 18.2707993; 69.6708819; 80; 
42; 20.7; 35.5; 18.2707993; 25.3673467; 80; 18.2707993; 25.3673467; 80; 20.7; 97.5; 18.2707993; 69.6708819; 80; 18.2707993; 69.6708819; 80; 
43; 6.67874889; 35.5; 11.5527365; 30.4590709; 80; 18.2707993; 25.3673467; 80; 6.67874889; 97.5; 11.5527365; 91.2519144; 80; 18.2707993; 97.9967332; 80; 
44; 6.67874889; 35.5; 9.09326672; 40.8205889; 80; 5.93368639; 32.2573065; 80; 6.67874889; 97.5; 9.09326672; 105.022351; 80; 5.93368639; 117.877223; 79.0293224; 
45; 7.81140221; 35.5; 10.6353997; 47.2973897; 75; 6.93998408; 47.3986818; 75.4679092; 7.81140221; 97.5; 10.6353997; 120.579118; 75; 6.93998408; 116.807762; 75; 
46; 4.67685; 35.5; 5.47; 48.5142431; 75; 5.47; 51.9330266; 75.6236373; 4.67685; 97.5; 5.47; 138.324445; 75; 5.47; 131.330421; 75; 
47; 5.47; 35.5; 5.47; 48.5406346; 75; 5.47; 48.2743748; 75.972684; 5.47; 97.5; 5.47; 133.293761; 75; 5.47; 136.172268; 75; 
48; 4.67685; 35.5; 5.47; 48.5510118; 75; 5.47; 48.2835783; 76.2782695; 4.67685; 97.5; 5.47; 133.322431; 75; 5.47; 133.543443; 75; 
49; 5.47; 35.5; 5.47; 48.5544736; 75; 5.47; 48.2862031; 76.1840063; 5.47; 97.5; 5.47; 133.332111; 75; 5.47; 133.411583; 75; 
50; 4.67685; 35.5; 5.47; 48.5533236; 75; 5.47; 48.2858997; 75.5947524; 4.67685; 97.5; 5.47; 133.329114; 75; 5.47; 133.472795; 75; 
51; 4.67685; 35.5; 5.47; 48.5500762; 75; 5.47; 48.2834057; 76.1149772; 4.67685; 97.5; 5.47; 133.320349; 75; 5.47; 133.599123; 75.2487941; 
52; 4.67685; 35.5; 5.47; 48.5452014; 75; 5.47; 48.2795311; 76.0077316; 4.67685; 97.5; 5.47; 133.307118; 75; 5.47; 133.085447; 75.0305365; 
53; 4.67685; 35.5; 5.47; 48.5390563; 75; 5.47; 48.2744602; 75.7834677; 4.67685; 97.5; 5.47; 133.290396; 75; 5.47; 133.272246; 75; 
54; 5.47; 35.5; 5.47; 48.5318175; 75; 5.47; 48.2683259; 75.4393874; 5.47; 97.5; 5.47; 133.27067; 75; 5.47; 133.678269; 75; 
55; 5.47; 35.5; 5.47; 48.5235716; 75; 5.47; 48.2611944; 76.6617088; 5.47; 97.5; 5.47; 133.248176; 75; 5.47; 133.32266; 75.2130987; 
56; 5.47; 35.5; 5.47; 48.514363; 75; 5.47; 48.2368552; 76.21358; 5.47; 97.5; 5.47; 133.223038; 75; 5.47; 133.297996; 75.125346; 
57; 5.47; 35.5; 5.47; 48.5042161; 75; 5.47; 48.2280721; 76.2252466; 5.47; 97.5; 5.47; 133.195321; 75; 5.47; 133.331359; 75.124997; 
58; 5.47; 35.5; 5.47; 48.493146; 75; 5.47; 48.2130394; 76.2403891; 5.47; 97.5; 5.47; 133.165067; 75; 5.47; 133.301788; 75.1264954; 
59; 5.47; 35.5; 5.47; 48.4811633; 75; 5.47; 48.190684; 76.2585459; 5.47; 97.5; 5.47; 133.132306; 75; 5.47; 133.261163; 75.1294453; 
60; 5.47; 35.5; 5.47; 48.4682766; 75; 5.47; 48.1633241; 76.2776185; 5.47; 97.5; 5.47; 133.097061; 75; 5.47; 133.219855; 75.130323; 
61; 5.47; 35.5; 5.47; 48.4544933; 75; 5.47; 48.1631063; 76.2719958; 5.47; 97.5; 5.47; 133.059353; 75; 5.47; 133.181523; 75.1312378; 
62; 5.47; 35.5; 5.47; 48.4398204; 75; 5.47; 48.1663018; 76.2850417; 5.47; 97.5; 5.47; 133.0192; 75; 5.47; 133.122255; 75.0383133; 
63; 5.47; 35.5; 5.47; 48.4242646; 75; 5.47; 48.1615017; 76.2994889; 5.47; 97.5; 5.47; 132.976621; 75; 5.47; 133.178758; 75; 
64; 5.47; 35.5; 5.47; 48.4078325; 75; 5.47; 48.1660654; 76.2218643; 5.47; 97.5; 5.47; 132.931634; 75; 5.47; 133.155507; 75.0753159; 
65; 5.47; 35.5; 5.47; 48.3905306; 75; 5.47; 48.1405762; 76.2740019; 5.47; 97.5; 5.47; 132.884258; 75; 5.47; 133.079988; 75.1292589; 
66; 5.47; 35.5; 5.47; 48.3723652; 75; 5.47; 48.1234866; 76.3779756; 5.47; 97.5; 5.47; 132.834508; 75; 5.47; 133.028849; 75.1029501; 
67; 5.47; 35.5; 5.47; 48.3533427; 75; 5.47; 48.1055243; 76.2544941; 5.47; 97.5; 5.47; 132.782404; 75; 5.47; 132.975358; 75.0999926; 
68; 5.47; 35.5; 5.47; 48.3334693; 75; 5.47; 48.0866998; 76.3091164; 5.47; 97.5; 5.47; 132.727962; 75; 5.47; 132.919535; 75.1007515; 
69; 4.67685; 35.5; 5.47; 48.3127514; 75; 5.47; 48.0670213; 76.3212548; 4.67685; 97.5; 5.47; 132.671199; 75; 5.47; 132.8614; 75.1031672; 
70; 4.67685; 35.5; 5.47; 48.2911952; 75; 5.47; 48.046496; 76.334332; 4.67685; 97.5; 5.47; 132.612133; 75; 5.47; 132.800971; 75.1041085; 
71; 4.67685; 35.5; 5.47; 48.2688067; 75; 5.47; 48.0251306; 76.2024498; 4.67685; 97.5; 5.47; 132.55078; 75; 5.47; 132.738264; 75; 
72; 4.67685; 35.5; 5.47; 48.245592; 75; 5.47; 48.0029314; 76.4743435; 4.67685; 97.5; 5.47; 132.487157; 75; 5.47; 132.673298; 75.1094322; 
73; 4.67685; 35.5; 5.47; 48.2215574; 75; 5.47; 47.9799045; 76.3380059; 4.67685; 97.5; 5.47; 132.421281; 75; 5.47; 132.606087; 75; 
74; 4.67685; 35.5; 5.47; 48.1967086; 75; 5.47; 47.9560562; 76.4421346; 4.67685; 97.5; 5.47; 132.353168; 75; 5.47; 132.53665; 75; 
75; 4.67685; 35.5; 5.47; 48.1710518; 75; 5.47; 47.9313925; 76.3552346; 4.67685; 97.5; 5.47; 132.282835; 75; 5.47; 132.465002; 75; 
76; 4.67685; 35.5; 5.47; 48.1445929; 75; 5.47; 47.9059193; 76.1983809; 4.67685; 97.5; 5.47; 132.210297; 75; 5.47; 132.39116; 75; 
77; 4.67685; 35.5; 5.47; 48.1173377; 75; 5.47; 47.8443749; 76.7551155; 4.67685; 97.5; 5.47; 132.135572; 75; 5.47; 132.315139; 75; 
78; 8.44520358; 35.5; 10.5143986; 41.7702007; 80; 10.687747; 36.5255503; 80; 8.44520358; 97.5; 10.5143986; 114.712211; 80; 10.687747; 126.736764; 75; 
79; 9.63314642; 35.5; 10.5143986; 30.4082764; 80; 10.687747; 25.3673467; 75.533408; 9.63314642; 97.5; 10.5143986; 97.5000014; 80; 10.687747; 95.3321602; 75; 
80; 9.63314642; 35.5; 10.5143986; 27.9992458; 80; 10.687747; 40.5774556; 75; 9.63314642; 97.5; 10.5143986; 83.5156887; 80; 10.687747; 69.6708819; 80; 
81; 9.63314642; 35.5; 10.5143986; 27.9729903; 80; 10.687747; 52.7416133; 75; 9.63314642; 97.5; 10.5143986; 69.6708819; 80; 10.687747; 69.6708819; 78.6992871; 
82; 9.63314642; 35.5; 10.5143986; 27.7912755; 80; 10.687747; 40.4259282; 80; 9.63314642; 97.5; 10.5143986; 69.6708819; 80; 10.687747; 69.6708819; 80; 
83; 8.23634019; 35.5; 8.98981084; 32.8588188; 80; 10.687747; 28.2043117; 75.4501446; 8.23634019; 97.5; 8.98981084; 93.6494244; 80; 10.687747; 101.140896; 80; 
84; 8.23634019; 35.5; 10.5143986; 35.5000005; 80; 10.687747; 40.5774556; 75; 8.23634019; 97.5; 10.5143986; 112.6829; 80; 10.687747; 100.826958; 75; 
85; 8.23634019; 35.5; 10.5143986; 35.5000005; 80; 9.13802372; 49.9440539; 75; 8.23634019; 97.5; 10.5143986; 108.980434; 80; 9.13802372; 94.5363805; 75; 
86; 8.23634019; 35.5; 8.98981084; 35.5000005; 80; 10.687747; 40.3763159; 75; 8.23634019; 97.5; 8.98981084; 96.3280496; 80; 10.687747; 94.2883219; 76.4224544; 
87; 13.32; 35.5; 10.5143986; 30.4082764; 80; 9.13802372; 45.1685415; 75; 13.32; 97.5; 10.5143986; 84.402736; 80; 9.13802372; 69.6708819; 80; 
88; 13.32; 35.5; 10.5143986; 25.3673467; 80; 10.687747; 42.4805466; 75; 13.32; 97.5; 10.5143986; 77.7575504; 80; 10.687747; 69.6708819; 78.7778042; 
89; 13.32; 35.5; 10.5143986; 30.4590709; 80; 10.687747; 28.3218195; 80; 13.32; 97.5; 10.5143986; 69.6708819; 80; 10.687747; 69.6708819; 80; 
90; 13.32; 35.5; 10.5143986; 30.4082764; 80; 10.687747; 25.3673467; 80; 13.32; 97.5; 10.5143986; 79.6663679; 80; 10.687747; 69.6708819; 80; 
91; 13.32; 35.5; 10.5143986; 25.3673467; 80; 10.687747; 25.3673467; 77.6163504; 13.32; 97.5; 10.5143986; 81.9253213; 80; 10.687747; 69.6708819; 78.5409413; 
92; 13.32; 35.5; 10.5143986; 30.4590709; 80; 10.687747; 25.3673467; 78.7918254; 13.32; 97.5; 10.5143986; 72.0060194; 80; 10.687747; 69.6708819; 79.1201055; 
93; 13.32; 35.5; 10.5143986; 30.6886762; 80; 10.687747; 25.3673467; 80; 13.32; 97.5; 10.5143986; 69.6708819; 80; 10.687747; 69.6708819; 80; 
94; 13.32; 35.5; 10.5143986; 25.6449493; 80; 10.687747; 25.3673467; 80; 13.32; 97.5; 10.5143986; 69.6708819; 80; 10.687747; 69.6708819; 80; 
95; 13.32; 35.5; 10.5143986; 25.3673467; 80; 10.687747; 25.3673467; 77.9273447; 13.32; 97.5; 10.5143986; 69.6708819; 80; 10.687747; 69.6708819; 78.4833412; 
96; 13.32; 35.5; 20.7; 40.5774556; 75; 20.7; 40.5774556; 75; 13.32; 97.5; 20.7; 109.377001; 75; 20.7; 107.4354; 75; 
