t; nomPriceB5; nomPlPowB5; integrPriceB5; integrPlPowB5; integrT_in_B5; disagg_price_bus5; PlPowB5; disaggT_in_B5;  initFeasThres; finalFeasThres; accept_gap; iterations; CPUmaster; CPUsubproblem; CPUfeasPt; finalDetectGap; nomCongestionCost; intCongestionCost; disaggCongestionCost; Objective; nomImprovPercent; CoopPotentialPercent; nominalCost; integratedCost
1; 10.52; 71; 10.52; 60.8165523; 80; 10.52; 60.8165523; 80; 142; 142; 0.0001; 36; 1.53296176; 2.68242311; 0.487182931; 4.05192831e-05; 6.18824889e-10; 5.68573351e-10; 2.13949761e-09; 1804435.04; 0.510620832; 99.396697; 1813696.15; 1804378.83
2; 10.52; 71; 10.52; 50.7346935; 80; 10.52; 50.7346935; 80; 
3; 10.52; 71; 10.52; 50.7346935; 80; 10.52; 50.7346935; 80; 
4; 10.52; 71; 10.52; 50.7346935; 80; 10.52; 50.7346935; 80; 
5; 10.52; 71; 10.52; 50.7346935; 80; 10.52; 50.7346935; 80; 
6; 10.52; 71; 10.52; 50.7346935; 80; 10.52; 50.7346935; 80; 
7; 10.52; 71; 10.52; 50.7346935; 80; 10.52; 50.7346935; 80; 
8; 10.52; 71; 10.52; 69.8574689; 80; 10.52; 67.6019828; 80; 
9; 10.52; 71; 10.52; 77.2645831; 80; 10.52; 75.0322915; 80; 
10; 10.52; 71; 10.52; 58.2567787; 80; 13.5363881; 58.2574658; 80; 
11; 14.59; 71; 14.59; 50.7346935; 80; 11.5736119; 50.7346935; 80; 
12; 15.5475; 71; 15.3761538; 50.7346935; 80; 15.3761538; 50.7346935; 80; 
13; 15.5475; 71; 15.3761538; 50.7346935; 80; 15.3761538; 50.7346935; 80; 
14; 15.5475; 71; 15.3761538; 50.7346935; 80; 15.3761538; 50.7346935; 80; 
15; 15.5475; 71; 15.3761538; 50.7346935; 80; 15.3761538; 50.7346935; 80; 
16; 15.5475; 71; 15.3761538; 50.7346935; 80; 15.3761538; 50.7346935; 80; 
17; 15.5475; 71; 15.3761538; 50.7346935; 80; 15.3761538; 50.7346935; 80; 
18; 15.5475; 71; 15.3761538; 50.7346935; 80; 15.3761538; 50.7346935; 80; 
19; 15.5475; 71; 15.3761538; 50.7346935; 80; 15.3761538; 50.7346935; 80; 
20; 15.5475; 71; 15.3761538; 50.7346935; 80; 15.3761538; 50.7346935; 80; 
21; 15.5475; 71; 15.3761538; 50.7346935; 80; 15.3761538; 50.7346935; 80; 
22; 15.5475; 71; 15.3761538; 50.7346935; 80; 15.3761538; 50.7346935; 80; 
23; 15.5475; 71; 15.3761538; 50.7346935; 80; 15.3761538; 50.7346935; 80; 
24; 15.5475; 71; 15.3761538; 50.7346935; 80; 15.3761538; 50.7346935; 80; 
25; 17.81; 71; 16.6238462; 50.7346935; 80; 16.6238462; 50.7346935; 80; 
26; 16; 71; 16; 50.7346935; 80; 16; 50.7346935; 80; 
27; 16; 71; 16; 50.7346935; 80; 16; 50.7346935; 80; 
28; 16; 71; 16; 50.7346935; 80; 16; 50.7346935; 80; 
29; 16; 71; 16; 50.7346935; 80; 16; 50.7346935; 80; 
30; 16; 71; 16; 50.7346935; 80; 16; 50.7346935; 80; 
31; 16; 71; 16; 50.7346935; 80; 16; 50.7346935; 80; 
32; 16; 71; 16; 50.7346935; 80; 16; 50.7346935; 80; 
33; 16; 71; 16; 50.7346935; 80; 16; 50.7346935; 80; 
34; 16; 71; 16; 50.7346935; 80; 16; 50.7346935; 80; 
35; 16; 71; 16; 50.7346935; 80; 16; 50.7346935; 80; 
36; 16; 71; 16; 50.7346935; 80; 16; 50.7346935; 80; 
37; 20.4725; 71; 18.7134503; 50.7346935; 80; 18.7134503; 50.9062664; 80; 
38; 20.4725; 71; 18.7134503; 50.7346935; 80; 18.7134503; 50.9045548; 80; 
39; 20.7; 71; 18.7134503; 50.7346935; 80; 18.7134503; 50.7346935; 80; 
40; 20.7; 71; 20.7; 50.7346935; 80; 18.7134503; 50.7346935; 80; 
41; 20.4725; 71; 18.7134503; 50.7346935; 80; 18.7134503; 50.7346935; 80; 
42; 20.4725; 71; 18.7134503; 50.7346935; 80; 18.7134503; 50.7346935; 80; 
43; 13.4015; 71; 12.9127485; 64.1023604; 80; 16.4792982; 72.2644554; 78.6894486; 
44; 4.67685; 71; 6.32194144; 83.6109579; 79.7482587; 7.02436658; 92.2394458; 75; 
45; 5.47; 71; 7.39408356; 93.3287969; 75; 8.21563342; 87.3219135; 75; 
46; 4.67685; 71; 6.32194144; 96.8411562; 75; 4.96539522; 90.3850458; 75; 
47; 4.67685; 71; 7.39408356; 96.8946516; 75; 5.80747978; 96.9474176; 75.2330318; 
48; 4.67685; 71; 4.67685; 96.9154079; 75; 4.96539522; 96.5383408; 75.2112134; 
49; 4.67685; 71; 4.67685; 96.9238076; 75; 5.80747978; 96.5612944; 75.1644994; 
50; 4.67685; 71; 4.67685; 96.9223545; 75; 4.67685; 96.7060855; 75.1886084; 
51; 4.67685; 71; 4.67685; 96.9169829; 75; 4.67685; 96.708449; 75.1089677; 
52; 4.67685; 71; 4.67685; 96.9083789; 75; 4.67685; 96.7990023; 75.1945002; 
53; 4.67685; 71; 4.67685; 96.8972429; 75; 4.67685; 96.7926857; 75.0525833; 
54; 4.67685; 71; 4.67685; 96.8839188; 75; 4.67685; 96.9709922; 75.0965445; 
55; 5.47; 71; 5.47; 96.8685758; 75; 5.47; 96.9569661; 75; 
56; 5.47; 71; 5.47; 96.8513006; 75; 5.47; 96.9318722; 75.1565741; 
57; 5.47; 71; 5.47; 96.8321414; 75; 5.47; 96.9134729; 75.1051771; 
58; 5.47; 71; 5.47; 96.8111279; 75; 5.47; 96.9016239; 75.032348; 
59; 5.47; 71; 5.47; 96.7882811; 75; 5.47; 96.8792711; 75.0654473; 
60; 5.47; 71; 5.47; 96.7636181; 75; 5.47; 96.8550627; 75.0651566; 
61; 5.47; 71; 5.47; 96.7371538; 75; 5.47; 96.8290327; 75.0655586; 
62; 5.47; 71; 5.47; 96.7089022; 75; 5.47; 96.8012043; 75.0434677; 
63; 5.47; 71; 5.47; 96.6788769; 75; 5.47; 96.7715954; 75.0734778; 
64; 5.47; 71; 5.47; 96.6470909; 75; 5.47; 96.740221; 75.0558198; 
65; 5.47; 71; 5.47; 96.6135574; 75; 5.47; 96.7070951; 75.0677246; 
66; 5.47; 71; 5.47; 96.5782891; 75; 5.47; 96.6722312; 75.0638122; 
67; 5.47; 71; 5.47; 96.5412988; 75; 5.47; 96.635642; 75.0652498; 
68; 4.67685; 71; 5.47; 96.5025991; 75; 5.47; 96.5973405; 75.0632359; 
69; 4.67685; 71; 4.67685; 96.4622026; 75; 4.67685; 96.5573392; 75.0650401; 
70; 4.67685; 71; 4.67685; 96.4201218; 75; 4.67685; 96.5156506; 75.0641412; 
71; 4.67685; 71; 4.67685; 96.3763689; 75; 4.67685; 96.4722871; 75; 
72; 4.67685; 71; 4.67685; 96.3309562; 75; 4.67685; 96.4272609; 75; 
73; 4.67685; 71; 4.67685; 96.283896; 75; 4.67685; 96.3805844; 75; 
74; 4.67685; 71; 4.67685; 96.2352003; 75; 4.67685; 96.3322695; 75; 
75; 4.67685; 71; 4.67685; 96.1848811; 75; 4.67685; 96.2823284; 75; 
76; 4.67685; 71; 4.67685; 96.1329503; 75; 4.67685; 96.2307729; 75.0163882; 
77; 4.67685; 71; 4.67685; 96.0794198; 75; 4.67685; 95.6517112; 75; 
78; 9.43575; 71; 10.89; 77.043261; 80; 9.039175; 77.0010381; 75; 
79; 9.43575; 71; 10.89; 74.6388615; 78.7103688; 9.039175; 74.5966387; 80; 
80; 9.43575; 71; 10.89; 70.7118016; 80; 11.0932675; 70.2490351; 80; 
81; 9.43575; 71; 10.89; 50.7346935; 80; 11.0932675; 50.7346935; 80; 
82; 9.43575; 71; 10.89; 50.7346935; 77.5654272; 11.0932675; 50.7346935; 77.2925273; 
83; 8.06756625; 71; 9.31095; 79.5255668; 75; 9.48474372; 79.4833439; 75; 
84; 8.06756625; 71; 10.89; 102.071678; 75; 11.0932675; 102.869382; 75; 
85; 8.06756625; 71; 9.31095; 97.4102042; 75; 9.48474372; 97.4739577; 75; 
86; 8.06756625; 71; 9.31095; 84.4861361; 80; 9.48474372; 84.4439132; 75; 
87; 9.194135; 71; 10.51715; 67.122388; 80; 9.48474372; 67.0801651; 75; 
88; 13.32; 71; 10.89; 57.2342779; 80; 11.0932675; 56.4892211; 80; 
89; 13.32; 71; 10.89; 50.7346935; 80; 11.0932675; 50.7346935; 77.9999617; 
90; 13.32; 71; 10.89; 50.7346935; 80; 11.0932675; 50.7346935; 80; 
91; 13.32; 71; 10.89; 50.7346935; 80; 11.0932675; 50.7346935; 80; 
92; 13.32; 71; 10.89; 50.7346935; 80; 11.0932675; 50.7346935; 78.2731613; 
93; 13.32; 71; 10.89; 50.7346935; 80; 11.0932675; 50.7346935; 80; 
94; 13.32; 71; 10.89; 50.7346935; 80; 11.0932675; 50.7346935; 80; 
95; 13.32; 71; 10.89; 50.7346935; 80; 11.0932675; 50.7346935; 78.225731; 
96; 13.32; 71; 16; 81.1549111; 75; 17.773465; 81.1549111; 75; 
