t; nomPriceB1; nomPlPowB1; disagg_price_bus1; PlPowB1; disaggT_in_B1; nomPriceB2; nomPlPowB2; disagg_price_bus2; PlPowB2; disaggT_in_B2; nomPriceB3; nomPlPowB3; disagg_price_bus3; PlPowB3; disaggT_in_B3; nomPriceB4; nomPlPowB4; disagg_price_bus4; PlPowB4; disaggT_in_B4; nomPriceB5; nomPlPowB5; disagg_price_bus5; PlPowB5; disaggT_in_B5; nomPriceB6; nomPlPowB6; disagg_price_bus6; PlPowB6; disaggT_in_B6; nomPriceB7; nomPlPowB7; disagg_price_bus7; PlPowB7; disaggT_in_B7; nomPriceB8; nomPlPowB8; disagg_price_bus8; PlPowB8; disaggT_in_B8; nomPriceB9; nomPlPowB9; disagg_price_bus9; PlPowB9; disaggT_in_B9; nomPriceB10; nomPlPowB10; disagg_price_bus10; PlPowB10; disaggT_in_B10; nomPriceB13; nomPlPowB13; disagg_price_bus13; PlPowB13; disaggT_in_B13; nomPriceB14; nomPlPowB14; disagg_price_bus14; PlPowB14; disaggT_in_B14; nomPriceB15; nomPlPowB15; disagg_price_bus15; PlPowB15; disaggT_in_B15; nomPriceB16; nomPlPowB16; disagg_price_bus16; PlPowB16; disaggT_in_B16; nomPriceB18; nomPlPowB18; disagg_price_bus18; PlPowB18; disaggT_in_B18; nomPriceB19; nomPlPowB19; disagg_price_bus19; PlPowB19; disaggT_in_B19; nomPriceB20; nomPlPowB20; disagg_price_bus20; PlPowB20; disaggT_in_B20;  initFeasThres; finalFeasThres; accept_gap; iterations; CPUmaster; CPUsubproblem; CPUsubsolve; CPUsubcutgen; CPUfeasPt; finalDetectGap; nomCongestionCost; disaggCongestionCost; Objective; nomImprovPercent; CoopPotentialPercent; nominalCost; integratedCost
1; 20.7; 54; 16; 46.2548426; 80; 20.7; 48.5; 16; 41.5437012; 80; 20.7; 90; 16; 77.0914043; 80; 20.7; 37; 16; 31.6931329; 80; 20.7; 35.5; 16; 30.4082761; 80; 20.7; 68; 16; 58.2468388; 80; 20.7; 62.5; 16; 53.5356974; 80; 20.7; 85.5; 16; 73.2368341; 80; 20.7; 87.5; 16; 74.9499764; 80; 20.7; 97.5; 16; 83.515688; 80; 20.7; 132.5; 16; 113.495679; 80; 20.7; 97; 16; 83.0874024; 80; 20.7; 158.5; 16; 135.766529; 80; 20.7; 50; 16; 42.8285579; 80; 20.7; 166.5; 16; 142.619098; 80; 20.7; 90.5; 16; 77.5196899; 80; 20.7; 64; 16; 54.8205542; 80; 2850; 252.914707; 0.0001; 475; 2556.52271; 402.862762; 338.385681; 64.4657135; 11.9642897; 2.15912522e-05; 308478.583; 4070.16038; 2073804.58; 60.9036876; 5304348.31; 
2; 20.7; 54; 20.7; 38.58695; 80; 20.7; 48.5; 20.7; 34.6567977; 80; 20.7; 90; 20.7; 78.636316; 80; 20.7; 37; 20.7; 26.4392065; 80; 20.7; 35.5; 20.7; 40.5770871; 75.282738; 20.7; 68; 20.7; 77.7258304; 75.2319498; 20.7; 62.5; 20.7; 44.6608217; 80; 20.7; 85.5; 20.7; 61.0960041; 80; 20.7; 87.5; 20.7; 100.013947; 75.2829636; 20.7; 97.5; 20.7; 111.445124; 75.3089507; 20.7; 132.5; 20.7; 94.6809421; 80; 20.7; 97; 20.7; 69.3135953; 80; 20.7; 158.5; 20.7; 181.168121; 75.3074396; 20.7; 50; 20.7; 35.7286574; 80; 20.7; 166.5; 20.7; 118.976429; 80; 20.7; 90.5; 20.7; 103.443936; 75.2319498; 20.7; 64; 20.7; 45.7326815; 80; 
3; 20.7; 54; 20.7; 38.587322; 80; 20.7; 48.5; 20.7; 34.6567977; 80; 20.7; 90; 20.7; 78.4943389; 80; 20.7; 37; 20.7; 26.4394614; 80; 20.7; 35.5; 20.7; 40.4257212; 80; 20.7; 68; 20.7; 77.4351843; 80; 20.7; 62.5; 20.7; 44.6612523; 80; 20.7; 85.5; 20.7; 61.0965932; 80; 20.7; 87.5; 20.7; 99.6408622; 80; 20.7; 97.5; 20.7; 111.028389; 80; 20.7; 132.5; 20.7; 94.6809421; 80; 20.7; 97; 20.7; 69.3135953; 80; 20.7; 158.5; 20.7; 180.492305; 77.6932848; 20.7; 50; 20.7; 35.7286574; 80; 20.7; 166.5; 20.7; 118.977576; 80; 20.7; 90.5; 20.7; 103.05712; 80; 20.7; 64; 20.7; 45.7331224; 80; 
4; 20.7; 54; 20.7; 38.5873183; 80; 20.7; 48.5; 20.7; 48.419758; 80; 20.7; 90; 20.7; 102.872423; 75.1399407; 20.7; 37; 20.7; 42.2919959; 76.3498009; 20.7; 35.5; 20.7; 25.3677079; 80; 20.7; 68; 20.7; 48.590974; 80; 20.7; 62.5; 20.7; 44.661248; 80; 20.7; 85.5; 20.7; 61.0965873; 80; 20.7; 87.5; 20.7; 62.5260406; 80; 20.7; 97.5; 20.7; 69.6708819; 80; 20.7; 132.5; 20.7; 151.451067; 76.3135823; 20.7; 97; 20.7; 69.3135953; 80; 20.7; 158.5; 20.7; 181.169766; 75; 20.7; 50; 20.7; 57.1513459; 76.3135823; 20.7; 166.5; 20.7; 118.977565; 80; 20.7; 90.5; 20.7; 64.6688699; 80; 20.7; 64; 20.7; 45.733118; 80; 
5; 20.7; 54; 20.7; 38.58695; 80; 20.7; 48.5; 20.7; 48.2824603; 80; 20.7; 90; 20.7; 102.487744; 80; 20.7; 37; 20.7; 42.1338503; 80; 20.7; 35.5; 20.7; 25.3673467; 80; 20.7; 68; 20.7; 48.590974; 80; 20.7; 62.5; 20.7; 44.6608217; 80; 20.7; 85.5; 20.7; 61.0960041; 80; 20.7; 87.5; 20.7; 62.5251504; 80; 20.7; 97.5; 20.7; 69.6708819; 80; 20.7; 132.5; 20.7; 150.884734; 77.5834894; 20.7; 97; 20.7; 69.3135953; 80; 20.7; 158.5; 20.7; 180.492305; 80; 20.7; 50; 20.7; 56.9376355; 80; 20.7; 166.5; 20.7; 118.976429; 80; 20.7; 90.5; 20.7; 64.6688699; 80; 20.7; 64; 20.7; 45.7326815; 80; 
6; 20.7; 54; 20.7; 38.58695; 80; 20.7; 48.5; 20.7; 34.6567977; 80; 20.7; 90; 20.7; 64.3124808; 80; 20.7; 37; 20.7; 26.4394538; 80; 20.7; 35.5; 20.7; 40.5774556; 76.0814838; 20.7; 68; 20.7; 48.590974; 80; 20.7; 62.5; 20.7; 71.4391823; 76.5569664; 20.7; 85.5; 20.7; 61.0960041; 80; 20.7; 87.5; 20.7; 62.5251504; 80; 20.7; 97.5; 20.7; 69.6708819; 80; 20.7; 132.5; 20.7; 151.451067; 75; 20.7; 97; 20.7; 110.873611; 76.5644606; 20.7; 158.5; 20.7; 113.261424; 80; 20.7; 50; 20.7; 35.7286574; 80; 20.7; 166.5; 20.7; 118.976429; 80; 20.7; 90.5; 20.7; 103.443936; 76.0400328; 20.7; 64; 20.7; 45.8070233; 80; 
7; 20.7; 54; 20.7; 38.58695; 80; 20.7; 48.5; 20.7; 34.6567977; 80; 20.7; 90; 20.7; 64.3115833; 80; 20.7; 37; 20.7; 26.4392065; 80; 20.7; 35.5; 20.7; 40.4257212; 80; 20.7; 68; 20.7; 48.590974; 80; 20.7; 62.5; 20.7; 71.1720444; 80; 20.7; 85.5; 20.7; 61.4767137; 80; 20.7; 87.5; 20.7; 62.5251504; 80; 20.7; 97.5; 20.7; 69.6708819; 80; 20.7; 132.5; 20.7; 150.884734; 80; 20.7; 97; 20.7; 110.459013; 80; 20.7; 158.5; 20.7; 113.259844; 80; 20.7; 50; 20.7; 52.6565139; 78.7668782; 20.7; 166.5; 20.7; 118.976429; 80; 20.7; 90.5; 20.7; 103.05712; 77.6185334; 20.7; 64; 20.7; 47.2461182; 80; 
8; 20.7; 54; 20.7; 38.58695; 80; 20.7; 48.5; 20.7; 55.4368055; 76.2044782; 20.7; 90; 20.7; 64.3115833; 80; 20.7; 37; 20.7; 26.4392065; 78.1718466; 20.7; 35.5; 20.7; 25.3673467; 80; 20.7; 68; 20.7; 48.590974; 80; 20.7; 62.5; 20.7; 59.4279177; 80; 20.7; 85.5; 20.7; 97.7288014; 76.7528209; 20.7; 87.5; 20.7; 62.5251504; 80; 20.7; 97.5; 20.7; 69.6708819; 80; 20.7; 132.5; 20.7; 94.6809421; 80; 20.7; 97; 20.7; 69.3135953; 80; 20.7; 158.5; 20.7; 140.189616; 80; 20.7; 50; 20.7; 52.4876435; 80; 20.7; 166.5; 20.7; 118.976429; 80; 20.7; 90.5; 20.7; 103.443936; 75; 20.7; 64; 20.7; 47.1581543; 80; 
9; 20.7; 54; 20.7; 38.58695; 80; 20.7; 48.5; 20.7; 55.2295065; 77.7909417; 20.7; 90; 20.7; 64.3115833; 80; 20.7; 37; 20.7; 42.2919959; 75; 20.7; 35.5; 20.7; 25.3673467; 80; 20.7; 68; 20.7; 48.590974; 80; 20.7; 62.5; 20.7; 59.2806028; 80; 20.7; 85.5; 20.7; 97.3633568; 78.0397061; 20.7; 87.5; 20.7; 62.5251504; 80; 20.7; 97.5; 20.7; 69.6708819; 80; 20.7; 132.5; 20.7; 94.6809421; 80; 20.7; 97; 20.7; 69.3135953; 80; 20.7; 158.5; 20.7; 139.920967; 80; 20.7; 50; 20.7; 35.7286574; 80; 20.7; 166.5; 20.7; 118.976429; 80; 20.7; 90.5; 20.7; 103.05712; 80; 20.7; 64; 20.7; 53.8410142; 80; 
10; 74.8; 54; 20.7; 38.58695; 80; 74.8; 48.5; 20.7; 55.4368055; 75; 74.8; 90; 20.7; 64.3115833; 80; 74.8; 37; 20.7; 54.861856; 75; 74.8; 35.5; 20.7; 40.5774556; 76.1389625; 74.8; 68; 20.7; 48.590974; 80; 20.7; 62.5; 20.7; 44.6608217; 80; 74.8; 85.5; 20.7; 97.7288014; 75; 74.8; 87.5; 20.7; 62.5251504; 80; 74.8; 97.5; 20.7; 69.6708819; 80; 74.8; 132.5; 20.7; 94.6809421; 80; 74.8; 97; 20.7; 94.7437663; 80; 74.8; 158.5; 20.7; 113.259844; 80; 74.8; 50; 20.7; 57.1513459; 75.4683982; 74.8; 166.5; 20.7; 118.976429; 80; 74.8; 90.5; 20.7; 64.6688699; 80; 74.8; 64; 20.7; 53.7601264; 80; 
11; 74.8; 54; 20.7; 38.58695; 80; 74.8; 48.5; 20.7; 55.2295065; 80; 74.8; 90; 20.7; 64.3115833; 80; 74.8; 37; 20.7; 39.0402337; 80; 74.8; 35.5; 20.7; 40.4257212; 80; 74.8; 68; 20.7; 77.7258304; 76.653673; 20.7; 62.5; 20.7; 44.6608217; 80; 74.8; 85.5; 20.7; 97.3633568; 80; 74.8; 87.5; 20.7; 62.5251504; 80; 74.8; 97.5; 20.7; 69.6708819; 80; 74.8; 132.5; 20.7; 94.6809421; 80; 74.8; 97; 20.7; 94.4900777; 80; 74.8; 158.5; 20.7; 113.259844; 80; 74.8; 50; 20.7; 56.9376355; 80; 74.8; 166.5; 20.7; 118.976429; 80; 74.8; 90.5; 20.7; 64.6688699; 80; 74.8; 64; 20.7; 48.3307129; 80; 
12; 74.8; 54; 20.7; 38.58695; 80; 74.8; 48.5; 20.7; 34.6567977; 80; 74.8; 90; 20.7; 64.3115833; 80; 74.8; 37; 20.7; 26.4392012; 80; 74.8; 35.5; 20.7; 25.3673467; 80; 74.8; 68; 20.7; 77.4351843; 80; 20.7; 62.5; 20.7; 69.9792042; 77.1198016; 74.8; 85.5; 20.7; 61.4580992; 80; 74.8; 87.5; 20.7; 62.5251504; 80; 74.8; 97.5; 20.7; 69.6708819; 80; 74.8; 132.5; 20.7; 94.6809421; 80; 74.8; 97; 20.7; 85.9094205; 80; 74.8; 158.5; 20.7; 113.259844; 80; 74.8; 50; 20.7; 35.7286574; 80; 74.8; 166.5; 20.7; 190.313982; 76.7042204; 74.8; 90.5; 20.7; 64.6688699; 80; 74.8; 64; 20.7; 73.1537227; 76.4847074; 
13; 74.8; 54; 20.7; 38.58695; 80; 74.8; 48.5; 20.7; 34.6567977; 80; 74.8; 90; 20.7; 65.9383849; 80; 74.8; 37; 20.7; 26.4392065; 80; 74.8; 35.5; 20.7; 25.3673467; 80; 74.8; 68; 20.7; 48.590974; 80; 20.7; 62.5; 20.7; 69.7266309; 80; 74.8; 85.5; 20.7; 69.3475667; 80; 74.8; 87.5; 20.7; 62.5251504; 80; 74.8; 97.5; 20.7; 69.6708819; 80; 74.8; 132.5; 20.7; 94.6809421; 80; 74.8; 97; 20.7; 85.7438624; 80; 74.8; 158.5; 20.7; 113.259844; 80; 74.8; 50; 20.7; 35.7286574; 80; 74.8; 166.5; 20.7; 189.602326; 80; 74.8; 90.5; 20.7; 64.6688699; 80; 74.8; 64; 20.7; 72.8801735; 78.5343169; 
14; 63.954; 54; 20.7; 38.58695; 80; 63.954; 48.5; 20.7; 34.6567977; 80; 63.954; 90; 20.7; 102.872423; 76.8072002; 63.954; 37; 20.7; 26.4392065; 80; 63.954; 35.5; 20.7; 40.5774556; 76.202044; 63.954; 68; 20.7; 48.590974; 80; 20.7; 62.5; 20.7; 61.936857; 79.777945; 63.954; 85.5; 20.7; 69.26525; 80; 63.954; 87.5; 20.7; 62.5251504; 80; 63.954; 97.5; 20.7; 69.6708819; 80; 63.954; 132.5; 20.7; 94.6809421; 80; 63.954; 97; 20.7; 69.3135953; 80; 63.954; 158.5; 20.7; 113.259844; 80; 63.954; 50; 20.7; 57.1513459; 76.2174105; 63.954; 166.5; 20.7; 118.976429; 80; 63.954; 90.5; 20.7; 64.6688699; 80; 63.954; 64; 20.7; 73.1537227; 75; 
15; 74.8; 54; 20.7; 38.58695; 80; 74.8; 48.5; 20.7; 34.6567977; 80; 74.8; 90; 20.7; 102.487744; 78.0529547; 74.8; 37; 20.7; 26.4392065; 80; 74.8; 35.5; 20.7; 40.4257212; 80; 74.8; 68; 20.7; 48.590974; 80; 20.7; 62.5; 20.7; 61.7645132; 80; 74.8; 85.5; 20.7; 61.0960041; 80; 74.8; 87.5; 20.7; 62.5251504; 80; 74.8; 97.5; 20.7; 69.6708819; 80; 74.8; 132.5; 20.7; 94.6809421; 80; 74.8; 97; 20.7; 69.3135953; 80; 74.8; 158.5; 20.7; 113.259844; 80; 74.8; 50; 20.7; 56.9376355; 80; 74.8; 166.5; 20.7; 118.976429; 80; 74.8; 90.5; 20.7; 64.6688699; 80; 74.8; 64; 20.7; 72.8801735; 80; 
16; 63.954; 54; 20.7; 61.7234535; 76.7861152; 63.954; 48.5; 20.7; 34.6567977; 80; 63.954; 90; 20.7; 102.872423; 75; 63.954; 37; 20.7; 42.2919959; 76.5855646; 63.954; 35.5; 20.7; 25.3673467; 80; 63.954; 68; 20.7; 48.590974; 80; 20.7; 62.5; 20.7; 56.0805398; 80; 63.954; 85.5; 20.7; 61.0960041; 80; 63.954; 87.5; 20.7; 77.7217559; 80; 63.954; 97.5; 20.7; 69.6708819; 80; 63.954; 132.5; 20.7; 94.6809421; 80; 63.954; 97; 20.7; 69.3135953; 80; 63.954; 158.5; 20.7; 113.259844; 80; 63.954; 50; 20.7; 35.7286574; 80; 63.954; 166.5; 20.7; 118.976429; 80; 63.954; 90.5; 20.7; 64.6688699; 80; 63.954; 64; 20.7; 48.2036845; 80; 
17; 63.954; 54; 17.6985; 61.4926464; 80; 63.954; 48.5; 17.6985; 34.6567977; 80; 63.954; 90; 17.6985; 102.487744; 80; 63.954; 37; 17.6985; 42.1338503; 77.8229107; 63.954; 35.5; 17.6985; 25.3673467; 80; 63.954; 68; 17.6985; 48.590974; 80; 20.7; 62.5; 17.6985; 55.966618; 80; 63.954; 85.5; 17.6985; 61.0960041; 80; 63.954; 87.5; 17.6985; 77.5701563; 80; 63.954; 97.5; 17.6985; 69.6708819; 80; 63.954; 132.5; 17.6985; 97.4040361; 80; 63.954; 97; 17.6985; 69.3135953; 80; 63.954; 158.5; 17.6985; 113.259844; 80; 63.954; 50; 17.6985; 35.7286574; 80; 63.954; 166.5; 17.6985; 118.976429; 80; 63.954; 90.5; 17.6985; 64.6688699; 80; 63.954; 64; 17.6985; 45.7326815; 80; 
18; 63.954; 54; 20.7; 38.58695; 80; 63.954; 48.5; 20.7; 34.6567977; 80; 63.954; 90; 20.7; 65.8588438; 80; 63.954; 37; 20.7; 42.2919959; 75; 63.954; 35.5; 20.7; 40.5774556; 76.2688961; 63.954; 68; 20.7; 77.7258304; 76.7212318; 20.7; 62.5; 20.7; 61.5989819; 80; 63.954; 85.5; 20.7; 61.0960041; 80; 63.954; 87.5; 20.7; 62.5251504; 80; 63.954; 97.5; 20.7; 69.6708819; 80; 63.954; 132.5; 20.7; 97.3768708; 80; 63.954; 97; 20.7; 69.3135953; 80; 63.954; 158.5; 20.7; 113.259844; 80; 63.954; 50; 20.7; 35.7286574; 80; 63.954; 166.5; 20.7; 118.976429; 80; 63.954; 90.5; 20.7; 103.443936; 76.6867577; 63.954; 64; 20.7; 45.7326815; 80; 
19; 74.8; 54; 20.7; 38.58695; 80; 74.8; 48.5; 20.7; 34.6567977; 80; 74.8; 90; 20.7; 64.3115833; 80; 74.8; 37; 20.7; 42.1338503; 80; 74.8; 35.5; 20.7; 40.4257212; 80; 74.8; 68; 20.7; 77.4351843; 80; 20.7; 62.5; 20.7; 69.5311989; 80; 74.8; 85.5; 20.7; 61.0960041; 80; 74.8; 87.5; 20.7; 62.5251504; 80; 74.8; 97.5; 20.7; 69.6708819; 80; 74.8; 132.5; 20.7; 94.6809421; 80; 74.8; 97; 20.7; 69.3135953; 80; 74.8; 158.5; 20.7; 113.259844; 80; 74.8; 50; 20.7; 35.7286574; 80; 74.8; 166.5; 20.7; 118.976429; 80; 74.8; 90.5; 20.7; 103.05712; 80; 74.8; 64; 20.7; 45.7326815; 80; 
20; 74.8; 54; 20.7; 38.58695; 80; 74.8; 48.5; 20.7; 55.4368055; 76.8090312; 74.8; 90; 20.7; 64.3115833; 80; 74.8; 37; 20.7; 26.4392065; 80; 74.8; 35.5; 20.7; 25.3673467; 80; 74.8; 68; 20.7; 48.590974; 80; 20.7; 62.5; 20.7; 64.0768682; 80; 74.8; 85.5; 20.7; 61.0960041; 80; 74.8; 87.5; 20.7; 62.5251504; 80; 74.8; 97.5; 20.7; 69.6708819; 80; 74.8; 132.5; 20.7; 94.6809421; 80; 74.8; 97; 20.7; 69.3135953; 80; 74.8; 158.5; 20.7; 181.169766; 76.7975935; 74.8; 50; 20.7; 35.7286574; 80; 74.8; 166.5; 20.7; 118.976429; 80; 74.8; 90.5; 20.7; 64.6688699; 80; 74.8; 64; 20.7; 45.7326815; 80; 
21; 74.8; 54; 20.7; 38.58695; 80; 74.8; 48.5; 20.7; 55.2295065; 80; 74.8; 90; 20.7; 64.3115833; 80; 74.8; 37; 20.7; 26.4392065; 80; 74.8; 35.5; 20.7; 25.3673467; 80; 74.8; 68; 20.7; 48.590974; 80; 20.7; 62.5; 20.7; 55.9428126; 80; 74.8; 85.5; 20.7; 61.0960041; 80; 74.8; 87.5; 20.7; 62.5251504; 80; 74.8; 97.5; 20.7; 83.8230813; 80; 74.8; 132.5; 20.7; 94.6809421; 80; 74.8; 97; 20.7; 69.3135953; 80; 74.8; 158.5; 20.7; 180.492305; 80; 74.8; 50; 20.7; 35.7286574; 80; 74.8; 166.5; 20.7; 118.976429; 80; 74.8; 90.5; 20.7; 64.6688699; 80; 74.8; 64; 20.7; 45.7326815; 80; 
22; 63.954; 54; 17.6985; 38.58695; 80; 63.954; 48.5; 17.6985; 34.6567977; 80; 63.954; 90; 17.6985; 64.3115833; 80; 63.954; 37; 17.6985; 26.4392065; 80; 63.954; 35.5; 17.6985; 25.3673467; 80; 63.954; 68; 17.6985; 48.590974; 80; 20.7; 62.5; 17.6985; 66.5700552; 77.6192404; 63.954; 85.5; 17.6985; 61.0960041; 80; 63.954; 87.5; 17.6985; 62.5251504; 80; 63.954; 97.5; 17.6985; 83.6819005; 80; 63.954; 132.5; 17.6985; 94.6809421; 80; 63.954; 97; 17.6985; 110.873611; 76.9625884; 63.954; 158.5; 17.6985; 113.259844; 80; 63.954; 50; 17.6985; 57.1513459; 76.8972677; 63.954; 166.5; 17.6985; 118.976429; 80; 63.954; 90.5; 17.6985; 64.6688699; 80; 63.954; 64; 17.6985; 45.7326815; 80; 
23; 74.8; 54; 20.7; 38.58695; 80; 74.8; 48.5; 20.7; 34.6567977; 80; 74.8; 90; 20.7; 64.3115833; 80; 74.8; 37; 20.7; 26.4392065; 80; 74.8; 35.5; 20.7; 32.8196441; 80; 74.8; 68; 20.7; 48.590974; 80; 20.7; 62.5; 20.7; 66.3514911; 80; 74.8; 85.5; 20.7; 61.0960041; 80; 74.8; 87.5; 20.7; 70.7368612; 80; 74.8; 97.5; 20.7; 69.6708819; 80; 74.8; 132.5; 20.7; 94.6809421; 80; 74.8; 97; 20.7; 110.459013; 80; 74.8; 158.5; 20.7; 113.259844; 80; 74.8; 50; 20.7; 56.9376355; 80; 74.8; 166.5; 20.7; 118.976429; 80; 74.8; 90.5; 20.7; 64.6688699; 80; 74.8; 64; 20.7; 45.7326815; 80; 
24; 74.8; 54; 20.7; 61.7234535; 76.9220946; 74.8; 48.5; 20.7; 34.6567977; 80; 74.8; 90; 20.7; 64.3115833; 80; 74.8; 37; 20.7; 37.6329926; 80; 74.8; 35.5; 20.7; 32.7453009; 80; 74.8; 68; 20.7; 48.590974; 80; 20.7; 62.5; 20.7; 44.6608217; 80; 74.8; 85.5; 20.7; 61.0960041; 80; 74.8; 87.5; 20.7; 70.6549421; 80; 74.8; 97.5; 20.7; 111.445124; 76.3706939; 74.8; 132.5; 20.7; 94.6809421; 80; 74.8; 97; 20.7; 69.3135953; 80; 74.8; 158.5; 20.7; 113.259844; 80; 74.8; 50; 20.7; 35.7286574; 80; 74.8; 166.5; 20.7; 118.976429; 80; 74.8; 90.5; 20.7; 64.6688699; 80; 74.8; 64; 20.7; 45.7326815; 80; 
25; 139.126133; 54; 19.0819407; 61.4926464; 80; 139.126133; 48.5; 19.0819407; 34.6567977; 80; 139.126133; 90; 19.0819407; 64.3115833; 80; 139.126133; 37; 19.0819407; 37.5213247; 80; 139.126133; 35.5; 19.0819407; 25.3673467; 80; 139.126133; 68; 19.0819407; 48.590974; 80; 20.7; 62.5; 19.0819407; 44.6608217; 80; 139.126133; 85.5; 19.0819407; 61.0960041; 80; 139.126133; 87.5; 19.0819407; 62.5251504; 80; 139.126133; 97.5; 19.0819407; 111.028389; 80; 139.126133; 132.5; 19.0819407; 94.6809421; 80; 139.126133; 97; 19.0819407; 95.0848803; 80; 139.126133; 158.5; 19.0819407; 113.259844; 80; 139.126133; 50; 19.0819407; 35.7286574; 80; 139.126133; 166.5; 19.0819407; 118.976429; 80; 139.126133; 90.5; 19.0819407; 64.6688699; 80; 139.126133; 64; 19.0819407; 45.7326815; 80; 
26; 162.720623; 54; 20.7; 38.58695; 80; 162.720623; 48.5; 20.7; 34.6567977; 80; 162.720623; 90; 20.7; 64.3115833; 80; 162.720623; 37; 20.7; 26.4392065; 80; 162.720623; 35.5; 20.7; 25.3673467; 80; 162.720623; 68; 20.7; 48.590974; 80; 20.7; 62.5; 20.7; 44.6608217; 80; 162.720623; 85.5; 20.7; 61.0960041; 80; 162.720623; 87.5; 20.7; 62.5251504; 80; 162.720623; 97.5; 20.7; 69.6708819; 80; 162.720623; 132.5; 20.7; 108.551795; 80; 162.720623; 97; 20.7; 94.8277888; 80; 162.720623; 158.5; 20.7; 113.259844; 80; 162.720623; 50; 20.7; 35.7286574; 80; 162.720623; 166.5; 20.7; 190.313982; 76.933326; 162.720623; 90.5; 20.7; 64.6688699; 80; 162.720623; 64; 20.7; 45.7326815; 80; 
27; 162.720623; 54; 20.7; 38.58695; 80; 162.720623; 48.5; 20.7; 34.6567977; 80; 162.720623; 90; 20.7; 88.8057741; 80; 162.720623; 37; 20.7; 26.4392065; 80; 162.720623; 35.5; 20.7; 25.3673467; 80; 162.720623; 68; 20.7; 48.590974; 80; 20.7; 62.5; 20.7; 44.6608217; 80; 162.720623; 85.5; 20.7; 61.0960041; 80; 162.720623; 87.5; 20.7; 62.5251504; 80; 162.720623; 97.5; 20.7; 69.6708819; 80; 162.720623; 132.5; 20.7; 108.413421; 80; 162.720623; 97; 20.7; 69.3135953; 80; 162.720623; 158.5; 20.7; 113.259844; 80; 162.720623; 50; 20.7; 35.7286574; 80; 162.720623; 166.5; 20.7; 192.810408; 80; 162.720623; 90.5; 20.7; 64.6688699; 80; 162.720623; 64; 20.7; 45.7326815; 80; 
28; 139.126133; 54; 19.0819407; 38.58695; 80; 139.126133; 48.5; 19.0819407; 55.4368055; 76.9318763; 139.126133; 90; 19.0819407; 88.5614228; 80; 139.126133; 37; 19.0819407; 42.2919959; 76.37291; 139.126133; 35.5; 19.0819407; 25.3673467; 80; 139.126133; 68; 19.0819407; 77.7258304; 76.9448722; 20.7; 62.5; 19.0819407; 44.6608217; 80; 139.126133; 85.5; 19.0819407; 79.1387152; 80; 139.126133; 87.5; 19.0819407; 62.5251504; 80; 139.126133; 97.5; 19.0819407; 69.6708819; 80; 139.126133; 132.5; 19.0819407; 94.6809421; 80; 139.126133; 97; 19.0819407; 69.3135953; 80; 139.126133; 158.5; 19.0819407; 113.259844; 80; 139.126133; 50; 19.0819407; 35.7286574; 80; 139.126133; 166.5; 19.0819407; 122.152508; 80; 139.126133; 90.5; 19.0819407; 64.6688699; 80; 139.126133; 64; 19.0819407; 45.7326815; 80; 
29; 162.720623; 54; 20.7; 38.8678307; 80; 162.720623; 48.5; 20.7; 55.2295065; 80; 162.720623; 90; 20.7; 64.3115833; 80; 162.720623; 37; 20.7; 42.1338503; 80; 162.720623; 35.5; 20.7; 25.3673467; 80; 162.720623; 68; 20.7; 77.4351843; 80; 20.7; 62.5; 20.7; 44.6608217; 80; 162.720623; 85.5; 20.7; 78.9587231; 80; 162.720623; 87.5; 20.7; 62.5251504; 80; 162.720623; 97.5; 20.7; 69.6708819; 80; 162.720623; 132.5; 20.7; 94.6809421; 80; 162.720623; 97; 20.7; 69.3135953; 80; 162.720623; 158.5; 20.7; 150.11903; 80; 162.720623; 50; 20.7; 35.7286574; 80; 162.720623; 166.5; 20.7; 118.976429; 80; 162.720623; 90.5; 20.7; 64.6688699; 80; 162.720623; 64; 20.7; 45.7326815; 79.916686; 
30; 162.720623; 54; 22.3180593; 61.7234535; 76.9705812; 162.720623; 48.5; 22.3180593; 34.6567977; 80; 162.720623; 90; 22.3180593; 102.872423; 76.0539492; 162.720623; 37; 22.3180593; 26.4392065; 80; 162.720623; 35.5; 22.3180593; 25.3673467; 80; 162.720623; 68; 22.3180593; 48.590974; 80; 20.7; 62.5; 22.3180593; 44.6608217; 80; 162.720623; 85.5; 22.3180593; 61.0960041; 80; 162.720623; 87.5; 22.3180593; 62.5251504; 80; 162.720623; 97.5; 22.3180593; 82.9729302; 80; 162.720623; 132.5; 22.3180593; 94.6809421; 80; 162.720623; 97; 22.3180593; 69.3135953; 80; 162.720623; 158.5; 22.3180593; 149.751327; 80; 162.720623; 50; 22.3180593; 35.7286574; 80; 162.720623; 166.5; 22.3180593; 118.976429; 80; 162.720623; 90.5; 22.3180593; 64.6688699; 80; 162.720623; 64; 22.3180593; 73.1537227; 75; 
31; 162.720623; 54; 19.0819407; 61.4926464; 78.5834995; 162.720623; 48.5; 19.0819407; 34.6567977; 80; 162.720623; 90; 19.0819407; 102.487744; 80; 162.720623; 37; 19.0819407; 26.4392065; 80; 162.720623; 35.5; 19.0819407; 25.3673467; 80; 162.720623; 68; 19.0819407; 48.590974; 80; 20.7; 62.5; 19.0819407; 49.9215026; 80; 162.720623; 85.5; 19.0819407; 61.0960041; 80; 162.720623; 87.5; 19.0819407; 62.5251504; 80; 162.720623; 97.5; 19.0819407; 82.8402305; 80; 162.720623; 132.5; 19.0819407; 94.6809421; 80; 162.720623; 97; 19.0819407; 69.3135953; 80; 162.720623; 158.5; 19.0819407; 113.259844; 80; 162.720623; 50; 19.0819407; 35.7286574; 80; 162.720623; 166.5; 19.0819407; 118.976429; 80; 162.720623; 90.5; 19.0819407; 64.6688699; 80; 162.720623; 64; 19.0819407; 94.9403734; 75; 
32; 35.3273442; 54; 20.7; 61.7234535; 75; 35.3273442; 48.5; 20.7; 34.6567977; 80; 35.3273442; 90; 20.7; 64.3115833; 80; 35.3273442; 37; 20.7; 26.4392065; 80; 35.3273442; 35.5; 20.7; 25.3673467; 80; 35.3273442; 68; 20.7; 77.7258304; 76.4508983; 20.7; 62.5; 20.7; 56.9802042; 80; 35.3273442; 85.5; 20.7; 73.2675499; 80; 35.3273442; 87.5; 20.7; 62.5251504; 80; 35.3273442; 97.5; 20.7; 69.6708819; 80; 35.3273442; 132.5; 20.7; 94.6809421; 80; 35.3273442; 97; 20.7; 69.3135953; 80; 35.3273442; 158.5; 20.7; 113.259844; 80; 35.3273442; 50; 20.7; 57.1513459; 77.0855252; 35.3273442; 166.5; 20.7; 118.976429; 80; 35.3273442; 90.5; 20.7; 103.443936; 76.8969506; 35.3273442; 64; 20.7; 68.2874822; 80; 
33; 35.3273442; 54; 20.7; 61.4926464; 78.6156226; 35.3273442; 48.5; 20.7; 34.6567977; 80; 35.3273442; 90; 20.7; 64.3115833; 80; 35.3273442; 37; 20.7; 26.4392065; 80; 35.3273442; 35.5; 20.7; 25.3673467; 80; 35.3273442; 68; 20.7; 77.4351843; 78.4147087; 20.7; 62.5; 20.7; 74.5074307; 77.181302; 35.3273442; 85.5; 20.7; 73.1461279; 80; 35.3273442; 87.5; 20.7; 62.5251504; 80; 35.3273442; 97.5; 20.7; 69.6708819; 80; 35.3273442; 132.5; 20.7; 94.6809421; 80; 35.3273442; 97; 20.7; 69.3135953; 80; 35.3273442; 158.5; 20.7; 113.259844; 80; 35.3273442; 50; 20.7; 56.9376355; 80; 35.3273442; 166.5; 20.7; 118.976429; 80; 35.3273442; 90.5; 20.7; 109.209896; 75.5465643; 35.3273442; 64; 20.7; 46.4402228; 80; 
34; 35.3273442; 54; 20.7; 61.7234535; 75; 35.3273442; 48.5; 20.7; 34.6567977; 80; 35.3273442; 90; 20.7; 102.872423; 76.5712873; 35.3273442; 37; 20.7; 26.4392065; 80; 35.3273442; 35.5; 20.7; 25.3673467; 80; 35.3273442; 68; 20.7; 77.7258304; 75; 20.7; 62.5; 20.7; 67.2396757; 80; 35.3273442; 85.5; 20.7; 61.0960041; 80; 35.3273442; 87.5; 20.7; 62.5251504; 80; 35.3273442; 97.5; 20.7; 85.1483111; 80; 35.3273442; 132.5; 20.7; 102.612028; 80; 35.3273442; 97; 20.7; 69.3135953; 80; 35.3273442; 158.5; 20.7; 113.259844; 80; 35.3273442; 50; 20.7; 35.7286574; 80; 35.3273442; 166.5; 20.7; 118.976429; 80; 35.3273442; 90.5; 20.7; 109.535332; 75; 35.3273442; 64; 20.7; 45.7326815; 80; 
35; 35.3273442; 54; 20.7; 61.4926464; 78.6260708; 35.3273442; 48.5; 20.7; 34.6567977; 80; 35.3273442; 90; 20.7; 102.487744; 80; 35.3273442; 37; 20.7; 26.4392065; 80; 35.3273442; 35.5; 20.7; 25.3673467; 80; 35.3273442; 68; 20.7; 77.4351843; 80; 20.7; 62.5; 20.7; 50.3257099; 80; 35.3273442; 85.5; 20.7; 61.0960041; 80; 35.3273442; 87.5; 20.7; 62.5251504; 80; 35.3273442; 97.5; 20.7; 84.99391; 80; 35.3273442; 132.5; 20.7; 102.532908; 80; 35.3273442; 97; 20.7; 110.873611; 77.2863683; 35.3273442; 158.5; 20.7; 113.259844; 80; 35.3273442; 50; 20.7; 35.7286574; 80; 35.3273442; 166.5; 20.7; 118.976429; 80; 35.3273442; 90.5; 20.7; 103.05712; 80; 35.3273442; 64; 20.7; 45.7326815; 80; 
36; 35.3273442; 54; 20.7; 61.7234535; 75; 35.3273442; 48.5; 20.7; 55.4368055; 77.0991665; 35.3273442; 90; 20.7; 92.6633508; 78.628627; 35.3273442; 37; 20.7; 26.4392065; 80; 35.3273442; 35.5; 20.7; 40.5774556; 77.1631354; 35.3273442; 68; 20.7; 48.590974; 80; 35.3273442; 62.5; 20.7; 50.2691976; 80; 35.3273442; 85.5; 20.7; 61.0960041; 80; 35.3273442; 87.5; 20.7; 62.5251504; 80; 35.3273442; 97.5; 20.7; 111.445124; 75.9048172; 35.3273442; 132.5; 20.7; 94.6809421; 80; 35.3273442; 97; 20.7; 110.459013; 80; 35.3273442; 158.5; 20.7; 113.259844; 80; 35.3273442; 50; 20.7; 35.7286574; 80; 35.3273442; 166.5; 20.7; 118.976429; 80; 35.3273442; 90.5; 20.7; 64.6688699; 80; 35.3273442; 64; 20.7; 45.7326815; 80; 
37; 41.3185312; 54; 20.7; 61.4926464; 78.6297935; 41.3185312; 48.5; 20.7; 55.2295065; 78.5430541; 41.3185312; 90; 20.7; 92.3805168; 80; 41.3185312; 37; 20.7; 26.4392065; 80; 41.3185312; 35.5; 20.7; 40.4257212; 80; 41.3185312; 68; 20.7; 48.590974; 80; 41.3185312; 62.5; 20.7; 71.4391823; 76.2360624; 41.3185312; 85.5; 20.7; 70.9843722; 80; 41.3185312; 87.5; 20.7; 62.5251504; 80; 41.3185312; 97.5; 20.7; 111.028389; 80; 41.3185312; 132.5; 20.7; 94.6809421; 80; 41.3185312; 97; 20.7; 69.3135953; 76.3385012; 41.3185312; 158.5; 20.7; 113.259844; 80; 41.3185312; 50; 20.7; 35.7286574; 80; 41.3185312; 166.5; 20.7; 118.976429; 80; 41.3185312; 90.5; 20.7; 64.6688699; 80; 41.3185312; 64; 20.7; 45.7326815; 80; 
38; 41.3185312; 54; 20.7; 61.7234535; 75; 41.3185312; 48.5; 20.7; 55.4368055; 75; 41.3185312; 90; 20.7; 64.3115833; 80; 41.3185312; 37; 20.7; 32.9088997; 77.9486911; 41.3185312; 35.5; 20.7; 25.3673467; 80; 41.3185312; 68; 20.7; 48.590974; 80; 41.3185312; 62.5; 20.7; 71.1720444; 80; 41.3185312; 85.5; 20.7; 70.885727; 80; 41.3185312; 87.5; 20.7; 100.014855; 77.1786321; 41.3185312; 97.5; 20.7; 69.6708819; 80; 41.3185312; 132.5; 20.7; 94.6809421; 80; 41.3185312; 97; 20.7; 110.873611; 75; 41.3185312; 158.5; 20.7; 113.259844; 80; 41.3185312; 50; 20.7; 35.7286574; 80; 41.3185312; 166.5; 20.7; 118.976429; 80; 41.3185312; 90.5; 20.7; 64.6688699; 80; 41.3185312; 64; 20.7; 45.7326815; 80; 
39; 41.3185312; 54; 19.0819407; 61.4926464; 80; 41.3185312; 48.5; 19.0819407; 55.2295065; 80; 41.3185312; 90; 19.0819407; 64.3115833; 80; 41.3185312; 37; 19.0819407; 48.6971482; 75; 41.3185312; 35.5; 19.0819407; 25.3673467; 80; 41.3185312; 68; 19.0819407; 48.590974; 80; 41.3185312; 62.5; 19.0819407; 44.6608217; 80; 41.3185312; 85.5; 19.0819407; 61.0960041; 80; 41.3185312; 87.5; 19.0819407; 99.6408622; 78.7027567; 41.3185312; 97.5; 19.0819407; 69.6708819; 80; 41.3185312; 132.5; 19.0819407; 94.6809421; 80; 41.3185312; 97; 19.0819407; 145.233315; 75; 41.3185312; 158.5; 19.0819407; 113.259844; 80; 41.3185312; 50; 19.0819407; 35.7286574; 80; 41.3185312; 166.5; 19.0819407; 118.976429; 80; 41.3185312; 90.5; 19.0819407; 66.0182192; 80; 41.3185312; 64; 19.0819407; 45.7326815; 80; 
40; 41.3185312; 54; 22.3180593; 38.8385007; 80; 41.3185312; 48.5; 22.3180593; 34.6567977; 80; 41.3185312; 90; 22.3180593; 102.872423; 76.7615313; 41.3185312; 37; 22.3180593; 53.3038752; 75.7432432; 41.3185312; 35.5; 22.3180593; 25.3673467; 80; 41.3185312; 68; 22.3180593; 48.590974; 80; 41.3185312; 62.5; 22.3180593; 44.6608217; 80; 41.3185312; 85.5; 22.3180593; 61.0960041; 78.6365801; 41.3185312; 87.5; 22.3180593; 100.014855; 75; 41.3185312; 97.5; 22.3180593; 69.6708819; 80; 41.3185312; 132.5; 22.3180593; 94.6809421; 80; 41.3185312; 97; 22.3180593; 103.740993; 80; 41.3185312; 158.5; 22.3180593; 113.259844; 80; 41.3185312; 50; 22.3180593; 35.7286574; 80; 41.3185312; 166.5; 22.3180593; 190.313982; 77.2431887; 41.3185312; 90.5; 22.3180593; 66.0047583; 80; 41.3185312; 64; 22.3180593; 45.7326815; 80; 
41; 41.3185312; 54; 20.7; 38.58695; 80; 41.3185312; 48.5; 20.7; 34.6567977; 80; 41.3185312; 90; 20.7; 102.487744; 80; 41.3185312; 37; 20.7; 37.4978004; 78.4582874; 41.3185312; 35.5; 20.7; 25.3673467; 80; 41.3185312; 68; 20.7; 48.590974; 80; 41.3185312; 62.5; 20.7; 55.6337992; 80; 41.3185312; 85.5; 20.7; 97.7288014; 75; 41.3185312; 87.5; 20.7; 99.6408622; 80; 41.3185312; 97.5; 20.7; 69.6708819; 80; 41.3185312; 132.5; 20.7; 94.6809421; 80; 41.3185312; 97; 20.7; 69.3135953; 80; 41.3185312; 158.5; 20.7; 113.259844; 80; 41.3185312; 50; 20.7; 35.7286574; 80; 41.3185312; 166.5; 20.7; 189.602326; 80; 41.3185312; 90.5; 20.7; 64.6688699; 80; 41.3185312; 64; 20.7; 73.1537227; 77.3834207; 
42; 10.89; 54; 20.7; 38.58695; 80; 10.89; 48.5; 20.7; 34.6567977; 80; 10.89; 90; 20.7; 81.7064831; 80; 10.89; 37; 20.7; 42.2919959; 75; 10.89; 35.5; 20.7; 25.3673467; 80; 10.89; 68; 20.7; 77.7258304; 77.1969272; 10.89; 62.5; 20.7; 55.524334; 80; 10.89; 85.5; 20.7; 127.192193; 75; 10.89; 87.5; 20.7; 62.5251504; 76.5780012; 10.89; 97.5; 20.7; 69.6708819; 80; 10.89; 132.5; 20.7; 151.451067; 77.1225932; 10.89; 97; 20.7; 110.873611; 76.0297947; 10.89; 158.5; 20.7; 113.259844; 80; 10.89; 50; 20.7; 57.1513459; 77.2899431; 10.89; 166.5; 20.7; 118.976429; 80; 10.89; 90.5; 20.7; 64.6688699; 80; 10.89; 64; 20.7; 72.8801735; 80; 
43; 10.89; 54; 20.7; 38.58695; 80; 10.89; 48.5; 20.7; 34.6567977; 80; 10.89; 90; 20.7; 81.5329535; 80; 10.89; 37; 20.7; 42.1338503; 80; 10.89; 35.5; 20.7; 25.3673467; 80; 10.89; 68; 20.7; 77.4351843; 80; 10.89; 62.5; 20.7; 71.4391823; 76.2109066; 10.89; 85.5; 20.7; 91.8340561; 79.087865; 10.89; 87.5; 20.7; 100.014855; 75; 10.89; 97.5; 20.7; 111.445124; 77.3539653; 10.89; 132.5; 20.7; 150.884734; 80; 10.89; 97; 20.7; 110.459013; 78.9385067; 10.89; 158.5; 20.7; 114.085517; 80; 10.89; 50; 20.7; 57.4675431; 78.4400487; 10.89; 166.5; 20.7; 118.976429; 80; 10.89; 90.5; 20.7; 64.6688699; 78.7912128; 10.89; 64; 20.7; 45.7326815; 80; 
44; 10.89; 54; 20.7; 61.7234535; 77.1280119; 10.89; 48.5; 20.7; 34.6567977; 80; 10.89; 90; 20.7; 64.3115833; 80; 10.89; 37; 20.7; 26.4392065; 80; 10.89; 35.5; 20.7; 25.3673467; 80; 10.89; 68; 20.7; 48.590974; 80; 10.89; 62.5; 20.7; 71.1720444; 80; 10.89; 85.5; 20.7; 97.7288014; 75; 10.89; 87.5; 20.7; 130.665933; 75; 10.89; 97.5; 20.7; 113.013448; 80; 10.89; 132.5; 20.7; 94.6809421; 80; 10.89; 97; 20.7; 110.873611; 75; 10.89; 158.5; 20.7; 181.169766; 77.2867662; 10.89; 50; 20.7; 57.6759672; 75; 10.89; 166.5; 20.7; 118.976429; 78.8742089; 10.89; 90.5; 20.7; 103.443936; 75; 10.89; 64; 20.7; 45.7326815; 80; 
45; 10.89; 54; 19.0819407; 61.4926464; 80; 10.89; 48.5; 19.0819407; 34.6567977; 80; 10.89; 90; 19.0819407; 64.3115833; 78.6986953; 10.89; 37; 19.0819407; 26.4392065; 80; 10.89; 35.5; 19.0819407; 25.3673467; 80; 10.89; 68; 19.0819407; 48.590974; 80; 10.89; 62.5; 19.0819407; 63.8499124; 79.4124943; 10.89; 85.5; 19.0819407; 97.3633568; 80; 10.89; 87.5; 19.0819407; 93.360814; 78.7407181; 10.89; 97.5; 19.0819407; 71.6361375; 80; 10.89; 132.5; 19.0819407; 94.6809421; 80; 10.89; 97; 19.0819407; 110.459013; 78.9703399; 10.89; 158.5; 19.0819407; 180.492305; 78.912537; 10.89; 50; 19.0819407; 56.9376355; 75; 10.89; 166.5; 19.0819407; 190.313982; 75; 10.89; 90.5; 19.0819407; 134.938522; 75; 10.89; 64; 19.0819407; 45.7326815; 80; 
46; 10.89; 54; 22.3180593; 38.58695; 80; 10.89; 48.5; 22.3180593; 55.4368055; 77.2855451; 10.89; 90; 22.3180593; 95.6393736; 75; 10.89; 37; 22.3180593; 26.4392065; 80; 10.89; 35.5; 22.3180593; 25.3673467; 80; 10.89; 68; 22.3180593; 48.590974; 80; 10.89; 62.5; 22.3180593; 63.6584842; 80; 10.89; 85.5; 22.3180593; 62.2670317; 80; 10.89; 87.5; 22.3180593; 100.014855; 75; 10.89; 97.5; 22.3180593; 69.6708819; 80; 10.89; 132.5; 22.3180593; 94.6809421; 80; 10.89; 97; 22.3180593; 110.873611; 75; 10.89; 158.5; 22.3180593; 180.781553; 75; 10.89; 50; 22.3180593; 57.1513459; 75; 10.89; 166.5; 22.3180593; 249.373439; 75; 10.89; 90.5; 22.3180593; 96.2322258; 80; 10.89; 64; 22.3180593; 73.1537227; 75.0805026; 
47; 10.89; 54; 20.7; 38.58695; 80; 10.89; 48.5; 20.7; 55.2295065; 78.8749966; 10.89; 90; 20.7; 131.251777; 75; 10.89; 37; 20.7; 26.4392065; 78.8124568; 10.89; 35.5; 20.7; 40.5774556; 77.3956372; 10.89; 68; 20.7; 77.7258304; 77.0775345; 10.89; 62.5; 20.7; 60.9199919; 80; 10.89; 85.5; 20.7; 61.0960041; 80; 10.89; 87.5; 20.7; 99.6408622; 80; 10.89; 97.5; 20.7; 69.9733836; 80; 10.89; 132.5; 20.7; 94.6809421; 78.8044305; 10.89; 97; 20.7; 110.459013; 80; 10.89; 158.5; 20.7; 180.492305; 78.9738274; 10.89; 50; 20.7; 74.243949; 75; 10.89; 166.5; 20.7; 178.153577; 79.0034511; 10.89; 90.5; 20.7; 64.6688699; 80; 10.89; 64; 20.7; 95.7805683; 75; 
48; 10.89; 54; 20.7; 61.7234535; 76.7582156; 10.89; 48.5; 20.7; 55.4368055; 75; 10.89; 90; 20.7; 129.301305; 75.0043884; 10.89; 37; 20.7; 42.2919959; 75; 10.89; 35.5; 20.7; 40.4257212; 79.0760171; 10.89; 68; 20.7; 77.4351843; 80; 10.89; 62.5; 20.7; 60.7577923; 80; 10.89; 85.5; 20.7; 61.0960041; 80; 10.89; 87.5; 20.7; 62.641687; 80; 10.89; 97.5; 20.7; 111.445124; 77.2578617; 10.89; 132.5; 20.7; 151.451067; 75; 10.89; 97; 20.7; 69.3135953; 80; 10.89; 158.5; 20.7; 181.169766; 75; 10.89; 50; 20.7; 69.0715229; 75; 10.89; 166.5; 20.7; 190.313982; 75; 10.89; 90.5; 20.7; 64.6688699; 80; 10.89; 64; 20.7; 74.4178983; 76.1782241; 
49; 10.89; 54; 20.7; 61.4926464; 79.0489913; 10.89; 48.5; 20.7; 55.2295065; 78.9239223; 10.89; 90; 20.7; 93.6146959; 80; 10.89; 37; 20.7; 55.2112249; 75; 10.89; 35.5; 20.7; 40.5774556; 75; 10.89; 68; 20.7; 48.590974; 80; 10.89; 62.5; 20.7; 71.4391823; 75.2785217; 10.89; 85.5; 20.7; 61.0960041; 78.873434; 10.89; 87.5; 20.7; 62.6634557; 80; 10.89; 97.5; 20.7; 111.028389; 79.4289169; 10.89; 132.5; 20.7; 198.332473; 75; 10.89; 97; 20.7; 90.734871; 80; 10.89; 158.5; 20.7; 180.492305; 79.0136427; 10.89; 50; 20.7; 51.7761541; 80; 10.89; 166.5; 20.7; 189.602326; 75.4166107; 10.89; 90.5; 20.7; 64.6688699; 80; 10.89; 64; 20.7; 78.9596852; 75; 
50; 10.89; 54; 20.7; 61.7234535; 75; 10.89; 48.5; 20.7; 55.4368055; 75; 10.89; 90; 20.7; 64.4833087; 80; 10.89; 37; 20.7; 51.271071; 75.0030309; 10.89; 35.5; 20.7; 40.4257212; 80; 10.89; 68; 20.7; 77.7258304; 76.1156462; 10.89; 62.5; 20.7; 71.1720444; 80; 10.89; 85.5; 20.7; 97.7288014; 75; 10.89; 87.5; 20.7; 100.014855; 76.7136292; 10.89; 97.5; 20.7; 111.445124; 75; 10.89; 132.5; 20.7; 176.586083; 74.9999999; 10.89; 97; 20.7; 90.5211748; 80; 10.89; 158.5; 20.7; 181.169766; 75; 10.89; 50; 20.7; 35.7286574; 80; 10.89; 166.5; 20.7; 190.316219; 75; 10.89; 90.5; 20.7; 64.6688699; 78.6211174; 10.89; 64; 20.7; 93.4538111; 75.3184879; 
51; 10.89; 54; 19.0819407; 61.4926464; 79.0925179; 10.89; 48.5; 19.0819407; 55.2295065; 78.9510773; 10.89; 90; 19.0819407; 64.3115833; 80; 10.89; 37; 19.0819407; 38.2552885; 78.5221476; 10.89; 35.5; 19.0819407; 25.4965183; 80; 10.89; 68; 19.0819407; 77.4351843; 79.126306; 10.89; 62.5; 19.0819407; 44.6608217; 80; 10.89; 85.5; 19.0819407; 128.125466; 75; 10.89; 87.5; 19.0819407; 99.6408622; 78.936849; 10.89; 97.5; 19.0819407; 111.028389; 79.5082327; 10.89; 132.5; 19.0819407; 176.007353; 75; 10.89; 97; 19.0819407; 69.3135953; 80; 10.89; 158.5; 19.0819407; 180.492305; 79.0475951; 10.89; 50; 19.0819407; 35.7286574; 80; 10.89; 166.5; 19.0819407; 247.279955; 75; 10.89; 90.5; 19.0819407; 103.443936; 75; 10.89; 64; 19.0819407; 67.3644386; 80; 
52; 10.89; 54; 22.3180593; 61.7234535; 75; 10.89; 48.5; 22.3180593; 55.4368055; 75; 10.89; 90; 22.3180593; 64.3115833; 80; 10.89; 37; 22.3180593; 42.2919959; 75; 10.89; 35.5; 22.3180593; 40.5774556; 76.1874636; 10.89; 68; 22.3180593; 77.7258304; 75; 10.89; 62.5; 22.3180593; 71.4391823; 76.7097336; 10.89; 85.5; 22.3180593; 119.394375; 75.325815; 10.89; 87.5; 22.3180593; 100.014855; 75; 10.89; 97.5; 22.3180593; 111.732836; 75; 10.89; 132.5; 22.3180593; 183.950193; 75; 10.89; 97; 22.3180593; 69.3135953; 80; 10.89; 158.5; 22.3180593; 181.169766; 75; 10.89; 50; 22.3180593; 57.1513459; 76.7053143; 10.89; 166.5; 22.3180593; 210.300643; 75.1775309; 10.89; 90.5; 22.3180593; 135.072337; 75; 10.89; 64; 22.3180593; 46.8404798; 80; 
53; 10.89; 54; 20.7; 61.4926464; 80; 10.89; 48.5; 20.7; 55.2295065; 75; 10.89; 90; 20.7; 64.3115833; 79.2608106; 10.89; 37; 20.7; 42.1338503; 78.502009; 10.89; 35.5; 20.7; 40.4257212; 79.2842521; 10.89; 68; 20.7; 77.4351843; 79.1745977; 10.89; 62.5; 20.7; 89.9372091; 76.3680213; 10.89; 85.5; 20.7; 116.255976; 75.0660766; 10.89; 87.5; 20.7; 99.6408622; 78.9841959; 10.89; 97.5; 20.7; 111.028389; 75; 10.89; 132.5; 20.7; 180.228154; 75; 10.89; 97; 20.7; 69.3192462; 80; 10.89; 158.5; 20.7; 180.492305; 79.0790893; 10.89; 50; 20.7; 56.9376355; 80; 10.89; 166.5; 20.7; 215.99109; 75; 10.89; 90.5; 20.7; 125.460796; 75; 10.89; 64; 20.7; 45.7326815; 78.8916654; 
54; 10.89; 54; 19.0819407; 38.58695; 80; 10.89; 48.5; 19.0819407; 55.4368055; 75; 10.89; 90; 19.0819407; 102.872423; 75; 10.89; 37; 19.0819407; 42.2919959; 75; 10.89; 35.5; 19.0819407; 40.5774556; 75; 10.89; 68; 19.0819407; 77.7258304; 75; 10.89; 62.5; 19.0819407; 63.2387872; 80; 10.89; 85.5; 19.0819407; 116.372824; 75; 10.89; 87.5; 19.0819407; 100.014855; 75; 10.89; 97.5; 19.0819407; 97.9286402; 75; 10.89; 132.5; 19.0819407; 180.21141; 75; 10.89; 97; 19.0819407; 110.873611; 77.4000876; 10.89; 158.5; 19.0819407; 181.169766; 75; 10.89; 50; 19.0819407; 35.7286574; 76.2780911; 10.89; 166.5; 19.0819407; 235.409037; 75.0567471; 10.89; 90.5; 19.0819407; 93.4747; 80; 10.89; 64; 19.0819407; 73.1537227; 75; 
55; 10.89; 54; 19.0819407; 38.58695; 80; 10.89; 48.5; 19.0819407; 61.1956281; 75; 10.89; 90; 19.0819407; 135.137579; 75; 10.89; 37; 19.0819407; 42.1338503; 80; 10.89; 35.5; 19.0819407; 40.4257212; 79.3395034; 10.89; 68; 19.0819407; 77.4351843; 80; 10.89; 62.5; 19.0819407; 71.4391823; 75.1387172; 10.89; 85.5; 19.0819407; 89.1083246; 76.903373; 10.89; 87.5; 19.0819407; 99.6408622; 75.5140371; 10.89; 97.5; 19.0819407; 138.28266; 75; 10.89; 132.5; 19.0819407; 137.226845; 78.7469486; 10.89; 97; 19.0819407; 110.459013; 79.3940181; 10.89; 158.5; 19.0819407; 221.074444; 76.1357777; 10.89; 50; 19.0819407; 57.1513459; 75; 10.89; 166.5; 19.0819407; 172.366788; 75.4829486; 10.89; 90.5; 19.0819407; 64.6688699; 80; 10.89; 64; 19.0819407; 95.7389989; 75; 
56; 10.89; 54; 19.0819407; 38.58695; 80; 10.89; 48.5; 19.0819407; 61.3434098; 75; 10.89; 90; 19.0819407; 126.123979; 75.0239186; 10.89; 37; 19.0819407; 26.4864732; 76.0382119; 10.89; 35.5; 19.0819407; 40.5774556; 75; 10.89; 68; 19.0819407; 48.590974; 80; 10.89; 62.5; 19.0819407; 71.1720444; 80; 10.89; 85.5; 19.0819407; 98.0591844; 75; 10.89; 87.5; 19.0819407; 100.143787; 75; 10.89; 97.5; 19.0819407; 141.863671; 75; 10.89; 132.5; 19.0819407; 151.451067; 75; 10.89; 97; 19.0819407; 110.873611; 75; 10.89; 158.5; 19.0819407; 201.671213; 75; 10.89; 50; 19.0819407; 74.8790466; 75; 10.89; 166.5; 19.0819407; 190.313982; 75; 10.89; 90.5; 19.0819407; 103.443936; 75.8160376; 10.89; 64; 19.0819407; 85.6322637; 76.4450703; 
57; 10.89; 54; 22.3180593; 38.58695; 80; 10.89; 48.5; 22.3180593; 55.2295065; 78.7280181; 10.89; 90; 22.3180593; 122.954621; 75.1520701; 10.89; 37; 22.3180593; 42.2919959; 75; 10.89; 35.5; 22.3180593; 40.4257212; 79.3826296; 10.89; 68; 22.3180593; 48.590974; 80; 10.89; 62.5; 22.3180593; 44.6608217; 80; 10.89; 85.5; 22.3180593; 126.61705; 75; 10.89; 87.5; 22.3180593; 129.876087; 75; 10.89; 97.5; 22.3180593; 133.267938; 75.1468533; 10.89; 132.5; 22.3180593; 150.884734; 75; 10.89; 97; 22.3180593; 110.459013; 80; 10.89; 158.5; 22.3180593; 187.277987; 75; 10.89; 50; 22.3180593; 53.4910869; 80; 10.89; 166.5; 22.3180593; 246.757709; 75; 10.89; 90.5; 22.3180593; 103.05712; 78.5150678; 10.89; 64; 22.3180593; 62.8292038; 75; 
58; 10.89; 54; 20.7; 61.7234535; 76.7249471; 10.89; 48.5; 20.7; 55.4368055; 75; 10.89; 90; 20.7; 122.725259; 75.0285417; 10.89; 37; 20.7; 55.1489527; 75; 10.89; 35.5; 20.7; 40.5774556; 75; 10.89; 68; 20.7; 77.7258304; 76.9852784; 10.89; 62.5; 20.7; 71.4391823; 76.8400913; 10.89; 85.5; 20.7; 90.0578662; 80; 10.89; 87.5; 20.7; 120.792436; 75.0678034; 10.89; 97.5; 20.7; 132.827941; 75.1733924; 10.89; 132.5; 20.7; 151.451067; 75; 10.89; 97; 20.7; 89.547389; 79.9225757; 10.89; 158.5; 20.7; 204.424956; 75; 10.89; 50; 20.7; 35.7286574; 80; 10.89; 166.5; 20.7; 229.234942; 75.0637014; 10.89; 90.5; 20.7; 103.443936; 75; 10.89; 64; 20.7; 73.1537227; 75; 
59; 10.89; 54; 19.0819407; 61.4926464; 75; 10.89; 48.5; 19.0819407; 55.2295065; 78.7144973; 10.89; 90; 19.0819407; 122.779442; 75; 10.89; 37; 19.0819407; 39.4176255; 78.3706424; 10.89; 35.5; 19.0819407; 40.4257212; 75.6078239; 10.89; 68; 19.0819407; 77.4351843; 79.3878067; 10.89; 62.5; 19.0819407; 85.7137483; 78.9761928; 10.89; 85.5; 19.0819407; 61.0960041; 76.7445267; 10.89; 87.5; 19.0819407; 90.5761806; 78.8723555; 10.89; 97.5; 19.0819407; 101.052726; 79.3585139; 10.89; 132.5; 19.0819407; 196.494359; 75; 10.89; 97; 19.0819407; 89.345539; 75; 10.89; 158.5; 19.0819407; 228.314882; 75.1314706; 10.89; 50; 19.0819407; 57.1513459; 76.0236728; 10.89; 166.5; 19.0819407; 225.759264; 75.0442179; 10.89; 90.5; 19.0819407; 103.05712; 78.5272511; 10.89; 64; 19.0819407; 94.8869989; 75; 
60; 10.89; 54; 20.7; 61.7234535; 75; 10.89; 48.5; 20.7; 55.4368055; 75; 10.89; 90; 20.7; 122.989149; 75; 10.89; 37; 20.7; 42.2919959; 75; 10.89; 35.5; 20.7; 40.6937568; 75; 10.89; 68; 20.7; 77.7258304; 75; 10.89; 62.5; 20.7; 74.2061442; 78.6525629; 10.89; 85.5; 20.7; 97.7288014; 75; 10.89; 87.5; 20.7; 100.014855; 75; 10.89; 97.5; 20.7; 111.445124; 75; 10.89; 132.5; 20.7; 182.633095; 75; 10.89; 97; 20.7; 110.873611; 75; 10.89; 158.5; 20.7; 215.353699; 75.0946133; 10.89; 50; 20.7; 56.9376355; 80; 10.89; 166.5; 20.7; 225.70036; 75.0742513; 10.89; 90.5; 20.7; 103.443936; 75; 10.89; 64; 20.7; 68.6085877; 76.2873303; 
61; 10.89; 54; 22.3180593; 80.500185; 75; 10.89; 48.5; 22.3180593; 55.2295065; 78.7080706; 10.89; 90; 22.3180593; 122.914343; 75.0948538; 10.89; 37; 22.3180593; 42.1338503; 75.6009177; 10.89; 35.5; 22.3180593; 52.8768627; 75; 10.89; 68; 22.3180593; 77.4351843; 79.4473413; 10.89; 62.5; 22.3180593; 59.6583852; 80; 10.89; 85.5; 22.3180593; 127.896366; 75; 10.89; 87.5; 22.3180593; 99.6408622; 77.6881413; 10.89; 97.5; 22.3180593; 111.028389; 79.3753353; 10.89; 132.5; 22.3180593; 137.051523; 75; 10.89; 97; 22.3180593; 143.659799; 75; 10.89; 158.5; 22.3180593; 215.562995; 75.0717062; 10.89; 50; 22.3180593; 35.7286574; 80; 10.89; 166.5; 22.3180593; 225.636943; 75.0450636; 10.89; 90.5; 22.3180593; 103.05712; 75; 10.89; 64; 22.3180593; 73.6313404; 75; 
62; 10.89; 54; 19.0819407; 68.2891145; 75; 10.89; 48.5; 19.0819407; 55.4368055; 75; 10.89; 90; 19.0819407; 122.448919; 75; 10.89; 37; 19.0819407; 42.3823895; 75; 10.89; 35.5; 19.0819407; 49.3226271; 75.0553321; 10.89; 68; 19.0819407; 77.7258304; 75; 10.89; 62.5; 19.0819407; 44.6608217; 80; 10.89; 85.5; 19.0819407; 118.816813; 75.0649403; 10.89; 87.5; 19.0819407; 100.014855; 75; 10.89; 97.5; 19.0819407; 111.445124; 75; 10.89; 132.5; 19.0819407; 151.451067; 75; 10.89; 97; 19.0819407; 135.126954; 75; 10.89; 158.5; 19.0819407; 215.63541; 75.0658642; 10.89; 50; 19.0819407; 57.1513459; 76.0804969; 10.89; 166.5; 19.0819407; 225.569427; 75.0756738; 10.89; 90.5; 19.0819407; 103.443936; 75; 10.89; 64; 19.0819407; 94.1907566; 75; 
63; 10.89; 54; 19.0819407; 70.0342708; 75; 10.89; 48.5; 19.0819407; 55.2295065; 78.7011103; 10.89; 90; 19.0819407; 122.600097; 75; 10.89; 37; 19.0819407; 54.5426803; 75; 10.89; 35.5; 19.0819407; 36.8796937; 79.2808855; 10.89; 68; 19.0819407; 77.4351843; 75; 10.89; 62.5; 19.0819407; 44.6608217; 80; 10.89; 85.5; 19.0819407; 116.043036; 75; 10.89; 87.5; 19.0819407; 99.6408622; 75; 10.89; 97.5; 19.0819407; 111.028389; 79.4015581; 10.89; 132.5; 19.0819407; 196.158651; 75; 10.89; 97; 19.0819407; 102.023885; 79.4546712; 10.89; 158.5; 19.0819407; 189.163572; 75.2633115; 10.89; 50; 19.0819407; 56.9376355; 79.0335313; 10.89; 166.5; 19.0819407; 225.497758; 75.0668476; 10.89; 90.5; 19.0819407; 133.927383; 75; 10.89; 64; 19.0819407; 87.981839; 75.5399212; 
64; 10.89; 54; 22.3180593; 76.6066639; 75; 10.89; 48.5; 22.3180593; 55.4368055; 75; 10.89; 90; 22.3180593; 116.226646; 75.1039309; 10.89; 37; 22.3180593; 38.7242474; 80; 10.89; 35.5; 22.3180593; 40.5774556; 75; 10.89; 68; 22.3180593; 77.7258304; 75; 10.89; 62.5; 22.3180593; 71.4391823; 77.8108347; 10.89; 85.5; 22.3180593; 116.183142; 75.2006654; 10.89; 87.5; 22.3180593; 100.014855; 75; 10.89; 97.5; 22.3180593; 111.445124; 75; 10.89; 132.5; 22.3180593; 182.085774; 75; 10.89; 97; 22.3180593; 110.873611; 75; 10.89; 158.5; 22.3180593; 201.477259; 75; 10.89; 50; 22.3180593; 57.1513459; 75; 10.89; 166.5; 22.3180593; 225.421968; 75.0676039; 10.89; 90.5; 22.3180593; 124.290306; 75; 10.89; 64; 22.3180593; 85.9227255; 75.5052028; 
65; 10.89; 54; 22.3180593; 73.4820316; 75; 10.89; 48.5; 22.3180593; 55.2295065; 78.691906; 10.89; 90; 22.3180593; 86.7227539; 75; 10.89; 37; 22.3180593; 26.4392065; 75.8714681; 10.89; 35.5; 22.3180593; 40.4257212; 75; 10.89; 68; 22.3180593; 101.544445; 75; 10.89; 62.5; 22.3180593; 71.1720444; 80; 10.89; 85.5; 22.3180593; 116.072975; 75; 10.89; 87.5; 22.3180593; 129.677551; 75; 10.89; 97.5; 22.3180593; 111.028389; 75.9082326; 10.89; 132.5; 22.3180593; 179.394798; 75; 10.89; 97; 22.3180593; 110.459013; 79.4703644; 10.89; 158.5; 22.3180593; 227.050038; 75.0462784; 10.89; 50; 22.3180593; 56.9376355; 79.0616468; 10.89; 166.5; 22.3180593; 225.240047; 75.0912654; 10.89; 90.5; 22.3180593; 116.112864; 75; 10.89; 64; 22.3180593; 65.8600576; 78.6225031; 
66; 10.89; 54; 20.7; 73.4754173; 75; 10.89; 48.5; 20.7; 55.4368055; 75; 10.89; 90; 20.7; 102.872423; 75; 10.89; 37; 20.7; 42.2919959; 75; 10.89; 35.5; 20.7; 40.5790799; 75; 10.89; 68; 20.7; 94.8422786; 75; 10.89; 62.5; 20.7; 54.3064029; 80; 10.89; 85.5; 20.7; 116.037521; 75; 10.89; 87.5; 20.7; 120.468337; 75.1276728; 10.89; 97.5; 20.7; 111.505975; 75; 10.89; 132.5; 20.7; 179.340423; 75; 10.89; 97; 20.7; 110.873611; 75; 10.89; 158.5; 20.7; 215.42368; 75; 10.89; 50; 20.7; 57.1513459; 75; 10.89; 166.5; 20.7; 225.197224; 75.0601795; 10.89; 90.5; 20.7; 119.081533; 75; 10.89; 64; 20.7; 73.1537227; 75; 
67; 10.89; 54; 20.7; 56.2247744; 79.0402109; 10.89; 48.5; 20.7; 55.2295065; 78.6800327; 10.89; 90; 20.7; 133.985985; 75; 10.89; 37; 20.7; 54.9812231; 75; 10.89; 35.5; 20.7; 52.8039478; 75; 10.89; 68; 20.7; 93.1228361; 75; 10.89; 62.5; 20.7; 54.2101797; 80; 10.89; 85.5; 20.7; 115.762397; 75; 10.89; 87.5; 20.7; 90.4499092; 75.3627601; 10.89; 97.5; 20.7; 145.088613; 75; 10.89; 132.5; 20.7; 148.310462; 75; 10.89; 97; 20.7; 110.459013; 79.495254; 10.89; 158.5; 20.7; 215.429402; 75; 10.89; 50; 20.7; 56.9376355; 79.0760941; 10.89; 166.5; 20.7; 198.116156; 75.2284368; 10.89; 90.5; 20.7; 96.3141108; 78.2611266; 10.89; 64; 20.7; 94.1707231; 75; 
68; 10.89; 54; 20.7; 61.7234535; 75; 10.89; 48.5; 20.7; 55.4368055; 75; 10.89; 90; 20.7; 124.707268; 75.0863541; 10.89; 37; 20.7; 50.8735675; 75; 10.89; 35.5; 20.7; 49.1932766; 75; 10.89; 68; 20.7; 93.1015645; 75; 10.89; 62.5; 20.7; 44.6608217; 80; 10.89; 85.5; 20.7; 115.590853; 75; 10.89; 87.5; 20.7; 95.9312739; 75; 10.89; 97.5; 20.7; 135.118551; 75.1412475; 10.89; 132.5; 20.7; 162.861937; 75; 10.89; 97; 20.7; 110.873611; 75; 10.89; 158.5; 20.7; 214.796898; 75; 10.89; 50; 20.7; 57.1513459; 75; 10.89; 166.5; 20.7; 210.759974; 75; 10.89; 90.5; 20.7; 103.443936; 75; 10.89; 64; 20.7; 87.7235401; 75; 
69; 10.89; 54; 20.7; 61.4926464; 75; 10.89; 48.5; 20.7; 55.2295065; 78.6653421; 10.89; 90; 20.7; 122.418831; 75.0313253; 10.89; 37; 20.7; 49.6796832; 75.1459302; 10.89; 35.5; 20.7; 48.3909545; 75; 10.89; 68; 20.7; 93.0777283; 75; 10.89; 62.5; 20.7; 57.9203337; 80; 10.89; 85.5; 20.7; 113.86264; 75; 10.89; 87.5; 20.7; 127.264671; 75; 10.89; 97.5; 20.7; 101.081601; 79.2786031; 10.89; 132.5; 20.7; 193.23835; 75; 10.89; 97; 20.7; 110.459013; 79.521277; 10.89; 158.5; 20.7; 214.872288; 75; 10.89; 50; 20.7; 56.9376355; 79.0860548; 10.89; 166.5; 20.7; 184.118577; 75.6118613; 10.89; 90.5; 20.7; 103.05712; 78.2170733; 10.89; 64; 20.7; 66.6213466; 79.1630318; 
70; 10.89; 54; 20.7; 61.7234535; 75; 10.89; 48.5; 20.7; 55.4368055; 75; 10.89; 90; 20.7; 122.020005; 75.1677154; 10.89; 37; 20.7; 49.6892647; 75.0829983; 10.89; 35.5; 20.7; 48.3789873; 75.1276669; 10.89; 68; 20.7; 93.0517823; 75; 10.89; 62.5; 20.7; 57.7880583; 80; 10.89; 85.5; 20.7; 114.906373; 75; 10.89; 87.5; 20.7; 121.909869; 75; 10.89; 97.5; 20.7; 111.445124; 75; 10.89; 132.5; 20.7; 178.931518; 75; 10.89; 97; 20.7; 110.873611; 75; 10.89; 158.5; 20.7; 215.266731; 75; 10.89; 50; 20.7; 57.1513459; 75; 10.89; 166.5; 20.7; 190.313982; 75; 10.89; 90.5; 20.7; 103.443936; 75; 10.89; 64; 20.7; 73.1537227; 75; 
71; 10.89; 54; 19.0819407; 79.8852726; 75; 10.89; 48.5; 19.0819407; 55.2295065; 78.6477423; 10.89; 90; 19.0819407; 121.666128; 75; 10.89; 37; 19.0819407; 38.046255; 77.9025572; 10.89; 35.5; 19.0819407; 48.3427812; 75.0350783; 10.89; 68; 19.0819407; 73.0346811; 75; 10.89; 62.5; 19.0819407; 44.6608217; 80; 10.89; 85.5; 19.0819407; 116.745634; 75.4441484; 10.89; 87.5; 19.0819407; 118.181207; 75; 10.89; 97.5; 19.0819407; 111.028389; 75.9766167; 10.89; 132.5; 19.0819407; 136.578242; 78.1153911; 10.89; 97; 19.0819407; 110.459013; 79.5466823; 10.89; 158.5; 19.0819407; 215.030624; 75; 10.89; 50; 19.0819407; 56.9376355; 79.0935056; 10.89; 166.5; 19.0819407; 245.464695; 75; 10.89; 90.5; 19.0819407; 103.05712; 80; 10.89; 64; 19.0819407; 72.8801735; 79.147105; 
72; 10.89; 54; 22.3180593; 74.4639851; 75.188848; 10.89; 48.5; 22.3180593; 55.4368055; 75; 10.89; 90; 22.3180593; 122.171651; 75; 10.89; 37; 22.3180593; 42.2919959; 75; 10.89; 35.5; 22.3180593; 48.3353961; 75.0494679; 10.89; 68; 22.3180593; 80.0339785; 75; 10.89; 62.5; 22.3180593; 71.4391823; 77.868556; 10.89; 85.5; 22.3180593; 115.44063; 75.297275; 10.89; 87.5; 22.3180593; 118.180876; 75; 10.89; 97.5; 22.3180593; 111.445124; 75; 10.89; 132.5; 22.3180593; 151.451067; 75; 10.89; 97; 22.3180593; 110.873611; 75; 10.89; 158.5; 22.3180593; 214.483348; 75.11322; 10.89; 50; 22.3180593; 57.1513459; 75; 10.89; 166.5; 22.3180593; 227.144693; 75.0808977; 10.89; 90.5; 22.3180593; 74.5835759; 80; 10.89; 64; 22.3180593; 73.1537227; 75; 
73; 10.89; 54; 19.0819407; 73.2529794; 75; 10.89; 48.5; 19.0819407; 55.2295065; 75; 10.89; 90; 19.0819407; 122.410117; 75; 10.89; 37; 19.0819407; 42.1338503; 75.6321609; 10.89; 35.5; 19.0819407; 36.803636; 75; 10.89; 68; 19.0819407; 100.782049; 75; 10.89; 62.5; 19.0819407; 71.1720444; 80; 10.89; 85.5; 19.0819407; 115.141579; 75.2694961; 10.89; 87.5; 19.0819407; 118.243929; 75; 10.89; 97.5; 19.0819407; 144.836421; 75; 10.89; 132.5; 19.0819407; 186.761724; 75; 10.89; 97; 19.0819407; 110.459013; 80; 10.89; 158.5; 19.0819407; 163.866872; 75; 10.89; 50; 19.0819407; 56.9376355; 79.0988514; 10.89; 166.5; 19.0819407; 171.312244; 78.1212197; 10.89; 90.5; 19.0819407; 74.4846679; 75.5829278; 10.89; 64; 19.0819407; 72.8801735; 78.211304; 
74; 10.89; 54; 22.3180593; 73.2396697; 75; 10.89; 48.5; 22.3180593; 55.4368055; 75; 10.89; 90; 22.3180593; 121.884226; 75; 10.89; 37; 22.3180593; 42.2919959; 75; 10.89; 35.5; 22.3180593; 40.5774556; 75; 10.89; 68; 22.3180593; 93.919736; 75; 10.89; 62.5; 22.3180593; 71.4391823; 75.5365096; 10.89; 85.5; 22.3180593; 115.195217; 75; 10.89; 87.5; 22.3180593; 118.149767; 75; 10.89; 97.5; 22.3180593; 134.765673; 75.1289761; 10.89; 132.5; 22.3180593; 164.940672; 75; 10.89; 97; 22.3180593; 69.4033904; 80; 10.89; 158.5; 22.3180593; 181.169766; 75; 10.89; 50; 22.3180593; 57.1513459; 75; 10.89; 166.5; 22.3180593; 190.313982; 75; 10.89; 90.5; 22.3180593; 103.443936; 75; 10.89; 64; 22.3180593; 73.1537227; 75; 
75; 10.89; 54; 19.0819407; 60.5409049; 75; 10.89; 48.5; 19.0819407; 60.6263528; 75; 10.89; 90; 19.0819407; 121.940711; 75; 10.89; 37; 19.0819407; 54.2685562; 75; 10.89; 35.5; 19.0819407; 52.6674312; 75; 10.89; 68; 19.0819407; 77.7199132; 75; 10.89; 62.5; 19.0819407; 81.8824423; 75; 10.89; 85.5; 19.0819407; 94.7581778; 75; 10.89; 87.5; 19.0819407; 117.898782; 75; 10.89; 97.5; 19.0819407; 110.522178; 75.419495; 10.89; 132.5; 19.0819407; 144.153538; 75; 10.89; 97; 19.0819407; 69.3135953; 78.1949233; 10.89; 158.5; 19.0819407; 206.382778; 75.348154; 10.89; 50; 19.0819407; 56.9376355; 79.1021528; 10.89; 166.5; 19.0819407; 189.602326; 80; 10.89; 90.5; 19.0819407; 103.05712; 75; 10.89; 64; 19.0819407; 77.6914084; 75; 
76; 12.87; 54; 22.3180593; 66.4018055; 75; 12.87; 48.5; 22.3180593; 60.7798135; 75; 12.87; 90; 22.3180593; 121.763721; 75; 12.87; 37; 22.3180593; 49.999349; 75.1180924; 12.87; 35.5; 22.3180593; 48.9568376; 75; 12.87; 68; 22.3180593; 84.7903935; 75; 12.87; 62.5; 22.3180593; 82.0427345; 75; 12.87; 85.5; 22.3180593; 104.404732; 75; 12.87; 87.5; 22.3180593; 90.1557752; 80; 12.87; 97.5; 22.3180593; 120.863961; 75; 12.87; 132.5; 22.3180593; 166.379164; 75; 12.87; 97; 22.3180593; 110.873611; 75; 12.87; 158.5; 22.3180593; 202.193923; 75; 12.87; 50; 22.3180593; 57.1513459; 75; 12.87; 166.5; 22.3180593; 118.976429; 80; 12.87; 90.5; 22.3180593; 103.443936; 75; 12.87; 64; 22.3180593; 77.9169613; 75; 
77; 17.833466; 54; 19.0819407; 78.8524024; 75; 17.833466; 48.5; 19.0819407; 55.2295065; 75; 17.833466; 90; 19.0819407; 121.751309; 75; 17.833466; 37; 19.0819407; 37.870511; 75; 17.833466; 35.5; 19.0819407; 48.182208; 75; 17.833466; 68; 19.0819407; 99.5564032; 75; 17.833466; 62.5; 19.0819407; 92.648716; 75.106584; 17.833466; 85.5; 19.0819407; 124.774187; 75; 17.833466; 87.5; 19.0819407; 62.7154994; 80; 17.833466; 97.5; 19.0819407; 111.028389; 75; 17.833466; 132.5; 19.0819407; 150.884734; 80; 17.833466; 97; 19.0819407; 110.459013; 75; 17.833466; 158.5; 19.0819407; 188.371038; 75; 17.833466; 50; 19.0819407; 56.9376355; 79.1033925; 17.833466; 166.5; 19.0819407; 118.976429; 80; 17.833466; 90.5; 19.0819407; 103.05712; 75; 17.833466; 64; 19.0819407; 92.7544663; 75; 
78; 21.4166335; 54; 22.3180593; 73.077932; 75; 21.4166335; 48.5; 22.3180593; 55.4368055; 75; 21.4166335; 90; 22.3180593; 122.036778; 75; 21.4166335; 37; 22.3180593; 42.2919959; 75; 21.4166335; 35.5; 22.3180593; 36.7158823; 75; 21.4166335; 68; 22.3180593; 70.4915141; 80; 21.4166335; 62.5; 22.3180593; 65.9232445; 80; 21.4166335; 85.5; 22.3180593; 114.951471; 75; 21.4166335; 87.5; 22.3180593; 100.014855; 75; 21.4166335; 97.5; 22.3180593; 111.445124; 75; 21.4166335; 132.5; 22.3180593; 95.618107; 75.5271704; 21.4166335; 97; 22.3180593; 110.873611; 75; 21.4166335; 158.5; 22.3180593; 193.486459; 75; 21.4166335; 50; 22.3180593; 57.1513459; 75; 21.4166335; 166.5; 22.3180593; 190.313976; 76.299732; 21.4166335; 90.5; 22.3180593; 103.443936; 75; 21.4166335; 64; 22.3180593; 86.2748833; 75.3822927; 
79; 21.4166335; 54; 20.7; 55.7187281; 78.6192914; 21.4166335; 48.5; 20.7; 55.2295065; 75; 21.4166335; 90; 20.7; 110.454308; 75; 21.4166335; 37; 20.7; 42.1338503; 75; 21.4166335; 35.5; 20.7; 40.5774556; 75; 21.4166335; 68; 20.7; 48.590974; 76.261343; 21.4166335; 62.5; 20.7; 71.4391823; 75.647965; 21.4166335; 85.5; 20.7; 87.5475508; 78.7479966; 21.4166335; 87.5; 20.7; 99.6408622; 75; 21.4166335; 97.5; 20.7; 144.334195; 75; 21.4166335; 132.5; 20.7; 95.6087579; 80; 21.4166335; 97; 20.7; 145.688722; 75; 21.4166335; 158.5; 20.7; 180.492305; 75; 21.4166335; 50; 20.7; 56.9376355; 80; 21.4166335; 166.5; 20.7; 189.602326; 80; 21.4166335; 90.5; 20.7; 103.05712; 78.5881931; 21.4166335; 64; 20.7; 65.7952957; 75; 
80; 21.4166335; 54; 20.7; 61.7234535; 75; 21.4166335; 48.5; 20.7; 55.4368055; 75; 21.4166335; 90; 20.7; 89.6096696; 75; 21.4166335; 37; 20.7; 42.2919959; 75; 21.4166335; 35.5; 20.7; 52.5181663; 75; 21.4166335; 68; 20.7; 77.7258304; 75; 21.4166335; 62.5; 20.7; 71.1720444; 80; 21.4166335; 85.5; 20.7; 97.7288014; 75; 21.4166335; 87.5; 20.7; 100.014855; 75; 21.4166335; 97.5; 20.7; 134.11625; 75; 21.4166335; 132.5; 20.7; 151.451067; 75; 21.4166335; 97; 20.7; 136.095725; 75.0401293; 21.4166335; 158.5; 20.7; 181.169766; 75; 21.4166335; 50; 20.7; 35.7286574; 80; 21.4166335; 166.5; 20.7; 118.976435; 80; 21.4166335; 90.5; 20.7; 103.443936; 75; 21.4166335; 64; 20.7; 73.1537227; 75; 
81; 21.4166335; 54; 20.7; 61.4926464; 78.449407; 21.4166335; 48.5; 20.7; 66.6197105; 78.9344; 21.4166335; 90; 20.7; 72.2784701; 80; 21.4166335; 37; 20.7; 54.0823857; 75; 21.4166335; 35.5; 20.7; 37.3518222; 78.495672; 21.4166335; 68; 20.7; 77.4351843; 75; 21.4166335; 62.5; 20.7; 71.4391823; 75.671696; 21.4166335; 85.5; 20.7; 97.3633568; 75; 21.4166335; 87.5; 20.7; 129.235052; 75; 21.4166335; 97.5; 20.7; 100.828741; 78.8057982; 21.4166335; 132.5; 20.7; 150.884734; 78.5802373; 21.4166335; 97; 20.7; 100.899194; 79.3573552; 21.4166335; 158.5; 20.7; 204.843203; 75; 21.4166335; 50; 20.7; 35.7286574; 80; 21.4166335; 166.5; 20.7; 118.976429; 80; 21.4166335; 90.5; 20.7; 103.05712; 77.7061646; 21.4166335; 64; 20.7; 72.8801735; 75; 
82; 20.7; 54; 22.3180593; 61.7234535; 75; 20.7; 48.5; 22.3180593; 45.9333743; 80; 20.7; 90; 22.3180593; 64.408283; 78.1343587; 20.7; 37; 22.3180593; 49.6360144; 75; 20.7; 35.5; 22.3180593; 40.5774556; 75; 20.7; 68; 22.3180593; 77.7258304; 75; 20.7; 62.5; 22.3180593; 71.1720444; 80; 20.7; 85.5; 22.3180593; 97.7288014; 75; 20.7; 87.5; 22.3180593; 119.333956; 75; 20.7; 97.5; 22.3180593; 111.445124; 75; 20.7; 132.5; 22.3180593; 151.451067; 75; 20.7; 97; 22.3180593; 110.873611; 75; 20.7; 158.5; 22.3180593; 137.80763; 75.6439934; 20.7; 50; 22.3180593; 57.1513459; 76.9131184; 20.7; 166.5; 22.3180593; 183.196412; 77.9460683; 20.7; 90.5; 22.3180593; 103.443936; 75; 20.7; 64; 22.3180593; 73.1537227; 75; 
83; 20.7; 54; 19.0819407; 61.4926464; 80; 20.7; 48.5; 19.0819407; 34.6567977; 80; 20.7; 90; 19.0819407; 64.3115833; 80; 20.7; 37; 19.0819407; 37.6932756; 80; 20.7; 35.5; 19.0819407; 40.4257212; 75; 20.7; 68; 19.0819407; 101.254845; 75; 20.7; 62.5; 19.0819407; 70.5562496; 76.2336465; 20.7; 85.5; 19.0819407; 125.75527; 75; 20.7; 87.5; 19.0819407; 89.7605594; 75; 20.7; 97.5; 19.0819407; 111.028389; 75; 20.7; 132.5; 19.0819407; 150.884734; 75; 20.7; 97; 19.0819407; 110.459013; 79.349578; 20.7; 158.5; 19.0819407; 113.259844; 79.0737104; 20.7; 50; 19.0819407; 56.9376355; 79.2228724; 20.7; 166.5; 19.0819407; 182.555761; 80; 20.7; 90.5; 19.0819407; 103.05712; 75; 20.7; 64; 19.0819407; 94.0538718; 75; 
84; 18.3112216; 54; 20.7; 51.6405099; 80; 18.3112216; 48.5; 20.7; 55.4368055; 75; 18.3112216; 90; 20.7; 80.5019711; 75; 18.3112216; 37; 20.7; 26.4392065; 80; 18.3112216; 35.5; 20.7; 40.5774556; 75; 18.3112216; 68; 20.7; 94.0680394; 75; 18.3112216; 62.5; 20.7; 70.2979197; 80; 18.3112216; 85.5; 20.7; 115.422547; 75; 18.3112216; 87.5; 20.7; 100.014855; 75; 18.3112216; 97.5; 20.7; 111.445124; 76.6766327; 18.3112216; 132.5; 20.7; 151.451067; 75; 18.3112216; 97; 20.7; 110.873611; 75; 18.3112216; 158.5; 20.7; 181.169766; 75; 18.3112216; 50; 20.7; 57.1513459; 75; 18.3112216; 166.5; 20.7; 118.976429; 80; 18.3112216; 90.5; 20.7; 103.443936; 75; 18.3112216; 64; 20.7; 86.70259; 75; 
85; 18.3112216; 54; 20.7; 51.5102891; 75; 18.3112216; 48.5; 20.7; 55.2295065; 75; 18.3112216; 90; 20.7; 80.3404576; 80; 18.3112216; 37; 20.7; 26.4392065; 76.8183551; 18.3112216; 35.5; 20.7; 40.4257212; 78.9235527; 18.3112216; 68; 20.7; 75.9230767; 75; 18.3112216; 62.5; 20.7; 71.4391823; 75.739058; 18.3112216; 85.5; 20.7; 87.0523226; 75; 18.3112216; 87.5; 20.7; 128.423017; 75; 18.3112216; 97.5; 20.7; 111.028389; 75; 18.3112216; 132.5; 20.7; 150.884734; 75; 18.3112216; 97; 20.7; 110.459013; 75; 18.3112216; 158.5; 20.7; 180.492305; 78.6249705; 18.3112216; 50; 20.7; 56.9376355; 79.2486334; 18.3112216; 166.5; 20.7; 118.97663; 78.1775111; 18.3112216; 90.5; 20.7; 103.05712; 75; 18.3112216; 64; 20.7; 83.8137073; 75; 
86; 18.3112216; 54; 19.0819407; 61.7234535; 75; 18.3112216; 48.5; 19.0819407; 55.4368055; 75; 18.3112216; 90; 19.0819407; 64.3115833; 78.1439912; 18.3112216; 37; 19.0819407; 42.2919959; 75; 18.3112216; 35.5; 19.0819407; 40.5774556; 75; 18.3112216; 68; 19.0819407; 54.1900539; 76.9103544; 18.3112216; 62.5; 19.0819407; 75.4270563; 80; 18.3112216; 85.5; 19.0819407; 61.0960041; 77.9972195; 18.3112216; 87.5; 19.0819407; 118.221758; 75; 18.3112216; 97.5; 19.0819407; 69.7799016; 78.2624451; 18.3112216; 132.5; 19.0819407; 151.451067; 75; 18.3112216; 97; 19.0819407; 110.873611; 75; 18.3112216; 158.5; 19.0819407; 181.169766; 75; 18.3112216; 50; 19.0819407; 57.1513459; 75; 18.3112216; 166.5; 19.0819407; 190.313982; 75; 18.3112216; 90.5; 19.0819407; 103.443936; 75; 18.3112216; 64; 19.0819407; 84.5689843; 75; 
87; 21.4166335; 54; 22.3180593; 61.4926464; 75; 21.4166335; 48.5; 22.3180593; 55.2295065; 75; 21.4166335; 90; 22.3180593; 64.3115833; 80; 21.4166335; 37; 22.3180593; 42.1338503; 75; 21.4166335; 35.5; 22.3180593; 40.4257212; 75; 21.4166335; 68; 22.3180593; 48.590974; 80; 21.4166335; 62.5; 22.3180593; 59.2660984; 80; 21.4166335; 85.5; 22.3180593; 61.0960041; 80; 21.4166335; 87.5; 22.3180593; 89.4553702; 75; 21.4166335; 97.5; 22.3180593; 69.6708819; 80; 21.4166335; 132.5; 22.3180593; 150.884734; 77.8470953; 21.4166335; 97; 22.3180593; 110.459013; 75; 21.4166335; 158.5; 22.3180593; 180.492305; 80; 21.4166335; 50; 22.3180593; 56.9376355; 75; 21.4166335; 166.5; 22.3180593; 247.596777; 75; 21.4166335; 90.5; 22.3180593; 103.05712; 75; 21.4166335; 64; 22.3180593; 66.2711405; 78.6877908; 
88; 21.4166335; 54; 20.7; 61.7234535; 75; 21.4166335; 48.5; 20.7; 55.4368055; 75; 21.4166335; 90; 20.7; 92.0456863; 80; 21.4166335; 37; 20.7; 42.2919959; 75; 21.4166335; 35.5; 20.7; 25.3760108; 78.1309802; 21.4166335; 68; 20.7; 48.590974; 79.0406657; 21.4166335; 62.5; 20.7; 54.9498575; 80; 21.4166335; 85.5; 20.7; 61.0960041; 78.5400354; 21.4166335; 87.5; 20.7; 100.014855; 75; 21.4166335; 97.5; 20.7; 111.445124; 75; 21.4166335; 132.5; 20.7; 151.451067; 75; 21.4166335; 97; 20.7; 110.873611; 75; 21.4166335; 158.5; 20.7; 113.259844; 75.476517; 21.4166335; 50; 20.7; 57.1513459; 75; 21.4166335; 166.5; 20.7; 229.254669; 75; 21.4166335; 90.5; 20.7; 103.443936; 76.3305965; 21.4166335; 64; 20.7; 73.1537227; 75; 
89; 21.4166335; 54; 20.7; 61.4926464; 75; 21.4166335; 48.5; 20.7; 56.1615549; 75; 21.4166335; 90; 20.7; 91.769014; 75; 21.4166335; 37; 20.7; 42.1338503; 80; 21.4166335; 35.5; 20.7; 25.3673467; 80; 21.4166335; 68; 20.7; 48.590974; 80; 21.4166335; 62.5; 20.7; 44.6649561; 80; 21.4166335; 85.5; 20.7; 61.0960041; 80; 21.4166335; 87.5; 20.7; 99.6408622; 75; 21.4166335; 97.5; 20.7; 111.028389; 75; 21.4166335; 132.5; 20.7; 150.884734; 77.1182138; 21.4166335; 97; 20.7; 144.884172; 75; 21.4166335; 158.5; 20.7; 113.259844; 80; 21.4166335; 50; 20.7; 56.9376355; 75; 21.4166335; 166.5; 20.7; 172.599948; 75; 21.4166335; 90.5; 20.7; 103.05712; 75; 21.4166335; 64; 20.7; 72.8801735; 80; 
90; 21.4166335; 54; 20.7; 38.58695; 78.464199; 21.4166335; 48.5; 20.7; 56.3595559; 75; 21.4166335; 90; 20.7; 88.6990925; 75; 21.4166335; 37; 20.7; 26.4392065; 75.5045881; 21.4166335; 35.5; 20.7; 25.3673467; 78.818877; 21.4166335; 68; 20.7; 77.7258304; 75; 21.4166335; 62.5; 20.7; 71.4391823; 78.0542824; 21.4166335; 85.5; 20.7; 97.7288014; 75; 21.4166335; 87.5; 20.7; 100.014855; 75; 21.4166335; 97.5; 20.7; 111.445124; 75; 21.4166335; 132.5; 20.7; 151.451067; 75; 21.4166335; 97; 20.7; 103.395333; 80; 21.4166335; 158.5; 20.7; 113.259844; 80; 21.4166335; 50; 20.7; 57.1513459; 75; 21.4166335; 166.5; 20.7; 190.313982; 75; 21.4166335; 90.5; 20.7; 103.443936; 75.9622254; 21.4166335; 64; 20.7; 45.7326815; 80; 
91; 21.4166335; 54; 20.7; 38.58695; 79.1553972; 21.4166335; 48.5; 20.7; 55.2295065; 75; 21.4166335; 90; 20.7; 88.4558054; 80; 21.4166335; 37; 20.7; 26.4392065; 80; 21.4166335; 35.5; 20.7; 25.3673467; 80; 21.4166335; 68; 20.7; 77.4351843; 80; 21.4166335; 62.5; 20.7; 76.7661182; 80; 21.4166335; 85.5; 20.7; 97.3633567; 80; 21.4166335; 87.5; 20.7; 99.6408652; 80; 21.4166335; 97.5; 20.7; 111.028389; 75; 21.4166335; 132.5; 20.7; 150.884734; 77.010088; 21.4166335; 97; 20.7; 69.3135953; 76.3021423; 21.4166335; 158.5; 20.7; 113.259844; 80; 21.4166335; 50; 20.7; 74.6288191; 75; 21.4166335; 166.5; 20.7; 205.85887; 75; 21.4166335; 90.5; 20.7; 103.05712; 75; 21.4166335; 64; 20.7; 45.7326815; 80; 
92; 21.4166335; 54; 22.3180593; 61.7234535; 75; 21.4166335; 48.5; 22.3180593; 34.6567977; 80; 21.4166335; 90; 22.3180593; 64.3115833; 77.1974272; 21.4166335; 37; 22.3180593; 26.4392065; 78.2253097; 21.4166335; 35.5; 22.3180593; 40.5774556; 75; 21.4166335; 68; 22.3180593; 69.7449146; 75; 21.4166335; 62.5; 22.3180593; 69.0775178; 75; 21.4166335; 85.5; 22.3180593; 61.0960041; 75.8350358; 21.4166335; 87.5; 22.3180593; 62.5251534; 75.7352089; 21.4166335; 97.5; 22.3180593; 111.445124; 75; 21.4166335; 132.5; 22.3180593; 151.451067; 75; 21.4166335; 97; 22.3180593; 110.873611; 75; 21.4166335; 158.5; 22.3180593; 181.169766; 75; 21.4166335; 50; 22.3180593; 69.5119229; 75; 21.4166335; 166.5; 22.3180593; 206.408352; 75; 21.4166335; 90.5; 22.3180593; 103.443936; 75; 21.4166335; 64; 22.3180593; 45.7326815; 77.4190137; 
93; 21.4166335; 54; 19.0819407; 61.4926483; 75; 21.4166335; 48.5; 19.0819407; 34.6567977; 78.228219; 21.4166335; 90; 19.0819407; 64.3115833; 80; 21.4166335; 37; 19.0819407; 26.4392065; 80; 21.4166335; 35.5; 19.0819407; 40.4257212; 75; 21.4166335; 68; 19.0819407; 69.5338852; 75; 21.4166335; 62.5; 19.0819407; 70.0707653; 75; 21.4166335; 85.5; 19.0819407; 61.0960041; 80; 21.4166335; 87.5; 19.0819407; 62.5251504; 80; 21.4166335; 97.5; 19.0819407; 111.028389; 80; 21.4166335; 132.5; 19.0819407; 150.884734; 76.8952419; 21.4166335; 97; 19.0819407; 122.689735; 75; 21.4166335; 158.5; 19.0819407; 180.492305; 75; 21.4166335; 50; 19.0819407; 51.8349312; 78.8328634; 21.4166335; 166.5; 19.0819407; 189.602326; 77.8445887; 21.4166335; 90.5; 19.0819407; 103.05712; 75; 21.4166335; 64; 19.0819407; 45.7326815; 80; 
94; 21.4166335; 54; 19.0819407; 38.5869518; 78.4349271; 21.4166335; 48.5; 19.0819407; 55.4368055; 75; 21.4166335; 90; 19.0819407; 64.3115833; 78.6063886; 21.4166335; 37; 19.0819407; 26.4392065; 78.176254; 21.4166335; 35.5; 19.0819407; 40.5774556; 76.7204379; 21.4166335; 68; 19.0819407; 77.7258304; 75; 21.4166335; 62.5; 19.0819407; 66.2812132; 75; 21.4166335; 85.5; 19.0819407; 97.7288014; 75; 21.4166335; 87.5; 19.0819407; 62.5251504; 78.4486706; 21.4166335; 97.5; 19.0819407; 105.678102; 75; 21.4166335; 132.5; 19.0819407; 151.451067; 75; 21.4166335; 97; 19.0819407; 122.982321; 75; 21.4166335; 158.5; 19.0819407; 113.259844; 80; 21.4166335; 50; 19.0819407; 57.1513459; 75; 21.4166335; 166.5; 19.0819407; 190.313982; 75; 21.4166335; 90.5; 19.0819407; 103.443936; 75; 21.4166335; 64; 19.0819407; 73.1537205; 75; 
95; 21.4166335; 54; 19.0819407; 38.58695; 80; 21.4166335; 48.5; 19.0819407; 55.2295065; 75; 21.4166335; 90; 19.0819407; 64.3115833; 80; 21.4166335; 37; 19.0819407; 26.4392065; 80; 21.4166335; 35.5; 19.0819407; 40.4257212; 75; 21.4166335; 68; 19.0819407; 77.4351843; 78.8991896; 21.4166335; 62.5; 19.0819407; 77.9930252; 75; 21.4166335; 85.5; 19.0819407; 97.3633568; 80; 21.4166335; 87.5; 19.0819407; 62.5251504; 80; 21.4166335; 97.5; 19.0819407; 105.318898; 78.6052989; 21.4166335; 132.5; 19.0819407; 150.884734; 75; 21.4166335; 97; 19.0819407; 110.459013; 78.7505713; 21.4166335; 158.5; 19.0819407; 113.259844; 80; 21.4166335; 50; 19.0819407; 56.9376355; 75; 21.4166335; 166.5; 19.0819407; 189.602326; 75; 21.4166335; 90.5; 19.0819407; 103.05712; 77.0296336; 21.4166335; 64; 19.0819407; 72.8801735; 80; 
96; 21.4166335; 54; 47.1941779; 61.7234535; 75; 21.4166335; 48.5; 47.1941779; 55.4368055; 75; 21.4166335; 90; 47.1941779; 64.3115833; 78.5716714; 21.4166335; 37; 47.1941779; 26.5209189; 78.1375279; 21.4166335; 35.5; 47.1941779; 25.3673467; 77.9108393; 21.4166335; 68; 47.1941779; 77.7258304; 75; 21.4166335; 62.5; 23.9361186; 89.7682687; 75; 21.4166335; 85.5; 47.1941779; 61.0960041; 75.7425472; 21.4166335; 87.5; 47.1941779; 100.014855; 75; 21.4166335; 97.5; 47.1941779; 111.445124; 75; 21.4166335; 132.5; 47.1941779; 151.451066; 75; 21.4166335; 97; 47.1941779; 110.873611; 75; 21.4166335; 158.5; 47.1941779; 181.169766; 75; 21.4166335; 50; 47.1941779; 57.1513459; 75; 21.4166335; 166.5; 47.1941779; 185.890274; 75; 21.4166335; 90.5; 47.1941779; 103.443936; 75; 21.4166335; 64; 47.1941779; 45.7326836; 75.767938; 
