congInd; nominalCost; DisCost; DisRelCostSav; 1stBus; nomECost; DR_Cost; DR_RelECostSav; disECost; disaggRelECostSav; 2ndBus; nomECost2; DR_Cost2; DR_RelECostSav2; disECost2; disaggRelECostSav2; 3rdBus; nomECost3; DR_Cost3; DR_RelECostSav3; disECost3; disaggRelECostSav3
L; 2134644; 1818660; 14.80267; 5; 23479.48; 18404.12; 21.61615; 12497.98; 46.77065; 7; 11873.46; 10056.14; 15.3058; 10345.95; 12.86498; 8; 4651.231; 3645.814; 21.61615; 2486.248; 46.54646
s; 2134644; 1818597; 14.80561; 5; 23479.48; 18404.12; 21.61615; 12498.17; 46.76983; 7; 11873.46; 10056.14; 15.3058; 10318.76; 13.09392; 8; 4651.231; 3645.814; 21.61615; 2474.956; 46.78923
m; 2134644; 1818645; 14.80336; 5; 23479.48; 18404.12; 21.61615; 12501.18; 46.75702; 7; 11873.46; 10056.14; 15.3058; 10312.12; 13.14986; 8; 4651.231; 3645.814; 21.61615; 2473.293; 46.82499
