t; nomPriceB5; nomPlPowB5; disagg_price_bus5; PlPowB5; disaggT_in_B5;  initFeasThres; finalFeasThres; accept_gap; iterations; CPUmaster; CPUsubproblem; CPUsubsolve; CPUsubcutgen; CPUfeasPt; finalDetectGap; nomCongestionCost; disaggCongestionCost; Objective; nomImprovPercent; CoopPotentialPercent; nominalCost; integratedCost
1; 10.52; 71; 10.52; 60.8165523; 80; 142; 142; 0.0001; 40; 1.45582199; 5.97179079; 5.31511402; 0.656350017; 0.638144016; 3.40413767e-05; 3.92945403e-10; 8.24166842e-10; 1804427.42; 0.511040795; 1813696.15; 
2; 10.52; 71; 10.52; 50.7346935; 80; 
3; 10.52; 71; 10.52; 50.7346935; 80; 
4; 10.52; 71; 10.52; 50.7346935; 80; 
5; 10.52; 71; 10.52; 50.7346935; 80; 
6; 10.52; 71; 10.52; 50.7346935; 80; 
7; 10.52; 71; 10.52; 50.7346935; 80; 
8; 10.52; 71; 10.52; 65.9778488; 80; 
9; 10.52; 71; 10.52; 73.4241143; 80; 
10; 10.52; 71; 13.5363881; 58.2572229; 80; 
11; 14.59; 71; 11.5736119; 50.7346935; 80; 
12; 15.5475; 71; 15.3761538; 50.7346935; 80; 
13; 15.5475; 71; 15.3761538; 50.7346935; 80; 
14; 15.5475; 71; 15.3761538; 50.7346935; 80; 
15; 15.5475; 71; 15.3761538; 50.7346935; 80; 
16; 15.5475; 71; 15.3761538; 50.7346935; 80; 
17; 15.5475; 71; 15.3761538; 50.7346935; 80; 
18; 15.5475; 71; 15.3761538; 50.7346935; 80; 
19; 15.5475; 71; 15.3761538; 50.7346935; 80; 
20; 15.5475; 71; 15.3761538; 50.7346935; 80; 
21; 15.5475; 71; 15.3761538; 50.7346935; 80; 
22; 15.5475; 71; 15.3761538; 50.7346935; 80; 
23; 15.5475; 71; 15.3761538; 50.7346935; 80; 
24; 15.5475; 71; 15.3761538; 50.7346935; 80; 
25; 17.81; 71; 16.6238462; 50.7346935; 80; 
26; 16; 71; 16; 50.7346935; 80; 
27; 16; 71; 16; 50.7346935; 80; 
28; 16; 71; 16; 50.7346935; 80; 
29; 16; 71; 16; 50.7346935; 80; 
30; 16; 71; 16; 50.7346935; 80; 
31; 16; 71; 16; 50.7346935; 80; 
32; 16; 71; 16; 50.7346935; 80; 
33; 16; 71; 16; 50.7346935; 80; 
34; 16; 71; 16; 50.7346935; 80; 
35; 16; 71; 16; 50.7346935; 80; 
36; 16; 71; 16; 50.7346935; 80; 
37; 20.4725; 71; 18.7134503; 52.649202; 80; 
38; 20.4725; 71; 18.7134503; 52.6301031; 80; 
39; 20.7; 71; 18.7134503; 50.7346935; 80; 
40; 20.7; 71; 20.7; 50.7346935; 80; 
41; 20.4725; 71; 18.7134503; 50.7346935; 80; 
42; 20.4725; 71; 18.7134503; 51.307981; 80; 
43; 13.4015; 71; 12.9127485; 66.2197035; 79.2273857; 
44; 4.67685; 71; 7.75261456; 86.1828547; 75; 
45; 5.47; 71; 9.06738544; 95.0574966; 75; 
46; 4.67685; 71; 4.89126833; 97.5061396; 75; 
47; 4.67685; 71; 5.72078167; 96.8345468; 75.263946; 
48; 4.67685; 71; 4.67685; 96.6115726; 75.24261; 
49; 4.67685; 71; 4.67685; 96.6199736; 75.178172; 
50; 4.67685; 71; 4.67685; 96.8557789; 75.1392565; 
51; 4.67685; 71; 4.67685; 96.8499076; 75.1341111; 
52; 4.67685; 71; 4.67685; 96.8407717; 75.1491732; 
53; 4.67685; 71; 4.67685; 96.8290567; 75.1536276; 
54; 4.67685; 71; 4.67685; 96.8151339; 75.1517356; 
55; 5.47; 71; 5.47; 96.7991853; 75.1524287; 
56; 5.47; 71; 5.47; 96.7813036; 75.1536164; 
57; 5.47; 71; 5.47; 96.7615399; 75.1548421; 
58; 5.47; 71; 5.47; 96.7399251; 75.1559195; 
59; 5.47; 71; 5.47; 96.7164809; 75.1569838; 
60; 5.47; 71; 5.47; 96.6912246; 75.1580965; 
61; 5.47; 71; 5.47; 96.6641713; 75.1592284; 
62; 5.47; 71; 5.47; 96.6353349; 75.1603745; 
63; 5.47; 71; 5.47; 96.6047291; 75.1615351; 
64; 5.47; 71; 5.47; 96.5723669; 75.1630508; 
65; 5.47; 71; 5.47; 96.5382613; 75.1636249; 
66; 5.47; 71; 5.47; 96.5024251; 75.1655335; 
67; 5.47; 71; 5.47; 96.1924843; 75.3098266; 
68; 4.67685; 71; 5.47; 96.2063187; 75.1428649; 
69; 4.67685; 71; 4.67685; 96.4686598; 75.151365; 
70; 4.67685; 71; 4.67685; 96.3749215; 75.1715872; 
71; 4.67685; 71; 4.67685; 96.2959591; 75.17291; 
72; 4.67685; 71; 4.67685; 96.1862097; 75; 
73; 4.67685; 71; 4.67685; 95.6179926; 75; 
74; 4.67685; 71; 4.67685; 95.8913181; 75; 
75; 4.67685; 71; 4.67685; 96.3524276; 75; 
76; 4.67685; 71; 4.67685; 96.0467872; 75; 
77; 4.67685; 71; 4.67685; 95.9927685; 75.3264804; 
78; 9.43575; 71; 9.039175; 77.0276261; 75; 
79; 9.43575; 71; 9.039175; 74.6232266; 80; 
80; 9.43575; 71; 11.2082782; 70.6692765; 80; 
81; 9.43575; 71; 11.2082782; 50.7346935; 80; 
82; 9.43575; 71; 11.2082782; 50.7346935; 77.3205106; 
83; 8.06756625; 71; 9.58307787; 79.5099319; 75; 
84; 8.06756625; 71; 11.2082782; 102.408821; 75; 
85; 8.06756625; 71; 9.58307787; 97.5005456; 75; 
86; 8.06756625; 71; 9.58307787; 84.4705012; 80; 
87; 9.194135; 71; 9.58307787; 67.106753; 75; 
88; 13.32; 71; 11.2082782; 56.9830282; 80; 
89; 13.32; 71; 11.2082782; 50.7346935; 77.6110688; 
90; 13.32; 71; 11.2082782; 50.7346935; 80; 
91; 13.32; 71; 11.2082782; 50.7346935; 80; 
92; 13.32; 71; 11.2082782; 50.7346935; 78.4231645; 
93; 13.32; 71; 11.2082782; 50.7346935; 80; 
94; 13.32; 71; 11.2082782; 50.7346935; 78.5931053; 
95; 13.32; 71; 11.2082782; 50.7346935; 79.0247647; 
96; 13.32; 71; 16; 81.1549111; 75; 
