congInd; nominalCost; DisCost; DisRelCostSav; 1stBus; nomECost; DR_Cost; DR_RelECostSav; disECost; disaggRelECostSav 
L; 2141216; 1816380; 15.17061; 5; 50163.63; 39365.74; 21.52533; 25453.31; 49.25943
s; 2141216; 1816325; 15.17321; 5; 50163.63; 39365.74; 21.52533; 25420.46; 49.32492
m; 2141216; 1816351; 15.172; 5; 50163.63; 39365.74; 21.52533; 25403.56; 49.35861
