t; nomPriceB5; nomPlPowB5; integrPriceB5; integrPlPowB5; integrT_in_B5; disagg_price_bus5; PlPowB5; disaggT_in_B5;  initFeasThres; finalFeasThres; accept_gap; iterations; CPUmaster; CPUsubproblem; CPUfeasPt; finalDetectGap; nomCongestionCost; intCongestionCost; disaggCongestionCost; Objective; nomImprovPercent; CoopPotentialPercent; nominalCost; integratedCost
1; 13.32; 71; 10.52; 60.8165523; 80; 10.52; 60.9070189; 80; 142; 24.3035368; 0.0001; 67; 1.5552683; 2.63179843; 0.341924597; 8.4525183e-05; 232380.919; 34003.903; 31082.7986; 1816371.9; 15.1710015; 99.9615877; 2141215.78; 1816247.08
2; 13.32; 71; 16.6088889; 66.0938793; 80; 16.12; 66.1378192; 80; 
3; 13.32; 71; 16.6088889; 65.9406578; 80; 16.12; 65.986693; 80; 
4; 13.32; 71; 16.6088889; 51.4260892; 80; 16.12; 57.9747861; 80; 
5; 13.32; 71; 16.6088889; 65.6566306; 80; 16.12; 70.3574227; 80; 
6; 13.32; 71; 16.6088889; 81.4352202; 80; 16.12; 74.9841756; 80; 
7; 13.32; 71; 16.6088889; 68.8543434; 80; 16.12; 64.203133; 80; 
8; 13.32; 71; 16.6088889; 69.4629257; 80; 16.12; 69.4764513; 80; 
9; 13.32; 71; 16.6088889; 67.6292688; 80; 16.12; 67.6592168; 80; 
10; 13.32; 71; 16.6088889; 50.7346935; 80; 20.52; 50.9159516; 80; 
11; 39.15; 71; 30.1; 50.7346935; 80; 30.1; 50.9159516; 80; 
12; 39.15; 71; 30.1; 50.7346935; 80; 30.1; 50.9159516; 80; 
13; 39.15; 71; 30.1; 50.7346935; 80; 30.1; 50.9159516; 80; 
14; 39.15; 71; 30.1; 50.7346935; 80; 30.1; 50.9159516; 80; 
15; 36.65; 71; 30.1; 50.7346935; 80; 30.1; 50.9159516; 80; 
16; 39.15; 71; 30.1; 50.7346935; 80; 30.1; 50.9159516; 80; 
17; 39.15; 71; 30.1; 50.7346935; 80; 30.1; 50.9159516; 80; 
18; 39.15; 71; 30.1; 50.7346935; 80; 30.1; 50.9159516; 80; 
19; 39.15; 71; 30.1; 50.7346935; 80; 30.1; 50.9159516; 80; 
20; 39.15; 71; 30.1; 50.7346935; 80; 30.1; 50.9159516; 80; 
21; 39.15; 71; 30.1; 50.7346935; 80; 30.1; 50.9159516; 80; 
22; 39.15; 71; 30.1; 50.7346935; 80; 30.1; 50.9159516; 80; 
23; 39.15; 71; 30.1; 50.7346935; 80; 30.1; 50.9159516; 80; 
24; 39.15; 71; 30.1; 50.7346935; 80; 30.1; 50.9159516; 80; 
25; 255.566746; 71; 47.2542311; 50.7346935; 80; 43.2190135; 50.9159516; 80; 
26; 255.566746; 71; 47.2542311; 50.7346935; 80; 43.2190135; 50.9159516; 80; 
27; 218.509568; 71; 47.2542311; 50.7346935; 80; 43.2190135; 50.9159516; 80; 
28; 255.566746; 71; 47.2542311; 50.7346935; 80; 43.2190135; 50.9159516; 80; 
29; 255.566746; 71; 21.8636976; 50.7346935; 80; 21.6799794; 50.9159516; 80; 
30; 25.0072091; 71; 21.8636976; 50.7346935; 80; 21.6799794; 50.9159516; 80; 
31; 25.0072091; 71; 21.8636976; 50.7346935; 80; 21.6799794; 50.9159516; 80; 
32; 25.0072091; 71; 21.8636976; 50.7346935; 80; 21.6799794; 50.9159516; 80; 
33; 25.0072091; 71; 21.8636976; 50.7346935; 80; 21.6799794; 50.9159516; 80; 
34; 25.0072091; 71; 21.8636976; 50.7346935; 80; 21.6799794; 50.9159516; 80; 
35; 25.0072091; 71; 21.8636976; 50.7346935; 80; 21.6799794; 50.9159516; 80; 
36; 25.0072091; 71; 21.8636976; 50.7346935; 80; 21.6799794; 50.9159516; 80; 
37; 29.2481977; 71; 25.5715762; 50.7346935; 80; 25.356701; 50.9159516; 80; 
38; 29.2481977; 71; 25.5715762; 50.7346935; 80; 25.356701; 50.9159516; 80; 
39; 29.2481977; 71; 25.5715762; 50.7346935; 80; 25.356701; 50.9159516; 80; 
40; 29.2481977; 71; 25.5715762; 50.7346935; 80; 25.356701; 50.9159516; 80; 
41; 29.2481977; 71; 25.5715762; 50.7346935; 80; 25.356701; 50.9159516; 80; 
42; 29.2481977; 71; 25.5715762; 50.7346935; 80; 25.356701; 50.9159516; 80; 
43; 29.2481977; 71; 25.5715762; 50.7346935; 80; 25.356701; 50.9159516; 80; 
44; 29.2481977; 71; 13.2951678; 51.565733; 80; 21.6799794; 50.9159516; 80; 
45; 6.30720906; 71; 15.5499038; 67.4119288; 80; 25.356701; 68.1479984; 80; 
46; 5.47; 71; 13.2951678; 79.006082; 80; 13.2405233; 77.9184105; 80; 
47; 5.47; 71; 13.2951678; 79.649995; 80; 15.4859922; 80.4409713; 78.7537694; 
48; 5.47; 71; 13.2951678; 89.4180393; 75.5356706; 5.47; 91.5352821; 75.0372298; 
49; 5.47; 71; 15.5499038; 96.340589; 75; 5.47; 94.1623567; 75; 
50; 5.47; 71; 5.47; 97.4111221; 75; 5.47; 97.2799408; 75; 
51; 5.47; 71; 5.47; 97.4348965; 75; 5.47; 97.8795065; 75.2132676; 
52; 5.47; 71; 5.47; 97.4447693; 75; 5.47; 96.9568708; 75.012473; 
53; 5.47; 71; 5.47; 97.4452702; 75; 5.47; 97.2813619; 75.0415672; 
54; 5.47; 71; 5.47; 97.4407701; 75; 5.47; 97.0757955; 75.1191976; 
55; 5.47; 71; 5.47; 97.4329806; 75; 5.47; 97.1278851; 75.0114772; 
56; 5.47; 71; 5.47; 97.4225602; 75; 5.47; 97.2544577; 75.046414; 
57; 5.47; 71; 5.47; 97.4099028; 75; 5.47; 97.2494859; 75.0082971; 
58; 5.47; 71; 5.47; 97.395201; 75; 5.47; 97.2314257; 75.0292215; 
59; 5.47; 71; 5.47; 97.3785527; 75; 5.47; 97.2481898; 75; 
60; 5.47; 71; 5.47; 97.3600111; 75; 5.47; 97.1791883; 75.0206972; 
61; 5.47; 71; 5.47; 97.3396086; 75; 5.47; 97.1906578; 75; 
62; 5.47; 71; 5.47; 97.3173673; 75; 5.47; 97.1591853; 75.0483374; 
63; 5.47; 71; 7.28660826; 97.2933049; 75; 6.505; 97.0822187; 75; 
64; 5.47; 71; 7.28660826; 97.2674366; 75; 6.505; 97.2185633; 75; 
65; 6.39766082; 71; 7.28660826; 97.2397765; 75; 6.505; 97.0468561; 75.0383212; 
66; 6.39766082; 71; 7.28660826; 97.2103383; 75; 6.505; 96.9164449; 75; 
67; 6.39766082; 71; 7.28660826; 97.1791352; 75; 6.505; 97.0932468; 75; 
68; 5.47; 71; 7.28660826; 97.1461801; 75; 6.505; 97.1383213; 75.0036593; 
69; 5.47; 71; 7.28660826; 97.111486; 75; 6.505; 97.0403056; 75.0033827; 
70; 5.47; 71; 6.23005006; 97.0750657; 75; 5.561775; 97.0050352; 75.0029437; 
71; 5.47; 71; 6.23005006; 97.0369319; 75; 5.561775; 96.969991; 75.0016303; 
72; 5.47; 71; 6.23005006; 96.9970971; 75; 5.561775; 96.9337277; 75; 
73; 5.47; 71; 6.23005006; 96.9555738; 75; 5.561775; 96.8932939; 75; 
74; 5.47; 71; 6.23005006; 96.9123744; 75; 5.561775; 96.7824897; 75; 
75; 5.47; 71; 6.23005006; 96.8675111; 75; 5.561775; 96.7709124; 75; 
76; 5.47; 71; 6.23005006; 96.8209963; 75; 5.561775; 96.7924723; 75; 
77; 8.07204466; 71; 7.28660826; 84.3291275; 80; 16; 84.3626687; 80; 
78; 17.3550271; 71; 16; 61.3066776; 80; 16; 61.4602644; 80; 
79; 17.3550271; 71; 16; 50.7346935; 80; 16; 50.9159516; 80; 
80; 17.3550271; 71; 16; 50.7346935; 80; 16; 50.9159516; 80; 
81; 17.3550271; 71; 16; 50.7346935; 80; 16; 50.9161899; 80; 
82; 17.3550271; 71; 16; 53.6624486; 77.4395459; 16; 53.2122431; 77.6566927; 
83; 16; 71; 16; 62.8958798; 75; 16; 62.7323025; 75; 
84; 14.8385482; 71; 15.1232165; 88.8636214; 75; 15.752575; 88.4674735; 75; 
85; 14.8385482; 71; 16; 105.386494; 75; 13.68; 104.842365; 75; 
86; 14.8385482; 71; 13.68; 99.4670376; 75; 13.68; 99.5226182; 75; 
87; 14.8385482; 71; 14.4367835; 94.242701; 75; 13.68; 93.7983774; 75; 
88; 14.8385482; 71; 13.68; 83.3441524; 80; 16; 82.9974377; 75; 
89; 14.8385482; 71; 16; 68.2233762; 80; 16; 68.0120851; 80; 
90; 14.8385482; 71; 13.68; 63.6228033; 80; 13.807425; 63.2997969; 75; 
91; 17.3550271; 71; 16; 58.0827972; 80; 16; 58.0047603; 80; 
92; 17.3550271; 71; 16; 53.2177162; 80; 16; 52.9878991; 77.3781; 
93; 17.3550271; 71; 16; 53.1929458; 80; 16; 52.967232; 80; 
94; 17.3550271; 71; 16; 50.7346935; 80; 16; 50.9159516; 80; 
95; 17.3550271; 71; 16; 50.7346935; 80; 16; 50.915954; 78.8453854; 
96; 17.3550271; 71; 25.4; 81.1549111; 77.2217754; 25.4; 81.0639624; 75; 
