t; nomPriceB7; nomPlPowB7; disagg_price_bus7; PlPowB7; disaggT_in_B7; nomPriceB6; nomPlPowB6; disagg_price_bus6; PlPowB6; disaggT_in_B6; nomPriceB10; nomPlPowB10; disagg_price_bus10; PlPowB10; disaggT_in_B10; nomPriceB16; nomPlPowB16; disagg_price_bus16; PlPowB16; disaggT_in_B16; nomPriceB2; nomPlPowB2; disagg_price_bus2; PlPowB2; disaggT_in_B2; nomPriceB1; nomPlPowB1; disagg_price_bus1; PlPowB1; disaggT_in_B1; nomPriceB20; nomPlPowB20; disagg_price_bus20; PlPowB20; disaggT_in_B20; nomPriceB18; nomPlPowB18; disagg_price_bus18; PlPowB18; disaggT_in_B18; nomPriceB9; nomPlPowB9; disagg_price_bus9; PlPowB9; disaggT_in_B9; nomPriceB13; nomPlPowB13; disagg_price_bus13; PlPowB13; disaggT_in_B13;  initFeasThres; finalFeasThres; accept_gap; iterations; CPUmaster; CPUsubproblem; CPUsubsolve; CPUsubcutgen; CPUfeasPt; finalDetectGap; nomCongestionCost; disaggCongestionCost; Objective; nomImprovPercent; CoopPotentialPercent; nominalCost; integratedCost
1; 16; 62.5; 16; 53.5356974; 80; 16; 68; 16; 58.2468388; 80; 16; 97.5; 16; 83.515688; 80; 16; 50; 16; 42.8285579; 80; 16; 48.5; 16; 41.5437012; 80; 16; 54; 16; 46.2548426; 80; 16; 64; 16; 54.8205542; 80; 16; 166.5; 16; 142.619098; 80; 16; 87.5; 16; 74.9499764; 80; 16; 132.5; 16; 113.495679; 80; 1662; 167.649116; 0.0001; 691; 995.899841; 396.878418; 342.215271; 54.6521034; 7.4753232; 5.69852139e-05; 317156.812; 2.28869883e-10; 1895347.31; 40.1285482; 3165694.59; 
2; 16; 62.5; 14.3015; 44.6608217; 80; 16; 68; 14.3015; 48.590974; 80; 16; 97.5; 14.3015; 96.0679353; 80; 16; 50; 14.3015; 50.2768276; 80; 16; 48.5; 14.3015; 34.6567977; 80; 16; 54; 14.3015; 38.58695; 80; 16; 64; 14.3015; 50.4880373; 80; 16; 166.5; 14.3015; 169.077747; 80; 16; 87.5; 14.3015; 62.5251504; 80; 16; 132.5; 14.3015; 94.6809421; 80; 
3; 16; 62.5; 17.6985; 44.6608217; 80; 16; 68; 17.6985; 48.590974; 80; 16; 97.5; 17.6985; 95.8046013; 80; 16; 50; 17.6985; 50.1322105; 80; 16; 48.5; 17.6985; 34.6571318; 80; 16; 54; 17.6985; 38.587322; 80; 16; 64; 17.6985; 50.4412561; 80; 16; 166.5; 17.6985; 168.577942; 80; 16; 87.5; 17.6985; 62.5251504; 80; 16; 132.5; 17.6985; 94.6809421; 80; 
4; 16; 62.5; 17.6985; 44.6608217; 80; 16; 68; 17.6985; 48.590974; 80; 16; 97.5; 17.6985; 93.0690964; 80; 16; 50; 17.6985; 39.7303599; 80; 16; 48.5; 17.6985; 34.6571285; 80; 16; 54; 17.6985; 38.5873183; 80; 16; 64; 17.6985; 68.803128; 78.3795145; 16; 166.5; 17.6985; 132.751772; 80; 16; 87.5; 17.6985; 62.5251504; 80; 16; 132.5; 17.6985; 94.6809421; 80; 
5; 16; 62.5; 17.6985; 44.6608217; 80; 16; 68; 17.6985; 48.590974; 80; 16; 97.5; 17.6985; 97.3989409; 80; 16; 50; 17.6985; 51.8383543; 80; 16; 48.5; 17.6985; 34.6567977; 80; 16; 54; 17.6985; 38.58695; 80; 16; 64; 17.6985; 68.5729798; 80; 16; 166.5; 17.6985; 132.614351; 80; 16; 87.5; 17.6985; 62.5251504; 80; 16; 132.5; 17.6985; 94.6809421; 80; 
6; 16; 62.5; 17.6985; 44.6608217; 80; 16; 68; 17.6985; 48.590974; 80; 16; 97.5; 17.6985; 98.9071812; 80; 16; 50; 17.6985; 55.0276334; 80; 16; 48.5; 17.6985; 34.6567977; 80; 16; 54; 17.6985; 38.58695; 80; 16; 64; 17.6985; 45.7333197; 80; 16; 166.5; 17.6985; 130.13245; 80; 16; 87.5; 17.6985; 62.5251504; 80; 16; 132.5; 17.6985; 94.6809421; 80; 
7; 16; 62.5; 17.6985; 44.6608217; 80; 16; 68; 17.6985; 48.590974; 80; 16; 97.5; 17.6985; 109.31375; 80; 16; 50; 17.6985; 42.9283576; 80; 16; 48.5; 17.6985; 34.6567977; 80; 16; 54; 17.6985; 38.58695; 80; 16; 64; 17.6985; 45.7326815; 80; 16; 166.5; 17.6985; 130.021159; 80; 16; 87.5; 17.6985; 62.5251504; 80; 16; 132.5; 17.6985; 94.6809421; 80; 
8; 16; 62.5; 20.7; 44.6608217; 80; 16; 68; 20.7; 48.590974; 80; 16; 97.5; 20.7; 96.9864266; 80; 16; 50; 20.7; 48.954938; 80; 16; 48.5; 20.7; 34.6567977; 80; 16; 54; 20.7; 38.58695; 80; 16; 64; 20.7; 45.7326815; 80; 16; 166.5; 20.7; 118.976429; 80; 16; 87.5; 20.7; 62.5251504; 80; 16; 132.5; 20.7; 94.6809421; 80; 
9; 16; 62.5; 20.7; 44.6608217; 80; 16; 68; 20.7; 48.590974; 80; 16; 97.5; 20.7; 81.8442086; 80; 16; 50; 20.7; 50.4421845; 80; 16; 48.5; 20.7; 34.6567977; 80; 16; 54; 20.7; 38.58695; 80; 16; 64; 20.7; 45.7326815; 80; 16; 166.5; 20.7; 118.976429; 80; 16; 87.5; 20.7; 62.5251504; 80; 16; 132.5; 20.7; 94.6809421; 80; 
10; 16; 62.5; 20.7; 44.6608217; 80; 16; 68; 20.7; 48.590974; 80; 16; 97.5; 20.7; 69.6708819; 80; 16; 50; 20.7; 37.3321739; 80; 16; 48.5; 20.7; 34.6567977; 80; 16; 54; 20.7; 38.58695; 80; 16; 64; 20.7; 45.7326815; 80; 16; 166.5; 20.7; 118.976429; 80; 16; 87.5; 20.7; 62.5251504; 80; 16; 132.5; 20.7; 94.6809421; 80; 
11; 47.6549865; 62.5; 20.7; 44.6608217; 80; 47.6549865; 68; 20.7; 48.590974; 80; 47.6549865; 97.5; 20.7; 69.6708819; 80; 47.6549865; 50; 20.7; 35.7286574; 80; 47.6549865; 48.5; 20.7; 34.6567977; 80; 47.6549865; 54; 20.7; 38.58695; 80; 47.6549865; 64; 20.7; 45.7326815; 80; 47.6549865; 166.5; 20.7; 118.976429; 80; 47.6549865; 87.5; 20.7; 62.5251504; 80; 47.6549865; 132.5; 20.7; 94.6809421; 80; 
12; 40.7450135; 62.5; 20.7; 44.6608217; 80; 40.7450135; 68; 20.7; 48.590974; 80; 40.7450135; 97.5; 20.7; 69.6708819; 80; 40.7450135; 50; 20.7; 35.7286574; 80; 40.7450135; 48.5; 20.7; 34.6567977; 80; 40.7450135; 54; 20.7; 38.58695; 80; 40.7450135; 64; 20.7; 45.7326815; 80; 40.7450135; 166.5; 20.7; 118.976429; 80; 40.7450135; 87.5; 20.7; 62.5251504; 80; 40.7450135; 132.5; 20.7; 94.6809421; 80; 
13; 20.7; 62.5; 20.7; 44.6608217; 80; 91.03; 68; 20.7; 48.590974; 80; 91.03; 97.5; 20.7; 69.6708819; 80; 91.03; 50; 20.7; 35.7286574; 80; 91.03; 48.5; 20.7; 34.6567977; 80; 91.03; 54; 20.7; 38.58695; 80; 91.03; 64; 20.7; 45.7326815; 80; 91.03; 166.5; 20.7; 118.976429; 80; 91.03; 87.5; 20.7; 62.5251504; 80; 91.03; 132.5; 20.7; 94.6809421; 80; 
14; 20.7; 62.5; 20.7; 44.6608217; 80; 91.03; 68; 20.7; 48.590974; 80; 91.03; 97.5; 20.7; 69.6708819; 80; 91.03; 50; 20.7; 35.7286574; 80; 91.03; 48.5; 20.7; 34.6567977; 80; 91.03; 54; 20.7; 38.58695; 80; 91.03; 64; 20.7; 45.7326815; 80; 91.03; 166.5; 20.7; 118.976429; 80; 91.03; 87.5; 20.7; 62.5251504; 80; 91.03; 132.5; 20.7; 94.6809421; 80; 
15; 20.7; 62.5; 20.7; 44.6608217; 80; 77.83065; 68; 20.7; 48.590974; 80; 77.83065; 97.5; 20.7; 69.6708819; 80; 77.83065; 50; 20.7; 35.7286574; 80; 77.83065; 48.5; 20.7; 34.6567977; 80; 77.83065; 54; 20.7; 38.58695; 80; 77.83065; 64; 20.7; 45.7326815; 80; 77.83065; 166.5; 20.7; 118.976429; 80; 77.83065; 87.5; 20.7; 62.5251504; 80; 77.83065; 132.5; 20.7; 94.6809421; 80; 
16; 20.7; 62.5; 20.7; 44.6608217; 80; 91.03; 68; 20.7; 48.590974; 80; 91.03; 97.5; 20.7; 69.6708819; 80; 91.03; 50; 20.7; 35.7286574; 80; 91.03; 48.5; 20.7; 34.6567977; 80; 91.03; 54; 20.7; 38.58695; 80; 91.03; 64; 20.7; 45.7326815; 80; 91.03; 166.5; 20.7; 118.976429; 80; 91.03; 87.5; 20.7; 62.5251504; 80; 91.03; 132.5; 20.7; 94.6809421; 80; 
17; 20.7; 62.5; 20.7; 44.6608217; 80; 91.03; 68; 20.7; 48.590974; 80; 91.03; 97.5; 20.7; 69.6708819; 80; 91.03; 50; 20.7; 35.7286574; 80; 91.03; 48.5; 20.7; 34.6567977; 80; 91.03; 54; 20.7; 38.58695; 80; 91.03; 64; 20.7; 45.7326815; 80; 91.03; 166.5; 20.7; 118.976429; 80; 91.03; 87.5; 20.7; 62.5251504; 80; 91.03; 132.5; 20.7; 94.6809421; 80; 
18; 20.7; 62.5; 20.7; 44.6608217; 80; 91.03; 68; 20.7; 48.590974; 80; 91.03; 97.5; 20.7; 69.6708819; 80; 91.03; 50; 20.7; 35.7286574; 80; 91.03; 48.5; 20.7; 34.6567977; 80; 91.03; 54; 20.7; 38.58695; 80; 91.03; 64; 20.7; 45.7326815; 80; 91.03; 166.5; 20.7; 118.976429; 80; 91.03; 87.5; 20.7; 62.5251504; 80; 91.03; 132.5; 20.7; 94.6809421; 80; 
19; 20.7; 62.5; 20.7; 44.6608217; 80; 91.03; 68; 20.7; 48.590974; 80; 91.03; 97.5; 20.7; 69.6708819; 80; 91.03; 50; 20.7; 35.7286574; 80; 91.03; 48.5; 20.7; 34.6567977; 80; 91.03; 54; 20.7; 38.58695; 80; 91.03; 64; 20.7; 45.7326815; 80; 91.03; 166.5; 20.7; 118.976429; 80; 91.03; 87.5; 20.7; 62.5251504; 80; 91.03; 132.5; 20.7; 94.6809421; 80; 
20; 20.7; 62.5; 20.7; 44.6608217; 80; 91.03; 68; 20.7; 48.590974; 80; 91.03; 97.5; 20.7; 69.6708819; 80; 91.03; 50; 20.7; 35.7286574; 80; 91.03; 48.5; 20.7; 34.6567977; 80; 91.03; 54; 20.7; 38.58695; 80; 91.03; 64; 20.7; 45.7326815; 80; 91.03; 166.5; 20.7; 118.976429; 80; 91.03; 87.5; 20.7; 62.5251504; 80; 91.03; 132.5; 20.7; 94.6809421; 80; 
21; 20.7; 62.5; 20.7; 44.6608217; 80; 91.03; 68; 20.7; 48.590974; 80; 91.03; 97.5; 20.7; 69.6708819; 80; 91.03; 50; 20.7; 35.7286574; 80; 91.03; 48.5; 20.7; 34.6567977; 80; 91.03; 54; 20.7; 38.58695; 80; 91.03; 64; 20.7; 45.7326815; 80; 91.03; 166.5; 20.7; 118.976429; 80; 91.03; 87.5; 20.7; 62.5251504; 80; 91.03; 132.5; 20.7; 94.6809421; 80; 
22; 20.7; 62.5; 20.7; 44.6608217; 80; 91.03; 68; 20.7; 48.590974; 80; 91.03; 97.5; 20.7; 69.6708819; 80; 91.03; 50; 20.7; 35.7286574; 80; 91.03; 48.5; 20.7; 34.6567977; 80; 91.03; 54; 20.7; 38.58695; 80; 91.03; 64; 20.7; 45.7326815; 80; 91.03; 166.5; 20.7; 118.976429; 80; 91.03; 87.5; 20.7; 62.5251504; 80; 91.03; 132.5; 20.7; 94.6809421; 80; 
23; 20.7; 62.5; 20.7; 44.6608217; 80; 91.03; 68; 20.7; 48.590974; 80; 91.03; 97.5; 20.7; 69.6708819; 80; 91.03; 50; 20.7; 35.7286574; 80; 91.03; 48.5; 20.7; 34.6567977; 80; 91.03; 54; 20.7; 38.58695; 80; 91.03; 64; 20.7; 45.7326815; 80; 91.03; 166.5; 20.7; 118.976429; 80; 91.03; 87.5; 20.7; 62.5251504; 80; 91.03; 132.5; 20.7; 94.6809421; 80; 
24; 20.7; 62.5; 20.7; 44.6608217; 80; 91.03; 68; 20.7; 48.590974; 80; 91.03; 97.5; 20.7; 69.6708819; 80; 91.03; 50; 20.7; 35.7286574; 80; 91.03; 48.5; 20.7; 34.6567977; 80; 91.03; 54; 20.7; 38.58695; 80; 91.03; 64; 20.7; 45.7326815; 80; 91.03; 166.5; 20.7; 118.976429; 80; 91.03; 87.5; 20.7; 62.5251504; 80; 91.03; 132.5; 20.7; 94.6809421; 80; 
25; 20.7; 62.5; 20.7; 44.6608217; 80; 212.950998; 68; 20.7; 48.590974; 80; 212.950998; 97.5; 20.7; 69.6708819; 80; 212.950998; 50; 20.7; 35.7286574; 80; 212.950998; 48.5; 20.7; 34.6567977; 80; 212.950998; 54; 20.7; 38.58695; 80; 212.950998; 64; 20.7; 45.7326815; 80; 212.950998; 166.5; 20.7; 118.976429; 80; 212.950998; 87.5; 20.7; 62.5251504; 80; 212.950998; 132.5; 20.7; 94.6809421; 80; 
26; 20.7; 62.5; 20.7; 44.6608217; 80; 212.950998; 68; 20.7; 48.590974; 80; 212.950998; 97.5; 20.7; 69.6708819; 80; 212.950998; 50; 20.7; 35.7286574; 80; 212.950998; 48.5; 20.7; 34.6567977; 80; 212.950998; 54; 20.7; 38.58695; 80; 212.950998; 64; 20.7; 45.7326815; 80; 212.950998; 166.5; 20.7; 118.976429; 80; 212.950998; 87.5; 20.7; 62.5251504; 80; 212.950998; 132.5; 20.7; 94.6809421; 80; 
27; 20.7; 62.5; 20.7; 44.6608217; 80; 212.950998; 68; 20.7; 48.590974; 80; 212.950998; 97.5; 20.7; 69.6708819; 80; 212.950998; 50; 20.7; 35.7286574; 80; 212.950998; 48.5; 20.7; 34.6567977; 80; 212.950998; 54; 20.7; 38.58695; 80; 212.950998; 64; 20.7; 45.7326815; 80; 212.950998; 166.5; 20.7; 118.976429; 80; 212.950998; 87.5; 20.7; 62.5251504; 80; 212.950998; 132.5; 20.7; 94.6809421; 80; 
28; 20.7; 62.5; 20.7; 44.6608217; 80; 212.950998; 68; 20.7; 48.590974; 80; 212.950998; 97.5; 20.7; 69.6708819; 80; 212.950998; 50; 20.7; 35.7286574; 80; 212.950998; 48.5; 20.7; 34.6567977; 80; 212.950998; 54; 20.7; 38.58695; 80; 212.950998; 64; 20.7; 45.7326815; 80; 212.950998; 166.5; 20.7; 118.976429; 80; 212.950998; 87.5; 20.7; 62.5251504; 80; 212.950998; 132.5; 20.7; 94.6809421; 80; 
29; 20.7; 62.5; 20.7; 44.6608217; 80; 212.950998; 68; 20.7; 48.590974; 80; 212.950998; 97.5; 20.7; 69.6708819; 80; 212.950998; 50; 20.7; 35.7286574; 80; 212.950998; 48.5; 20.7; 34.6567977; 80; 212.950998; 54; 20.7; 38.58695; 80; 212.950998; 64; 20.7; 45.7326815; 80; 212.950998; 166.5; 20.7; 118.976429; 80; 212.950998; 87.5; 20.7; 62.5251504; 80; 212.950998; 132.5; 20.7; 94.6809421; 80; 
30; 20.7; 62.5; 20.7; 44.6608217; 80; 27.4696675; 68; 20.7; 48.590974; 80; 27.4696675; 97.5; 20.7; 69.6708819; 80; 27.4696675; 50; 20.7; 35.7286574; 80; 27.4696675; 48.5; 20.7; 34.6567977; 80; 27.4696675; 54; 20.7; 38.58695; 80; 27.4696675; 64; 20.7; 45.7326815; 80; 27.4696675; 166.5; 20.7; 118.976429; 80; 27.4696675; 87.5; 20.7; 62.5251504; 80; 27.4696675; 132.5; 20.7; 94.6809421; 80; 
31; 20.7; 62.5; 20.7; 44.6608217; 80; 27.4696675; 68; 20.7; 48.590974; 80; 27.4696675; 97.5; 20.7; 69.6708819; 80; 27.4696675; 50; 20.7; 35.7286574; 80; 27.4696675; 48.5; 20.7; 34.6567977; 80; 27.4696675; 54; 20.7; 38.58695; 80; 27.4696675; 64; 20.7; 45.7326815; 80; 27.4696675; 166.5; 20.7; 118.976429; 80; 27.4696675; 87.5; 20.7; 62.5251504; 80; 27.4696675; 132.5; 20.7; 94.6809421; 80; 
32; 20.7; 62.5; 20.7; 44.6608217; 80; 27.4696675; 68; 20.7; 48.590974; 80; 27.4696675; 97.5; 20.7; 69.6708819; 80; 27.4696675; 50; 20.7; 35.7286574; 80; 27.4696675; 48.5; 20.7; 34.6567977; 80; 27.4696675; 54; 20.7; 38.58695; 80; 27.4696675; 64; 20.7; 45.7326815; 80; 27.4696675; 166.5; 20.7; 118.976429; 80; 27.4696675; 87.5; 20.7; 62.5251504; 80; 27.4696675; 132.5; 20.7; 94.6809421; 80; 
33; 27.4696675; 62.5; 16.9727871; 44.6608217; 80; 27.4696675; 68; 16.9727871; 48.590974; 80; 27.4696675; 97.5; 16.9727871; 69.6708819; 80; 27.4696675; 50; 16.9727871; 46.7840455; 80; 27.4696675; 48.5; 16.9727871; 34.6567977; 80; 27.4696675; 54; 16.9727871; 38.58695; 80; 27.4696675; 64; 16.9727871; 45.7326815; 80; 27.4696675; 166.5; 16.9727871; 118.976429; 80; 27.4696675; 87.5; 16.9727871; 62.5251504; 80; 27.4696675; 132.5; 16.9727871; 94.6809421; 80; 
34; 27.4696675; 62.5; 19.8512129; 44.6608217; 80; 27.4696675; 68; 19.8512129; 48.590974; 80; 27.4696675; 97.5; 19.8512129; 76.558283; 80; 27.4696675; 50; 19.8512129; 59.8030273; 79.8337602; 27.4696675; 48.5; 19.8512129; 34.6567977; 80; 27.4696675; 54; 19.8512129; 38.58695; 80; 27.4696675; 64; 19.8512129; 45.7326815; 80; 27.4696675; 166.5; 19.8512129; 118.976429; 80; 27.4696675; 87.5; 19.8512129; 62.5251209; 80; 27.4696675; 132.5; 19.8512129; 94.6809421; 80; 
35; 27.4696675; 62.5; 16.9727871; 44.6608217; 80; 27.4696675; 68; 16.9727871; 48.590974; 80; 27.4696675; 97.5; 16.9727871; 89.9822395; 80; 27.4696675; 50; 16.9727871; 53.4544201; 80; 27.4696675; 48.5; 16.9727871; 34.6567977; 80; 27.4696675; 54; 16.9727871; 38.58695; 80; 27.4696675; 64; 16.9727871; 45.7326815; 80; 27.4696675; 166.5; 16.9727871; 118.976429; 80; 27.4696675; 87.5; 16.9727871; 62.5251212; 80; 27.4696675; 132.5; 16.9727871; 94.6809421; 80; 
36; 27.4696675; 62.5; 19.8512129; 44.6608217; 80; 27.4696675; 68; 19.8512129; 48.590974; 80; 27.4696675; 97.5; 19.8512129; 83.028945; 80; 27.4696675; 50; 19.8512129; 46.7180352; 80; 27.4696675; 48.5; 19.8512129; 34.6567977; 80; 27.4696675; 54; 19.8512129; 38.58695; 80; 27.4696675; 64; 19.8512129; 45.7326815; 80; 27.4696675; 166.5; 19.8512129; 118.976429; 80; 27.4696675; 87.5; 19.8512129; 62.5251504; 80; 27.4696675; 132.5; 19.8512129; 94.6809421; 80; 
37; 32.128266; 62.5; 16.9727871; 44.6608217; 80; 32.128266; 68; 16.9727871; 48.590974; 80; 32.128266; 97.5; 16.9727871; 69.6708819; 80; 32.128266; 50; 16.9727871; 53.3183016; 79.8200019; 32.128266; 48.5; 16.9727871; 34.6567977; 80; 32.128266; 54; 16.9727871; 38.58695; 80; 32.128266; 64; 16.9727871; 45.7326815; 80; 32.128266; 166.5; 16.9727871; 118.976613; 80; 32.128266; 87.5; 16.9727871; 62.5251504; 80; 32.128266; 132.5; 16.9727871; 94.6809421; 80; 
38; 32.128266; 62.5; 16.9727871; 44.6608217; 80; 32.128266; 68; 16.9727871; 48.590974; 80; 32.128266; 97.5; 16.9727871; 69.6708819; 80; 32.128266; 50; 16.9727871; 49.6284615; 79.971267; 32.128266; 48.5; 16.9727871; 34.6567977; 80; 32.128266; 54; 16.9727871; 38.58695; 80; 32.128266; 64; 16.9727871; 45.7326815; 80; 32.128266; 166.5; 16.9727871; 118.976611; 80; 32.128266; 87.5; 16.9727871; 62.5251504; 80; 32.128266; 132.5; 16.9727871; 94.6809421; 80; 
39; 32.128266; 62.5; 16.9727871; 44.6608217; 80; 32.128266; 68; 16.9727871; 48.590974; 80; 32.128266; 97.5; 16.9727871; 75.0249821; 80; 32.128266; 50; 16.9727871; 57.1513459; 75; 32.128266; 48.5; 16.9727871; 34.6567977; 80; 32.128266; 54; 16.9727871; 38.58695; 80; 32.128266; 64; 16.9727871; 45.7326815; 80; 32.128266; 166.5; 16.9727871; 118.976429; 80; 32.128266; 87.5; 16.9727871; 62.5251504; 80; 32.128266; 132.5; 16.9727871; 94.6809421; 80; 
40; 32.128266; 62.5; 19.8512129; 44.6608217; 80; 32.128266; 68; 19.8512129; 48.590974; 80; 32.128266; 97.5; 19.8512129; 90.8232984; 80; 32.128266; 50; 19.8512129; 56.9376355; 80; 32.128266; 48.5; 19.8512129; 34.6567977; 80; 32.128266; 54; 19.8512129; 38.58695; 80; 32.128266; 64; 19.8512129; 49.6097797; 80; 32.128266; 166.5; 19.8512129; 118.977327; 80; 32.128266; 87.5; 19.8512129; 62.5251504; 80; 32.128266; 132.5; 19.8512129; 94.6809421; 80; 
41; 32.128266; 62.5; 19.8512129; 44.6608217; 80; 32.128266; 68; 19.8512129; 48.590974; 80; 32.128266; 97.5; 19.8512129; 107.704216; 80; 32.128266; 50; 19.8512129; 38.319013; 80; 32.128266; 48.5; 19.8512129; 34.6567977; 80; 32.128266; 54; 19.8512129; 38.6052127; 80; 32.128266; 64; 19.8512129; 51.0884332; 80; 32.128266; 166.5; 19.8512129; 152.772431; 80; 32.128266; 87.5; 19.8512129; 62.5251504; 80; 32.128266; 132.5; 19.8512129; 94.6809421; 80; 
42; 17.92; 62.5; 16.9727871; 44.8722821; 80; 17.92; 68; 16.9727871; 48.590974; 80; 17.92; 97.5; 16.9727871; 111.871718; 80; 17.92; 50; 16.9727871; 35.7286574; 80; 17.92; 48.5; 16.9727871; 34.6567977; 80; 17.92; 54; 16.9727871; 38.6050305; 80; 17.92; 64; 16.9727871; 51.0350048; 80; 17.92; 166.5; 16.9727871; 193.636557; 80; 17.92; 87.5; 16.9727871; 62.5251504; 80; 17.92; 132.5; 16.9727871; 94.6809421; 80; 
43; 10.52; 62.5; 19.8512129; 44.8701726; 80; 10.52; 68; 19.8512129; 72.648095; 80; 10.52; 97.5; 19.8512129; 105.255325; 80; 10.52; 50; 19.8512129; 35.7286574; 80; 10.52; 48.5; 19.8512129; 34.6567977; 80; 10.52; 54; 19.8512129; 38.58695; 80; 10.52; 64; 19.8512129; 73.1537227; 76.7619742; 10.52; 166.5; 19.8512129; 192.979556; 80; 10.52; 87.5; 19.8512129; 67.7510116; 80; 10.52; 132.5; 19.8512129; 95.9819634; 80; 
44; 10.52; 62.5; 16.9727871; 44.6608217; 80; 10.52; 68; 16.9727871; 85.4189403; 80; 10.52; 97.5; 16.9727871; 99.5638345; 80; 10.52; 50; 16.9727871; 35.7286574; 80; 10.52; 48.5; 16.9727871; 34.6567977; 80; 10.52; 54; 16.9727871; 38.58695; 80; 10.52; 64; 16.9727871; 74.8916559; 80; 10.52; 166.5; 16.9727871; 184.134172; 79.9996824; 10.52; 87.5; 16.9727871; 96.320941; 80; 10.52; 132.5; 16.9727871; 108.299101; 80; 
45; 10.52; 62.5; 19.8512129; 44.6709435; 80; 10.52; 68; 19.8512129; 74.4786714; 80; 10.52; 97.5; 19.8512129; 104.441927; 80; 10.52; 50; 19.8512129; 35.7286574; 80; 10.52; 48.5; 19.8512129; 40.9861931; 80; 10.52; 54; 19.8512129; 39.2488104; 80; 10.52; 64; 19.8512129; 57.190364; 80; 10.52; 166.5; 19.8512129; 183.4213; 80; 10.52; 87.5; 19.8512129; 107.480291; 80; 10.52; 132.5; 19.8512129; 148.012737; 80; 
46; 10.52; 62.5; 13.32; 65.9963166; 80; 10.52; 68; 13.32; 74.6794756; 79.9976913; 10.52; 97.5; 13.32; 103.062077; 80; 10.52; 50; 13.32; 35.7286574; 80; 10.52; 48.5; 13.32; 51.8859069; 80; 10.52; 54; 13.32; 49.0924998; 80; 10.52; 64; 13.32; 68.3216517; 80; 10.52; 166.5; 13.32; 183.832819; 80; 10.52; 87.5; 13.32; 95.9324956; 80; 10.52; 132.5; 13.32; 144.214547; 80; 
47; 10.52; 62.5; 13.32; 77.3731902; 80; 10.52; 68; 13.32; 74.9267788; 80; 10.52; 97.5; 13.32; 102.119786; 80; 10.52; 50; 13.32; 56.17182; 78.7277293; 10.52; 48.5; 13.32; 54.1862258; 80; 10.52; 54; 13.32; 59.866687; 80; 10.52; 64; 13.32; 68.1348753; 80; 10.52; 166.5; 13.32; 184.242614; 80; 10.52; 87.5; 13.32; 96.2716108; 80; 10.52; 132.5; 13.32; 127.921095; 80; 
48; 10.52; 62.5; 13.32; 67.7655659; 80; 10.52; 68; 13.32; 75.045902; 80; 10.52; 97.5; 13.32; 109.722115; 80; 10.52; 50; 13.32; 66.3338709; 79.8077033; 10.52; 48.5; 13.32; 54.6652281; 79.1752315; 10.52; 54; 13.32; 62.1683847; 79.5286014; 10.52; 64; 13.32; 64.1133547; 80; 10.52; 166.5; 13.32; 184.659665; 80; 10.52; 87.5; 13.32; 96.4442972; 79.9920005; 10.52; 132.5; 13.32; 155.684649; 77.7811576; 
49; 10.52; 62.5; 13.32; 69.2573289; 79.711587; 10.52; 68; 13.32; 75.2154245; 80; 10.52; 97.5; 13.32; 114.462241; 78.4099231; 10.52; 50; 13.32; 53.7294788; 80; 10.52; 48.5; 13.32; 59.9102066; 76.789307; 10.52; 54; 13.32; 68.2956846; 75.5095939; 10.52; 64; 13.32; 75.4228314; 78.1476358; 10.52; 166.5; 13.32; 185.077095; 79.9987669; 10.52; 87.5; 13.32; 96.6964087; 79.9991008; 10.52; 132.5; 13.32; 166.667651; 76.8167052; 
50; 10.52; 62.5; 13.32; 71.3410094; 79.1207696; 10.52; 68; 13.32; 75.4259455; 79.9900663; 10.52; 97.5; 13.32; 123.779419; 76.1336568; 10.52; 50; 13.32; 51.7980852; 80; 10.52; 48.5; 13.32; 59.5833401; 78.5888138; 10.52; 54; 13.32; 72.6433953; 75.4176752; 10.52; 64; 13.32; 82.4598074; 76.1584678; 10.52; 166.5; 13.32; 200.463706; 76.6190218; 10.52; 87.5; 13.32; 96.8524139; 80; 10.52; 132.5; 13.32; 173.537002; 75; 
51; 10.52; 62.5; 13.32; 78.7328291; 75.1244917; 10.52; 68; 13.32; 81.822414; 76.559413; 10.52; 97.5; 13.32; 127.468947; 76.9064608; 10.52; 50; 13.32; 57.4920157; 78.4138319; 10.52; 48.5; 13.32; 51.3773736; 80; 10.52; 54; 13.32; 69.0577206; 78.0171349; 10.52; 64; 13.32; 78.6603269; 79.4462528; 10.52; 166.5; 13.32; 222.777275; 75.0001188; 10.52; 87.5; 13.32; 97.1358717; 79.9830507; 10.52; 132.5; 13.32; 181.034256; 75.6326173; 
52; 10.52; 62.5; 13.32; 84.4939386; 75.6928785; 10.52; 68; 13.32; 90.912452; 75.005319; 10.52; 97.5; 13.32; 126.461725; 76.5686117; 10.52; 50; 13.32; 62.1255059; 77.9550777; 10.52; 48.5; 13.32; 55.3926647; 77.0917484; 10.52; 54; 13.32; 66.6463973; 77.1418856; 10.52; 64; 13.32; 77.7017846; 76.8004728; 10.52; 166.5; 13.32; 230.044581; 75.0001735; 10.52; 87.5; 13.32; 109.021229; 75.0000187; 10.52; 132.5; 13.32; 176.88497; 75.7676532; 
53; 10.52; 62.5; 13.32; 84.5370005; 75.1346694; 10.52; 68; 13.32; 93.7682356; 75.0081368; 10.52; 97.5; 13.32; 124.355789; 75.5937431; 10.52; 50; 13.32; 65.5886173; 75; 10.52; 48.5; 13.32; 56.2452132; 80; 10.52; 54; 13.32; 69.1189102; 75.3918671; 10.52; 64; 13.32; 83.5684762; 76.1001319; 10.52; 166.5; 13.32; 230.116972; 75.0001194; 10.52; 87.5; 13.32; 120.568143; 75.0091456; 10.52; 132.5; 13.32; 170.105729; 77.5631177; 
54; 10.52; 62.5; 13.32; 85.3813611; 75.2012946; 10.52; 68; 13.32; 93.7858862; 75.011953; 10.52; 97.5; 13.32; 130.998922; 75; 10.52; 50; 13.32; 67.5759155; 76.6760015; 10.52; 48.5; 13.32; 58.7081649; 75.089085; 10.52; 54; 13.32; 72.8966; 75; 10.52; 64; 13.32; 85.085381; 75.9588014; 10.52; 166.5; 13.32; 230.141645; 75; 10.52; 87.5; 13.32; 120.665493; 75; 10.52; 132.5; 13.32; 168.878431; 75.8379382; 
55; 10.52; 62.5; 15.5789474; 85.5654989; 75.0342812; 10.52; 68; 15.5789474; 93.8074848; 75.0042003; 10.52; 97.5; 15.5789474; 137.976112; 75; 10.52; 50; 15.5789474; 59.6177251; 75; 10.52; 48.5; 15.5789474; 68.0532743; 75; 10.52; 54; 15.5789474; 74.1427921; 75.1245913; 10.52; 64; 15.5789474; 85.4512211; 75.191428; 10.52; 166.5; 15.5789474; 230.142706; 75; 10.52; 87.5; 15.5789474; 120.745997; 75.0008683; 10.52; 132.5; 15.5789474; 174.628688; 75; 
56; 10.52; 62.5; 13.32; 85.8533726; 75.0321163; 10.52; 68; 13.32; 93.8189519; 75.0065826; 10.52; 97.5; 13.32; 134.978116; 75; 10.52; 50; 13.32; 65.1808531; 75; 10.52; 48.5; 13.32; 66.6914537; 75; 10.52; 54; 13.32; 74.0092484; 75; 10.52; 64; 13.32; 87.3000142; 75; 10.52; 166.5; 13.32; 230.130359; 75; 10.52; 87.5; 13.32; 120.736455; 75; 10.52; 132.5; 13.32; 180.571176; 75; 
57; 10.52; 62.5; 13.32; 85.8389336; 75.0472527; 10.52; 68; 13.32; 93.8113298; 75.0068112; 10.52; 97.5; 13.32; 135.160646; 75; 10.52; 50; 13.32; 73.0438431; 75.0268788; 10.52; 48.5; 13.32; 66.7247291; 75; 10.52; 54; 13.32; 74.0115257; 75; 10.52; 64; 13.32; 89.0127954; 75; 10.52; 166.5; 13.32; 230.108727; 75; 10.52; 87.5; 13.32; 120.748896; 75; 10.52; 132.5; 13.32; 182.201869; 75.033096; 
58; 10.52; 62.5; 13.32; 85.835211; 75.023182; 10.52; 68; 13.32; 93.8049726; 75.0067518; 10.52; 97.5; 13.32; 135.545285; 75.0737712; 10.52; 50; 13.32; 69.3614012; 75; 10.52; 48.5; 13.32; 66.7687753; 75; 10.52; 54; 13.32; 74.0081492; 75; 10.52; 64; 13.32; 88.2088947; 75.1330889; 10.52; 166.5; 13.32; 230.080587; 75.0000201; 10.52; 87.5; 13.32; 120.742905; 75.0004854; 10.52; 132.5; 13.32; 181.82573; 75.0156485; 
59; 10.52; 62.5; 13.32; 85.8288638; 75.0370691; 10.52; 68; 13.32; 93.7959497; 75.0068425; 10.52; 97.5; 13.32; 135.336089; 75.0129473; 10.52; 50; 13.32; 69.3537349; 75.2063291; 10.52; 48.5; 13.32; 66.7491747; 75; 10.52; 54; 13.32; 74.0024742; 75.0530786; 10.52; 64; 13.32; 88.2007131; 75.034104; 10.52; 166.5; 13.32; 230.047058; 75.0000225; 10.52; 87.5; 13.32; 120.73308; 75; 10.52; 132.5; 13.32; 181.758002; 75.0786482; 
60; 10.52; 62.5; 13.32; 85.8203876; 75.0207793; 10.52; 68; 13.32; 93.7847126; 75.0066512; 10.52; 97.5; 13.32; 135.311252; 75.0348646; 10.52; 50; 13.32; 69.3434741; 75.193015; 10.52; 48.5; 13.32; 66.7457025; 75.0941273; 10.52; 54; 13.32; 73.9947177; 75.0011424; 10.52; 64; 13.32; 88.1895375; 75.0164984; 10.52; 166.5; 13.32; 230.008682; 75.0000069; 10.52; 87.5; 13.32; 120.722004; 75; 10.52; 132.5; 13.32; 181.748457; 75.0136053; 
61; 10.52; 62.5; 13.32; 85.8100268; 75.041778; 10.52; 68; 13.32; 93.7714804; 75.0070027; 10.52; 97.5; 13.32; 135.263485; 75.0576858; 10.52; 50; 13.32; 69.3313029; 75.1572538; 10.52; 48.5; 13.32; 66.74015; 75.0692792; 10.52; 54; 13.32; 73.9852214; 75; 10.52; 64; 13.32; 88.1760616; 75.0739414; 10.52; 166.5; 13.32; 229.965733; 75; 10.52; 87.5; 13.32; 120.708868; 75; 10.52; 132.5; 13.32; 181.777434; 75.0620486; 
62; 10.52; 62.5; 13.32; 85.7979028; 75.0381395; 10.52; 68; 13.32; 93.7563633; 75.0070812; 10.52; 97.5; 13.32; 135.242388; 75; 10.52; 50; 13.32; 69.3175482; 75.0904799; 10.52; 48.5; 13.32; 66.7329311; 75.0537391; 10.52; 54; 13.32; 73.9741518; 75; 10.52; 64; 13.32; 88.1606184; 75.0629178; 10.52; 166.5; 13.32; 229.918354; 75.0000037; 10.52; 87.5; 13.32; 120.691348; 75; 10.52; 132.5; 13.32; 181.739104; 75.0181982; 
63; 10.52; 62.5; 13.32; 85.7840792; 75.0303676; 10.52; 68; 13.32; 93.7394203; 75.0070137; 10.52; 97.5; 13.32; 135.228905; 75; 10.52; 50; 13.32; 69.3023688; 75.1268379; 10.52; 48.5; 13.32; 66.7242455; 75.0790294; 10.52; 54; 13.32; 73.9615927; 75; 10.52; 64; 13.32; 88.1433709; 75.1432026; 10.52; 166.5; 13.32; 229.866632; 75.000031; 10.52; 87.5; 13.32; 120.672027; 75.000184; 10.52; 132.5; 13.32; 181.705911; 75.0183023; 
64; 10.52; 62.5; 13.32; 85.7685923; 75.0379438; 10.52; 68; 13.32; 93.7206857; 75.0072464; 10.52; 97.5; 13.32; 135.184096; 75.0272116; 10.52; 50; 13.32; 69.2858443; 75.0464042; 10.52; 48.5; 13.32; 66.7141922; 75.115181; 10.52; 54; 13.32; 73.947589; 75; 10.52; 64; 13.32; 88.1244024; 75.0401477; 10.52; 166.5; 13.32; 229.810622; 75.0000002; 10.52; 87.5; 13.32; 120.650368; 75; 10.52; 132.5; 13.32; 181.669038; 75; 
65; 10.52; 62.5; 13.32; 85.7514655; 75.0208989; 10.52; 68; 13.32; 93.7001827; 75.0072817; 10.52; 97.5; 13.32; 135.145988; 75.0095785; 10.52; 50; 13.32; 69.2680172; 75.2257431; 10.52; 48.5; 13.32; 66.7028227; 75.0523195; 10.52; 54; 13.32; 73.9321675; 75; 10.52; 64; 13.32; 88.1037583; 75.0327466; 10.52; 166.5; 13.32; 229.750368; 75.0000017; 10.52; 87.5; 13.32; 120.626409; 75; 10.52; 132.5; 13.32; 181.628632; 75; 
66; 10.52; 62.5; 13.32; 85.732716; 75.0459509; 10.52; 68; 13.32; 93.6779289; 75.0069355; 10.52; 97.5; 13.32; 135.10543; 75.0155225; 10.52; 50; 13.32; 69.2489124; 75.0497143; 10.52; 48.5; 13.32; 66.6901663; 75.0548233; 10.52; 54; 13.32; 73.9153459; 75.0690047; 10.52; 64; 13.32; 88.0814666; 75.0073489; 10.52; 166.5; 13.32; 229.685906; 75; 10.52; 87.5; 13.32; 120.600176; 75; 10.52; 132.5; 13.32; 181.584777; 75; 
67; 10.52; 62.5; 13.32; 85.7123583; 75.038115; 10.52; 68; 13.32; 93.6539394; 75.0074348; 10.52; 97.5; 13.32; 135.062445; 75; 10.52; 50; 13.32; 69.2285465; 75.2450536; 10.52; 48.5; 13.32; 66.6762416; 75.0454795; 10.52; 54; 13.32; 73.8971381; 75.0258308; 10.52; 64; 13.32; 88.0575464; 75; 10.52; 166.5; 13.32; 229.61727; 75.0000042; 10.52; 87.5; 13.32; 120.571691; 75; 10.52; 132.5; 13.32; 181.389363; 75; 
68; 10.52; 62.5; 13.32; 85.6904053; 75.0268165; 10.52; 68; 13.32; 93.6282279; 75.0072242; 10.52; 97.5; 13.32; 135.017053; 75; 10.52; 50; 13.32; 69.2069321; 75.2108571; 10.52; 48.5; 13.32; 66.6610621; 75.0720284; 10.52; 54; 13.32; 73.8775559; 75.087451; 10.52; 64; 13.32; 88.0320132; 75; 10.52; 166.5; 13.32; 229.544491; 75; 10.52; 87.5; 13.32; 120.540971; 75; 10.52; 132.5; 13.32; 181.408649; 75; 
69; 10.52; 62.5; 13.32; 85.6668693; 75.0346749; 10.52; 68; 13.32; 93.6008076; 75.0076276; 10.52; 97.5; 13.32; 134.96303; 75; 10.52; 50; 13.32; 69.18408; 75.1361203; 10.52; 48.5; 13.32; 66.6402581; 75.1605071; 10.52; 54; 13.32; 73.8566103; 75.030484; 10.52; 64; 13.32; 88.0048805; 75.1127375; 10.52; 166.5; 13.32; 229.467601; 75; 10.52; 87.5; 13.32; 120.508036; 75.0005111; 10.52; 132.5; 13.32; 181.500321; 75; 
70; 10.52; 62.5; 13.32; 85.6417621; 75.0454669; 10.52; 68; 13.32; 93.5716912; 75.0073945; 10.52; 97.5; 13.32; 134.87654; 75; 10.52; 50; 13.32; 68.4913019; 75.8568565; 10.52; 48.5; 13.32; 66.5576378; 75.1242118; 10.52; 54; 13.32; 73.8343115; 75.0149871; 10.52; 64; 13.32; 87.9761608; 75.0302427; 10.52; 166.5; 13.32; 229.386629; 75; 10.52; 87.5; 13.32; 120.4729; 75; 10.52; 132.5; 13.32; 181.374957; 75; 
71; 10.52; 62.5; 16; 85.6150954; 75.0382678; 10.52; 68; 16; 93.5408913; 75.0081919; 10.52; 97.5; 16; 134.848708; 75; 10.52; 50; 16; 68.6985991; 75; 10.52; 48.5; 16; 66.5746882; 75.0834438; 10.52; 54; 16; 73.8106697; 75.0693601; 10.52; 64; 16; 87.9458659; 75; 10.52; 166.5; 16; 229.301607; 75; 10.52; 87.5; 16; 120.435581; 75.0000465; 10.52; 132.5; 16; 181.314436; 75.0832317; 
72; 10.52; 62.5; 16; 85.5868807; 75.0379262; 10.52; 68; 16; 93.5084203; 75.0075129; 10.52; 97.5; 16; 134.829612; 75; 10.52; 50; 16; 69.3684205; 75.0773411; 10.52; 48.5; 16; 66.6184597; 75.1010575; 10.52; 54; 16; 73.7856947; 75.0254371; 10.52; 64; 16; 75.307414; 75.0961394; 10.52; 166.5; 16; 229.212563; 75; 10.52; 87.5; 16; 120.396094; 75.0002381; 10.52; 132.5; 16; 181.250663; 75.0159042; 
73; 10.52; 62.5; 16; 85.5571294; 75.0393452; 10.52; 68; 16; 93.4742904; 75.0075055; 10.52; 97.5; 16; 105.105163; 75; 10.52; 50; 16; 69.1147505; 75.288468; 10.52; 48.5; 16; 66.5663421; 75.0082322; 10.52; 54; 16; 73.7593965; 75.0679958; 10.52; 64; 16; 81.2217094; 75; 10.52; 166.5; 16; 229.119528; 75.0000098; 10.52; 87.5; 16; 120.354456; 75; 10.52; 132.5; 16; 181.183661; 75.0549995; 
74; 10.52; 62.5; 16; 65.0053639; 79.3597049; 10.52; 68; 16; 93.4385139; 75.0079326; 10.52; 97.5; 16; 114.422882; 75; 10.52; 50; 16; 52.312064; 80; 10.52; 48.5; 16; 50.6696715; 80; 10.52; 54; 16; 73.7317848; 75.0617573; 10.52; 64; 16; 93.5769976; 75; 10.52; 166.5; 16; 229.02253; 75; 10.52; 87.5; 16; 120.310683; 75.0004222; 10.52; 132.5; 16; 181.113453; 75.0263537; 
75; 10.52; 62.5; 16; 71.4391823; 75; 10.52; 68; 16; 93.4011028; 75.0078977; 10.52; 97.5; 16; 145.677037; 75; 10.52; 50; 16; 35.7286574; 80; 10.52; 48.5; 16; 34.7988673; 76.4697876; 10.52; 54; 16; 73.7028691; 75.0295506; 10.52; 64; 16; 87.7447025; 75; 10.52; 166.5; 16; 228.921599; 75; 10.52; 87.5; 16; 120.264789; 75.0003292; 10.52; 132.5; 16; 181.040065; 75.0324652; 
76; 10.52; 62.5; 16; 71.1720444; 75.3976562; 10.52; 68; 16; 93.3620691; 75.008112; 10.52; 97.5; 16; 104.006208; 75; 10.52; 50; 16; 35.7286574; 80; 10.52; 48.5; 16; 55.4368055; 75; 10.52; 54; 16; 56.5720603; 79.1794942; 10.52; 64; 16; 87.7071781; 75; 10.52; 166.5; 16; 228.816763; 75; 10.52; 87.5; 16; 120.216792; 75.0002287; 10.52; 132.5; 16; 173.829893; 75.0221048; 
77; 10.52; 62.5; 16; 71.4454371; 75; 10.52; 68; 16; 70.8547309; 80; 10.52; 97.5; 16; 111.445124; 75; 10.52; 50; 16; 57.1513459; 77.680509; 10.52; 48.5; 16; 72.9526258; 75; 10.52; 54; 16; 61.7234535; 75; 10.52; 64; 16; 87.6681436; 75; 10.52; 166.5; 16; 173.594917; 75; 10.52; 87.5; 16; 120.166705; 75.0006832; 10.52; 132.5; 16; 177.115807; 75; 
78; 10.52; 62.5; 16; 93.0755917; 75; 10.52; 68; 16; 48.591258; 80; 10.52; 97.5; 16; 111.028389; 80; 10.52; 50; 16; 56.9376355; 80; 10.52; 48.5; 16; 68.1647531; 75.0808051; 10.52; 54; 16; 61.4926464; 75; 10.52; 64; 16; 87.62761; 75.0101525; 10.52; 166.5; 16; 167.957536; 75; 10.52; 87.5; 16; 120.113737; 75.0006569; 10.52; 132.5; 16; 141.130026; 79.0786462; 
79; 13.1640959; 62.5; 16; 86.7515027; 75.0519447; 13.1640959; 68; 16; 48.590974; 80; 13.1640959; 97.5; 16; 98.5083549; 75; 13.1640959; 50; 16; 35.7286574; 80; 13.1640959; 48.5; 16; 50.5991914; 79.61421; 13.1640959; 54; 16; 61.7234535; 75; 13.1640959; 64; 16; 66.8046974; 75; 13.1640959; 166.5; 16; 236.882579; 75; 13.1640959; 87.5; 16; 91.1619701; 79.4563209; 13.1640959; 132.5; 16; 151.451067; 75; 
80; 14.9059041; 62.5; 16; 85.2509505; 75.051971; 14.9059041; 68; 16; 48.590974; 78.9667566; 14.9059041; 97.5; 16; 98.2206755; 80; 14.9059041; 50; 16; 35.7286574; 78.2135495; 14.9059041; 48.5; 16; 55.4368055; 75; 14.9059041; 54; 16; 68.3375658; 75; 14.9059041; 64; 16; 45.9700657; 78.569129; 14.9059041; 166.5; 16; 242.410193; 75; 14.9059041; 87.5; 16; 100.014855; 75; 14.9059041; 132.5; 16; 150.884734; 80; 
81; 14.9059041; 62.5; 16; 81.5321005; 75.1733238; 14.9059041; 68; 16; 77.7258304; 75; 14.9059041; 97.5; 16; 111.445124; 75.9968146; 14.9059041; 50; 16; 57.1513459; 75; 14.9059041; 48.5; 16; 55.2295065; 80; 14.9059041; 54; 16; 68.5000888; 75; 14.9059041; 64; 16; 73.1537227; 75; 14.9059041; 166.5; 16; 173.14312; 75; 14.9059041; 87.5; 16; 99.6408622; 80; 14.9059041; 132.5; 16; 94.9936349; 80; 
82; 14.9059041; 62.5; 16; 83.222445; 75; 14.9059041; 68; 16; 102.343768; 75; 14.9059041; 97.5; 16; 114.433135; 75; 14.9059041; 50; 16; 75.4541714; 75; 14.9059041; 48.5; 16; 34.7926352; 76.3907371; 14.9059041; 54; 16; 61.4926464; 75; 14.9059041; 64; 16; 96.0723842; 75; 14.9059041; 166.5; 16; 158.78925; 75; 14.9059041; 87.5; 16; 62.5255705; 76.5355913; 14.9059041; 132.5; 16; 94.6809421; 80; 
83; 12.744548; 62.5; 16; 86.8070357; 75; 12.744548; 68; 16; 95.678796; 75; 12.744548; 97.5; 16; 73.0416618; 80; 12.744548; 50; 16; 70.8934047; 75; 12.744548; 48.5; 16; 55.4368055; 75; 12.744548; 54; 16; 39.0740227; 78.3934672; 12.744548; 64; 16; 89.4960339; 75; 12.744548; 166.5; 16; 192.20094; 75; 12.744548; 87.5; 16; 100.014855; 75; 12.744548; 132.5; 16; 94.6809421; 80; 
84; 12.744548; 62.5; 16; 85.0664908; 75; 12.744548; 68; 16; 93.2078949; 75; 12.744548; 97.5; 16; 69.6708819; 80; 12.744548; 50; 16; 69.1336464; 75; 12.744548; 48.5; 16; 72.8125224; 75; 12.744548; 54; 16; 61.7234535; 75; 12.744548; 64; 16; 66.3276626; 75; 12.744548; 166.5; 16; 152.448014; 80; 12.744548; 87.5; 16; 131.572107; 75; 12.744548; 132.5; 16; 94.6809421; 78.8594176; 
85; 12.744548; 62.5; 16; 85.0229892; 75; 12.744548; 68; 16; 78.5965311; 75; 12.744548; 97.5; 16; 111.445124; 77.4803851; 12.744548; 50; 16; 53.1357232; 80; 12.744548; 48.5; 16; 67.9286995; 75; 12.744548; 54; 16; 80.7246287; 75; 12.744548; 64; 16; 73.1537227; 75; 12.744548; 166.5; 16; 118.976429; 80; 12.744548; 87.5; 16; 94.1397865; 80; 12.744548; 132.5; 16; 145.290885; 75; 
86; 12.744548; 62.5; 16; 84.9913134; 75; 12.744548; 68; 16; 85.4341388; 75; 12.744548; 97.5; 16; 111.028389; 75; 12.744548; 50; 16; 36.5544166; 76.5489163; 12.744548; 48.5; 16; 66.2488172; 75; 12.744548; 54; 16; 74.8375841; 75; 12.744548; 64; 16; 72.8801735; 75; 12.744548; 166.5; 16; 118.976429; 80; 12.744548; 87.5; 16; 62.5270651; 80; 12.744548; 132.5; 16; 195.340253; 75; 
87; 20.7; 62.5; 16; 84.9384709; 75; 20.7; 68; 16; 99.7177581; 75; 20.7; 97.5; 16; 69.6708819; 80; 20.7; 50; 16; 35.7286574; 79.7305049; 20.7; 48.5; 16; 66.2489268; 75; 20.7; 54; 16; 73.1061125; 75; 20.7; 64; 16; 45.7326815; 78.7434728; 20.7; 166.5; 16; 123.400524; 77.9100104; 20.7; 87.5; 16; 100.014855; 76.2525905; 20.7; 132.5; 16; 145.142269; 75; 
88; 20.7; 62.5; 16; 84.8894087; 75; 20.7; 68; 16; 70.6805949; 80; 20.7; 97.5; 16; 100.734762; 75; 20.7; 50; 16; 35.7286574; 80; 20.7; 48.5; 16; 50.6331277; 75; 20.7; 54; 16; 64.6994436; 75; 20.7; 64; 16; 45.7326815; 80; 20.7; 166.5; 16; 123.35639; 80; 20.7; 87.5; 16; 99.6408622; 80; 20.7; 132.5; 16; 151.858366; 75; 
89; 20.7; 62.5; 16; 64.6620673; 75; 20.7; 68; 16; 48.590974; 76.4127495; 20.7; 97.5; 16; 100.424872; 80; 20.7; 50; 16; 35.7286574; 79.5689928; 20.7; 48.5; 16; 55.4368055; 75; 20.7; 54; 16; 47.3056279; 80; 20.7; 64; 16; 45.7326815; 78.9923118; 20.7; 166.5; 16; 118.976429; 79.2730361; 20.7; 87.5; 16; 91.926163; 78.1608764; 20.7; 132.5; 16; 196.621138; 75; 
90; 20.7; 62.5; 16; 44.6608217; 80; 20.7; 68; 16; 77.7258304; 75; 20.7; 97.5; 16; 69.6708819; 77.8053825; 20.7; 50; 16; 35.7286574; 79.6955563; 20.7; 48.5; 16; 61.5822164; 75; 20.7; 54; 16; 61.7234535; 75; 20.7; 64; 16; 73.1537227; 75; 20.7; 166.5; 16; 118.976429; 80; 20.7; 87.5; 16; 91.6328618; 80; 20.7; 132.5; 16; 182.613692; 75; 
91; 20.7; 62.5; 16; 48.2131236; 80; 20.7; 68; 16; 84.7341107; 76.273127; 20.7; 97.5; 16; 69.6708819; 80; 20.7; 50; 16; 55.4416835; 79.7145346; 20.7; 48.5; 16; 61.7261415; 75; 20.7; 54; 16; 61.4926464; 78.518296; 20.7; 64; 16; 72.8801735; 75; 20.7; 166.5; 16; 118.976429; 80; 20.7; 87.5; 16; 62.5251504; 80; 20.7; 132.5; 16; 139.844527; 75; 
92; 20.7; 62.5; 16; 48.1776862; 77.7969115; 20.7; 68; 16; 84.9519435; 75; 20.7; 97.5; 16; 69.6708819; 79.4471562; 20.7; 50; 16; 55.2450286; 75; 20.7; 48.5; 16; 55.2295065; 75; 20.7; 54; 16; 61.7234535; 75; 20.7; 64; 16; 73.1537227; 77.2939572; 20.7; 166.5; 16; 118.976429; 80; 20.7; 87.5; 16; 62.5251504; 78.1230869; 20.7; 132.5; 16; 145.705542; 75; 
93; 20.7; 62.5; 16; 44.6608217; 80; 20.7; 68; 16; 77.4351867; 75; 20.7; 97.5; 16; 69.6708853; 80; 20.7; 50; 16; 35.7286574; 80; 20.7; 48.5; 16; 55.6935807; 75; 20.7; 54; 16; 61.4926464; 75; 20.7; 64; 16; 72.8801735; 80; 20.7; 166.5; 16; 118.976429; 80; 20.7; 87.5; 16; 83.829443; 75; 20.7; 132.5; 16; 142.318347; 80; 
94; 20.7; 62.5; 16; 44.6608217; 79.0804281; 20.7; 68; 16; 48.5909764; 80; 20.7; 97.5; 16; 69.6708853; 80; 20.7; 50; 16; 35.7286574; 80; 20.7; 48.5; 16; 71.8042182; 75; 20.7; 54; 16; 38.58695; 78.1133054; 20.7; 64; 16; 45.7326815; 75.804774; 20.7; 166.5; 16; 190.313982; 75; 20.7; 87.5; 16; 121.106619; 75; 20.7; 132.5; 16; 129.225886; 75; 
95; 20.7; 62.5; 13.68; 44.6608217; 79.3572387; 20.7; 68; 13.68; 48.590974; 80; 20.7; 97.5; 13.68; 69.6708819; 80; 20.7; 50; 13.68; 35.7286574; 80; 20.7; 48.5; 13.68; 51.2211689; 80; 20.7; 54; 13.68; 38.5869499; 79.1921621; 20.7; 64; 13.68; 45.7326815; 80; 20.7; 166.5; 13.68; 189.602326; 79.6694924; 20.7; 87.5; 13.68; 99.6408622; 80; 20.7; 132.5; 13.68; 128.88127; 80; 
96; 20.7; 62.5; 37.12; 71.4391823; 75; 20.7; 68; 37.12; 48.6152402; 78.9685112; 20.7; 97.5; 37.12; 70.625258; 79.2970075; 20.7; 50; 37.12; 57.1513459; 75; 20.7; 48.5; 37.12; 35.3582989; 76.0169804; 20.7; 54; 37.12; 61.7234535; 75; 20.7; 64; 37.12; 45.7326815; 78.8316647; 20.7; 166.5; 37.12; 190.313982; 75; 20.7; 87.5; 37.12; 81.6875484; 75; 20.7; 132.5; 37.12; 151.451067; 75; 
