t; nomPriceB5; nomPlPowB5; integrPriceB5; integrPlPowB5; integrT_in_B5; disagg_price_bus5; PlPowB5; disaggT_in_B5;  initFeasThres; finalFeasThres; accept_gap; iterations; CPUmaster; CPUsubproblem; CPUsubsolve; CPUsubcutgen; CPUfeasPt; finalDetectGap; nomCongestionCost; intCongestionCost; disaggCongestionCost; Objective; nomImprovPercent; CoopPotentialPercent; nominalCost; integratedCost
1; 13.32; 35.5; 10.89; 30.4082761; 80; 10.89; 30.4082761; 80; 71; 45.8898403; 0.0001; 70; 2.1509819; 4.2958951; 3.70448995; 0.590888023; 0.736137986; 5.88661351e-05; 243078.672; 57226.75; 57226.75; 1819188.27; 14.5003997; 99.9764155; 2127715.53; 1819115.49
2; 13.32; 35.5; 14.13; 36.0774067; 80; 14.13; 28.8155558; 80; 
3; 13.32; 35.5; 14.13; 42.4231898; 80; 14.13; 39.2830249; 78.6473516; 
4; 13.32; 35.5; 14.13; 38.2479773; 80; 14.13; 42.2222813; 80; 
5; 13.32; 35.5; 14.13; 38.3144935; 80; 14.13; 38.2654736; 80; 
6; 13.32; 35.5; 14.13; 38.3795942; 80; 14.13; 34.7301836; 80; 
7; 13.32; 35.5; 14.13; 38.4453245; 80; 14.13; 37.6020061; 79.7602916; 
8; 13.32; 35.5; 14.13; 38.5144978; 80; 14.13; 42.8186025; 77.5509854; 
9; 13.32; 35.5; 14.13; 31.9284337; 80; 14.13; 34.3308313; 80; 
10; 13.32; 35.5; 31.095; 25.3673467; 80; 31.095; 26.2006438; 80; 
11; 39.15; 35.5; 31.095; 25.3673467; 80; 31.095; 25.3673467; 80; 
12; 39.15; 35.5; 31.095; 25.3673467; 80; 31.095; 25.3673467; 80; 
13; 39.15; 35.5; 31.095; 25.3673467; 80; 31.095; 25.3673467; 80; 
14; 39.15; 35.5; 31.095; 25.3673467; 80; 31.095; 25.3673467; 80; 
15; 36.65; 35.5; 31.095; 25.3673467; 80; 31.095; 25.3673467; 80; 
16; 39.15; 35.5; 31.095; 25.3673467; 80; 31.095; 25.3673467; 80; 
17; 39.15; 35.5; 31.095; 25.3673467; 80; 31.095; 25.3673467; 80; 
18; 39.15; 35.5; 31.095; 25.3673467; 80; 31.095; 25.3673467; 80; 
19; 39.15; 35.5; 31.095; 25.3673467; 80; 31.095; 25.3673467; 80; 
20; 39.15; 35.5; 31.095; 25.3673467; 80; 31.095; 25.3673467; 80; 
21; 39.15; 35.5; 31.095; 25.3673467; 80; 31.095; 25.3673467; 80; 
22; 39.15; 35.5; 31.095; 25.3673467; 80; 31.095; 25.3673467; 80; 
23; 39.15; 35.5; 31.095; 25.3673467; 80; 31.095; 25.3673467; 80; 
24; 39.15; 35.5; 31.095; 25.3673467; 80; 31.095; 25.3673467; 80; 
25; 260.481017; 35.5; 77.0619313; 25.3673467; 80; 77.3567545; 25.3673467; 80; 
26; 260.481017; 35.5; 77.0619313; 25.3673467; 80; 77.3567545; 25.3673467; 80; 
27; 260.481017; 35.5; 77.0619313; 25.3673467; 80; 77.3567545; 25.3673467; 80; 
28; 260.481017; 35.5; 77.0619313; 25.3673467; 80; 77.3567545; 25.3673467; 80; 
29; 260.481017; 35.5; 23.3690916; 25.3673467; 80; 22.975994; 25.3673467; 80; 
30; 24.75795; 35.5; 23.3690916; 25.3673467; 80; 22.975994; 25.3673467; 80; 
31; 24.75795; 35.5; 23.3690916; 25.3673467; 80; 22.975994; 25.3673467; 80; 
32; 24.75795; 35.5; 23.3690916; 25.3673467; 80; 22.975994; 25.3673467; 80; 
33; 24.75795; 35.5; 23.3690916; 25.3673467; 80; 22.975994; 25.3673467; 80; 
34; 24.75795; 35.5; 23.3690916; 25.3673467; 80; 22.975994; 25.3673467; 80; 
35; 24.75795; 35.5; 23.3690916; 25.3673467; 80; 22.975994; 25.3673467; 80; 
36; 24.75795; 35.5; 23.3690916; 25.3673467; 80; 22.975994; 25.3673467; 80; 
37; 28.9566667; 35.5; 27.3322709; 25.3673467; 80; 26.8725076; 25.3673467; 80; 
38; 28.9566667; 35.5; 27.3322709; 25.3673467; 80; 26.8725076; 25.3673467; 80; 
39; 28.9566667; 35.5; 27.3322709; 25.3673467; 80; 26.8725076; 25.9626875; 80; 
40; 28.9566667; 35.5; 27.3322709; 25.3673467; 80; 26.8725076; 25.9567485; 80; 
41; 28.9566667; 35.5; 27.3322709; 25.3673467; 80; 26.8725076; 25.3673467; 80; 
42; 28.9566667; 35.5; 27.3322709; 25.3673467; 80; 26.8725076; 25.3673467; 80; 
43; 28.9566667; 35.5; 27.3322709; 25.3673467; 80; 26.8725076; 25.3673467; 80; 
44; 28.9566667; 35.5; 12.3268981; 25.3673467; 80; 21.5731095; 25.3673467; 80; 
45; 5.47; 35.5; 14.4174246; 30.4880969; 80; 25.231707; 31.9051727; 77.7880599; 
46; 5.47; 35.5; 12.3268981; 44.7991681; 75.9644126; 5.47; 45.6470187; 75; 
47; 5.47; 35.5; 14.4174246; 51.2691321; 75; 6.39766082; 50.5439946; 75; 
48; 5.47; 35.5; 5.47; 48.6276534; 75; 5.47; 48.4068157; 75; 
49; 5.47; 35.5; 5.47; 48.641939; 75; 5.47; 48.5469631; 75.3845293; 
50; 5.47; 35.5; 5.47; 48.6463502; 75; 5.47; 48.5493394; 75; 
51; 5.47; 35.5; 5.47; 48.6464777; 75; 5.47; 48.5487091; 75.3550477; 
52; 5.47; 35.5; 5.47; 48.6436708; 75; 5.47; 48.5455044; 75.2077447; 
53; 5.47; 35.5; 5.47; 48.6392173; 75; 5.47; 48.5405595; 75; 
54; 5.47; 35.5; 5.47; 48.6334221; 75; 5.47; 48.5342716; 75.1651793; 
55; 5.47; 35.5; 5.47; 48.6264983; 75; 5.47; 48.5268564; 75; 
56; 5.47; 35.5; 5.47; 48.61855; 75; 5.47; 48.5184192; 75.1110694; 
57; 5.47; 35.5; 5.47; 48.6096296; 75; 5.47; 48.509013; 75.0827683; 
58; 5.47; 35.5; 5.47; 48.5997654; 75; 5.47; 48.4986664; 75.2419668; 
59; 5.47; 35.5; 5.47; 48.5889744; 75; 5.47; 48.4873964; 75.232389; 
60; 5.47; 35.5; 5.47; 48.5772681; 75; 5.47; 48.4752145; 75.0249359; 
61; 5.47; 35.5; 5.47; 48.5646553; 75; 5.47; 48.4621296; 75.1858141; 
62; 5.47; 35.5; 5.47; 48.5511438; 75; 5.47; 48.4481494; 75.1465583; 
63; 5.47; 35.5; 5.47; 48.5367406; 75; 5.47; 48.433281; 75.3112622; 
64; 5.47; 35.5; 5.47; 48.5214525; 75; 5.47; 48.4175311; 75.062838; 
65; 6.39720585; 35.5; 6.39766082; 48.5052862; 75; 6.39766082; 48.4009063; 75.0819373; 
66; 6.39766082; 35.5; 6.39766082; 48.488248; 75; 6.39766082; 48.383413; 75; 
67; 6.39766082; 35.5; 6.39766082; 48.4703443; 75; 6.39766082; 48.3650577; 75; 
68; 5.47; 35.5; 6.39766082; 48.4515817; 75; 5.47; 48.3458466; 75; 
69; 5.47; 35.5; 5.47; 48.4319664; 75; 5.47; 48.3257861; 75; 
70; 5.47; 35.5; 5.47; 48.4115045; 75; 5.47; 48.3048825; 75; 
71; 5.47; 35.5; 5.47; 48.3902025; 75; 5.47; 48.2831418; 75; 
72; 5.47; 35.5; 5.47; 48.3680663; 75; 5.47; 48.2605702; 75; 
73; 5.47; 35.5; 5.47; 48.3451022; 75; 5.47; 48.2371739; 75; 
74; 5.47; 35.5; 5.47; 48.3213161; 75; 5.47; 48.2129588; 75; 
75; 5.47; 35.5; 5.47; 48.2967142; 75; 5.47; 48.187931; 75; 
76; 5.47; 35.5; 5.47; 48.2713024; 75; 5.47; 48.1295022; 75; 
77; 5.47; 35.5; 11.5398802; 45.0388321; 75; 13.0232568; 45.2572465; 78.3798623; 
78; 17.3550271; 35.5; 17.0505234; 33.5680179; 80; 16.8348079; 33.8700911; 75; 
79; 17.3550271; 35.5; 17.0505234; 25.3673467; 80; 16.8348079; 25.3673467; 80; 
80; 17.3550271; 35.5; 17.0505234; 25.3673467; 80; 16.8348079; 25.3673467; 80; 
81; 17.3550271; 35.5; 17.0505234; 25.3673467; 80; 16.8348079; 25.3673467; 78.3179647; 
82; 17.3550271; 35.5; 17.0505234; 25.3673467; 80; 16.8348079; 25.3673467; 80; 
83; 16; 35.5; 14.9494766; 25.738992; 80; 14.3937607; 25.3673467; 78.7079468; 
84; 14.8385482; 35.5; 14.5781975; 37.7878576; 75; 14.3937607; 40.5773377; 75; 
85; 14.8385482; 35.5; 14.5781975; 51.0674954; 75; 14.3937607; 53.0030311; 75; 
86; 14.8385482; 35.5; 14.5781975; 40.7653839; 75; 14.3937607; 49.2347567; 75; 
87; 14.8385482; 35.5; 14.5781975; 40.9878182; 77.1411294; 14.3937607; 36.8659351; 75; 
88; 14.8385482; 35.5; 14.5781975; 39.0995078; 80; 14.3937607; 25.7983332; 80; 
89; 14.8385482; 35.5; 14.5781975; 25.3673467; 80; 16.7633961; 29.2342907; 75; 
90; 14.8385482; 35.5; 14.5781975; 25.3673467; 80; 14.3937607; 29.1955893; 80; 
91; 17.3550271; 35.5; 17.0505234; 25.3673467; 80; 16.8348079; 25.5961705; 78.2792977; 
92; 17.3550271; 35.5; 17.0505234; 25.3673467; 80; 16.8348079; 25.3673467; 80; 
93; 17.3550271; 35.5; 17.0505234; 25.3673467; 80; 16.8348079; 25.3673467; 78.4415935; 
94; 17.3550271; 35.5; 17.0505234; 25.3673467; 80; 16.8348079; 25.3673467; 80; 
95; 17.3550271; 35.5; 17.0505234; 25.3673467; 80; 16.8348079; 25.3673467; 78.4091555; 
96; 17.3550271; 35.5; 20.7; 40.5774556; 77.0946078; 20.7; 40.5774556; 75; 
