t; nomPriceB5; nomPlPowB5; integrPriceB5; integrPlPowB5; integrT_in_B5; disagg_price_bus5; PlPowB5; disaggT_in_B5; nomPriceB10; nomPlPowB10; integrPriceB10; integrPlPowB10; integrT_in_B10; disagg_price_bus10; PlPowB10; disaggT_in_B10;  initFeasThres; finalFeasThres; accept_gap; iterations; CPUmaster; CPUsubproblem; CPUfeasPt; finalDetectGap; nomCongestionCost; intCongestionCost; disaggCongestionCost; Objective; nomImprovPercent; CoopPotentialPercent; nominalCost; integratedCost
1; 13.32; 35.5; 13.32; 30.4082761; 80; 11.5752061; 30.6547895; 80; 13.32; 97.5; 13.32; 83.515688; 80; 11.5752061; 83.515688; 80; 133; 9.34643886; 0.0001; 863; 57.6195187; 55.4293352; 0.645851993; 9.14305217e-05; 232006.572; 18676.4901; 18994.2475; 1815262.77; 16.2474744; 99.9573919; 2167412.58; 1815112.67
2; 13.32; 35.5; 13.32; 27.420466; 80; 15.0647939; 27.1250636; 80; 13.32; 97.5; 13.32; 76.4772087; 80; 15.0647939; 77.3912393; 80; 
3; 13.32; 35.5; 16.0080224; 27.3999843; 80; 15.0647939; 37.7181579; 79.7924125; 13.32; 97.5; 16.0080224; 76.4093095; 80; 15.0647939; 77.3198209; 80; 
4; 13.32; 35.5; 16.0080224; 25.3673467; 80; 15.0647939; 36.9495733; 80; 13.32; 97.5; 16.0080224; 69.6708819; 80; 15.0647939; 69.6821356; 80; 
5; 13.32; 35.5; 16.0080224; 27.4322714; 80; 15.0647939; 29.7271639; 80; 13.32; 97.5; 16.0080224; 69.6708819; 80; 15.0647939; 69.680535; 80; 
6; 13.32; 35.5; 16.0080224; 27.504972; 80; 15.0647939; 30.2365685; 80; 13.32; 97.5; 16.0080224; 83.6551946; 80; 15.0647939; 69.6823477; 80; 
7; 13.32; 35.5; 16.0080224; 26.6310658; 80; 15.0647939; 30.1071684; 80; 13.32; 97.5; 16.0080224; 83.5156887; 80; 15.0647939; 69.6809838; 80; 
8; 13.32; 35.5; 16.0080224; 33.3402148; 80; 15.0647939; 33.6084522; 80; 13.32; 97.5; 16.0080224; 69.6708819; 80; 15.0647939; 69.6742705; 80; 
9; 13.32; 35.5; 16.0080224; 32.1125825; 80; 15.0647939; 30.2142835; 80; 13.32; 97.5; 16.0080224; 69.6708819; 80; 15.0647939; 69.6720792; 80; 
10; 13.32; 35.5; 27.500549; 25.3673467; 80; 28.4437775; 25.3673467; 80; 13.32; 97.5; 27.500549; 69.6708819; 80; 28.4437775; 69.672996; 80; 
11; 39.15; 35.5; 27.500549; 25.3673467; 80; 28.4437775; 25.3673467; 80; 39.15; 97.5; 27.500549; 69.6708819; 80; 28.4437775; 69.6725238; 80; 
12; 39.15; 35.5; 27.500549; 25.3673467; 80; 28.4437775; 26.8847578; 80; 39.15; 97.5; 27.500549; 69.6708819; 80; 28.4437775; 69.6708819; 80; 
13; 39.15; 35.5; 27.500549; 25.3673467; 80; 28.4437775; 26.8696203; 80; 39.15; 97.5; 27.500549; 69.6708819; 80; 28.4437775; 69.6710874; 80; 
14; 39.15; 35.5; 27.500549; 25.3673467; 80; 28.4437775; 25.3673467; 80; 39.15; 97.5; 27.500549; 69.6708819; 80; 28.4437775; 69.6736189; 80; 
15; 39.15; 35.5; 27.500549; 25.3673467; 80; 28.4437775; 25.3673467; 80; 39.15; 97.5; 27.500549; 69.6708819; 80; 28.4437775; 69.6733901; 80; 
16; 39.15; 35.5; 27.500549; 25.3673467; 80; 28.4437775; 25.3673467; 80; 39.15; 97.5; 27.500549; 69.6708819; 80; 28.4437775; 69.6717487; 80; 
17; 39.15; 35.5; 23.5129694; 25.3673467; 80; 24.3194298; 25.3673467; 80; 39.15; 97.5; 23.5129694; 69.6708819; 80; 24.3194298; 69.6717401; 80; 
18; 39.15; 35.5; 23.5129694; 25.3673467; 80; 24.3194298; 25.3673467; 80; 39.15; 97.5; 23.5129694; 69.6708819; 80; 24.3194298; 69.6716231; 80; 
19; 39.15; 35.5; 27.500549; 25.3673467; 80; 28.4437775; 25.3673467; 80; 39.15; 97.5; 27.500549; 69.6708819; 80; 28.4437775; 69.6716157; 80; 
20; 39.15; 35.5; 27.500549; 25.3673467; 80; 28.4437775; 25.7467581; 80; 39.15; 97.5; 27.500549; 69.6708819; 80; 28.4437775; 69.6708819; 80; 
21; 39.15; 35.5; 27.500549; 25.3673467; 80; 28.4437775; 25.7429732; 80; 39.15; 97.5; 27.500549; 69.6708819; 80; 28.4437775; 69.6708819; 80; 
22; 39.15; 35.5; 27.500549; 25.3673467; 80; 28.4437775; 25.3673467; 80; 39.15; 97.5; 27.500549; 69.6708819; 80; 28.4437775; 69.6708819; 80; 
23; 39.15; 35.5; 27.500549; 25.3673467; 80; 28.4437775; 25.3673467; 80; 39.15; 97.5; 27.500549; 69.6708819; 80; 28.4437775; 69.6716319; 80; 
24; 39.15; 35.5; 27.500549; 25.3673467; 80; 28.4437775; 25.3673467; 80; 39.15; 97.5; 27.500549; 69.6708819; 80; 28.4437775; 69.6716244; 80; 
25; 254.524472; 35.5; 35.6196141; 25.3673467; 80; 33.9579737; 25.3673467; 80; 254.524472; 97.5; 35.6196141; 69.6708819; 80; 33.9579737; 69.6708819; 80; 
26; 217.618424; 35.5; 35.6196141; 25.3673467; 80; 33.9579737; 25.3673467; 80; 217.618424; 97.5; 35.6196141; 69.6708819; 80; 33.9579737; 69.6708819; 80; 
27; 254.524472; 35.5; 35.6196141; 25.3673467; 80; 33.9579737; 25.3673467; 80; 254.524472; 97.5; 35.6196141; 69.6708819; 80; 33.9579737; 69.6708819; 80; 
28; 254.524472; 35.5; 35.6196141; 25.3673467; 80; 33.9579737; 25.3673467; 80; 254.524472; 97.5; 35.6196141; 69.6708819; 80; 33.9579737; 69.6708819; 80; 
29; 254.524472; 35.5; 21.0075557; 25.3673467; 80; 21.6025688; 25.3673467; 80; 254.524472; 97.5; 21.0075557; 69.6708819; 80; 21.6025688; 69.6708819; 80; 
30; 25.0546106; 35.5; 21.0075557; 25.3673467; 80; 21.6025688; 25.3673467; 80; 25.0546106; 97.5; 21.0075557; 69.6708819; 80; 21.6025688; 69.6708819; 80; 
31; 25.0546106; 35.5; 21.0075557; 25.3673467; 80; 21.6025688; 25.5558044; 80; 25.0546106; 97.5; 21.0075557; 69.6708819; 80; 21.6025688; 69.6708819; 80; 
32; 25.0546106; 35.5; 21.0075557; 25.3673467; 80; 21.6025688; 25.5539244; 80; 25.0546106; 97.5; 21.0075557; 69.6708819; 80; 21.6025688; 69.6719286; 80; 
33; 25.0546106; 35.5; 21.0075557; 25.3673467; 80; 21.6025688; 25.3673467; 80; 25.0546106; 97.5; 21.0075557; 69.6708819; 80; 21.6025688; 69.6719182; 80; 
34; 25.0546106; 35.5; 21.0075557; 25.3673467; 80; 21.6025688; 25.3673467; 80; 25.0546106; 97.5; 21.0075557; 69.6708819; 80; 21.6025688; 69.6714788; 80; 
35; 25.0546106; 35.5; 21.0075557; 25.3673467; 80; 21.6025688; 26.0454275; 80; 25.0546106; 97.5; 21.0075557; 69.6708819; 80; 21.6025688; 69.6727031; 80; 
36; 25.0546106; 35.5; 21.0075557; 25.3673467; 80; 21.6025688; 26.299397; 80; 25.0546106; 97.5; 21.0075557; 69.6708819; 80; 21.6025688; 69.6720999; 80; 
37; 29.3036381; 35.5; 24.5702406; 25.3673467; 80; 25.2661623; 25.6254796; 80; 29.3036381; 97.5; 24.5702406; 69.6708819; 80; 25.2661623; 69.671138; 80; 
38; 29.3036381; 35.5; 24.5702406; 25.3673467; 80; 25.2661623; 25.9089727; 80; 29.3036381; 97.5; 24.5702406; 69.6708819; 80; 25.2661623; 69.6712747; 80; 
39; 29.3036381; 35.5; 24.5702406; 25.3673467; 80; 25.2661623; 25.9035695; 80; 29.3036381; 97.5; 24.5702406; 69.6708819; 80; 25.2661623; 69.6710198; 80; 
40; 29.3036381; 35.5; 24.5702406; 25.3673467; 80; 25.2661623; 25.3673467; 80; 29.3036381; 97.5; 24.5702406; 69.6708819; 80; 25.2661623; 69.6708819; 80; 
41; 29.3036381; 35.5; 24.5702406; 25.3673467; 80; 25.2661623; 25.3673467; 80; 29.3036381; 97.5; 24.5702406; 69.6708819; 80; 25.2661623; 69.6708819; 80; 
42; 29.3036381; 35.5; 24.5702406; 25.3673467; 80; 25.2661623; 26.5088844; 80; 29.3036381; 97.5; 24.5702406; 69.6708819; 80; 25.2661623; 69.6713549; 80; 
43; 29.3036381; 35.5; 24.5702406; 29.1506497; 80; 21.6025688; 29.4391589; 80; 29.3036381; 97.5; 24.5702406; 69.6708819; 80; 21.6025688; 69.6721179; 80; 
44; 29.3036381; 35.5; 21.0075557; 29.1129079; 80; 21.6025688; 30.0047452; 80; 29.3036381; 97.5; 21.0075557; 69.6708819; 80; 21.6025688; 69.6752493; 80; 
45; 6.57414859; 35.5; 24.5702406; 26.2349851; 80; 25.2661623; 27.0752193; 80; 6.57414859; 97.5; 24.5702406; 104.44341; 80; 25.2661623; 104.378555; 79.9963036; 
46; 5.47; 35.5; 9.14477258; 31.049128; 80; 7.63877129; 27.4190359; 80; 5.47; 97.5; 9.14477258; 104.096523; 80; 7.63877129; 108.639753; 80; 
47; 5.47; 35.5; 10.6956404; 40.0231101; 80; 7.63877129; 37.4002779; 80; 5.47; 97.5; 10.6956404; 97.2429732; 80; 7.63877129; 99.6225499; 79.9990952; 
48; 5.47; 35.5; 9.14477258; 40.2415752; 80; 7.63877129; 39.4396465; 80; 5.47; 97.5; 9.14477258; 107.50603; 80; 7.63877129; 107.179666; 80; 
49; 5.47; 35.5; 10.6956404; 35.5000005; 75; 8.93423543; 39.1821744; 75.3087739; 5.47; 97.5; 10.6956404; 115.928712; 75; 8.93423543; 113.458961; 75; 
50; 5.47; 35.5; 9.14477258; 45.5452515; 75; 8.93423543; 48.2397929; 75; 5.47; 97.5; 9.14477258; 137.277926; 75; 8.93423543; 134.580574; 75; 
51; 5.47; 35.5; 5.47; 52.0262785; 75; 5.47; 50.1281507; 75.051491; 5.47; 97.5; 5.47; 133.597633; 75; 5.47; 135.098856; 75; 
52; 5.47; 35.5; 5.47; 48.6014903; 75; 5.47; 48.6265593; 75; 5.47; 97.5; 5.47; 133.578615; 75; 5.47; 133.514047; 75.0008057; 
53; 5.47; 35.5; 5.47; 48.6073226; 75; 5.47; 48.32365; 75.2060452; 5.47; 97.5; 5.47; 133.593942; 75; 5.47; 133.531096; 75; 
54; 5.47; 35.5; 5.47; 48.6085194; 75; 5.47; 48.4044456; 75; 5.47; 97.5; 5.47; 133.596479; 75; 5.47; 133.536308; 75; 
55; 5.47; 35.5; 5.47; 48.6075066; 75; 5.47; 48.4683009; 75.2103032; 5.47; 97.5; 5.47; 133.592967; 75; 5.47; 133.532886; 75; 
56; 5.47; 35.5; 5.47; 48.6048192; 75; 5.47; 48.4366076; 75; 5.47; 97.5; 5.47; 133.58493; 75; 5.47; 133.525348; 75; 
57; 5.47; 35.5; 5.47; 48.6008777; 75; 5.47; 48.6566887; 75; 5.47; 97.5; 5.47; 133.573424; 75; 5.47; 133.512926; 75; 
58; 5.47; 35.5; 5.47; 48.5958264; 75; 5.47; 48.3762035; 75; 5.47; 97.5; 5.47; 133.558874; 75; 5.47; 133.499445; 75; 
59; 5.47; 35.5; 5.47; 48.5897519; 75; 5.47; 48.6194453; 75; 5.47; 97.5; 5.47; 133.54152; 75; 5.47; 133.483846; 75; 
60; 5.47; 35.5; 5.47; 48.5826987; 75; 5.47; 48.8124592; 75; 5.47; 97.5; 5.47; 133.521482; 75; 5.47; 133.463612; 75; 
61; 5.47; 35.5; 8.72495691; 48.5746915; 75; 9.17666667; 48.6827027; 75; 5.47; 97.5; 8.72495691; 133.49883; 75; 9.17666667; 133.44138; 75; 
62; 5.47; 35.5; 8.72495691; 48.5657453; 75; 9.17666667; 48.1310989; 75.0924388; 5.47; 97.5; 8.72495691; 133.473603; 75; 9.17666667; 133.415415; 75.0004464; 
63; 6.39766082; 35.5; 8.72495691; 48.5558711; 75; 9.17666667; 48.3366169; 75; 6.39766082; 97.5; 8.72495691; 133.445832; 75; 9.17666667; 133.387793; 75; 
64; 6.39766082; 35.5; 8.72495691; 48.5450773; 75; 9.17666667; 48.44688; 75.0277353; 6.39766082; 97.5; 8.72495691; 133.41554; 75; 9.17666667; 133.357949; 75; 
65; 6.39766082; 35.5; 8.72495691; 48.5333715; 75; 9.17666667; 48.4083761; 75; 6.39766082; 97.5; 8.72495691; 133.382749; 75; 9.17666667; 133.32644; 75; 
66; 6.39766082; 35.5; 8.72495691; 48.520761; 75; 9.17666667; 48.7909838; 75.0107075; 6.39766082; 97.5; 8.72495691; 133.347477; 75; 9.17666667; 133.292396; 75; 
67; 6.39766082; 35.5; 8.72495691; 48.5072524; 75; 9.17666667; 47.6576322; 75.0880108; 6.39766082; 97.5; 8.72495691; 133.309743; 75; 9.17666667; 133.254229; 75; 
68; 6.39766082; 35.5; 8.72495691; 48.4928525; 75; 9.17666667; 48.0594078; 75; 6.39766082; 97.5; 8.72495691; 133.269566; 75; 9.17666667; 133.214913; 75; 
69; 6.39766082; 35.5; 8.72495691; 48.4775678; 75; 9.17666667; 48.8044044; 75; 6.39766082; 97.5; 8.72495691; 133.226964; 75; 9.17666667; 133.172967; 75; 
70; 5.47; 35.5; 7.45983816; 48.4614048; 75; 7.84605; 48.1464817; 75; 5.47; 97.5; 7.45983816; 133.181954; 75; 7.84605; 133.12817; 75; 
71; 5.47; 35.5; 7.45983816; 48.4443701; 75; 7.84605; 48.4148574; 75; 5.47; 97.5; 7.45983816; 133.134555; 75; 7.84605; 133.081162; 75; 
72; 5.47; 35.5; 7.45983816; 48.42647; 75; 7.84605; 48.6542845; 75; 5.47; 97.5; 7.45983816; 133.084783; 75; 7.84605; 133.031779; 75; 
73; 5.47; 35.5; 7.45983816; 48.4077108; 75; 7.84605; 48.3181801; 75.1649964; 5.47; 97.5; 7.45983816; 133.032656; 75; 7.84605; 132.980038; 75; 
74; 5.47; 35.5; 7.45983816; 48.3880989; 75; 7.84605; 48.306281; 75; 5.47; 97.5; 7.45983816; 132.978191; 75; 7.84605; 132.925956; 75; 
75; 5.47; 35.5; 7.45983816; 48.3676405; 75; 7.84605; 48.3137415; 75.1787623; 5.47; 97.5; 7.45983816; 132.921406; 75; 7.84605; 132.868784; 75.0000698; 
76; 5.47; 35.5; 7.45983816; 48.3463418; 75; 7.84605; 47.8656521; 75.4346535; 5.47; 97.5; 7.45983816; 132.862318; 75; 7.84605; 132.810353; 75; 
77; 10.1652712; 35.5; 8.72495691; 48.324209; 75; 11.2932; 46.5897461; 76.5141394; 10.1652712; 97.5; 8.72495691; 131.257215; 75.5958837; 11.2932; 132.741317; 75.0033935; 
78; 17.3550271; 35.5; 15.7493036; 36.7826569; 80; 14.59; 36.326823; 80; 17.3550271; 97.5; 15.7493036; 103.818728; 80; 14.59; 119.543506; 80; 
79; 17.3550271; 35.5; 15.7493036; 25.3673467; 80; 14.59; 31.1203348; 77.8026528; 17.3550271; 97.5; 15.7493036; 99.3571736; 80; 14.59; 106.654873; 80; 
80; 17.3550271; 35.5; 15.7493036; 25.3673467; 80; 14.59; 44.9315299; 75; 17.3550271; 97.5; 15.7493036; 111.813163; 80; 14.59; 88.1399943; 80; 
81; 17.3550271; 35.5; 15.7493036; 25.3673467; 80; 14.59; 42.066938; 75; 17.3550271; 97.5; 15.7493036; 86.4536924; 75; 14.59; 69.6778243; 76.3223416; 
82; 17.3550271; 35.5; 15.7493036; 40.5774556; 75; 14.59; 32.3449073; 75; 17.3550271; 97.5; 15.7493036; 82.3526317; 75; 14.59; 91.354228; 75; 
83; 16; 35.5; 13.4656546; 51.6872736; 75; 12.47445; 40.9782581; 75; 16; 97.5; 13.4656546; 103.387401; 75; 12.47445; 113.456791; 75; 
84; 14.8385482; 35.5; 15.7493036; 48.5553695; 75; 14.59; 46.5097229; 75; 14.8385482; 97.5; 15.7493036; 132.395303; 75; 14.59; 133.544101; 75; 
85; 14.8385482; 35.5; 13.4656546; 48.7852533; 75; 14.59; 48.8345088; 75; 14.8385482; 97.5; 13.4656546; 143.511613; 75; 14.59; 142.565509; 75; 
86; 14.8385482; 35.5; 15.7493036; 48.2405862; 75; 14.59; 48.0943135; 75; 14.8385482; 97.5; 15.7493036; 133.326852; 75; 14.59; 132.401094; 75; 
87; 14.8385482; 35.5; 15.7493036; 43.5003545; 80; 14.59; 37.7104785; 75; 14.8385482; 97.5; 15.7493036; 125.657729; 75; 14.59; 122.993311; 78.6049751; 
88; 14.8385482; 35.5; 15.7493036; 38.8292784; 80; 14.59; 28.6985371; 76.7061128; 14.8385482; 97.5; 15.7493036; 102.682492; 80; 14.59; 109.214836; 75; 
89; 14.8385482; 35.5; 13.4656546; 38.8660509; 80; 14.59; 39.4747183; 75; 14.8385482; 97.5; 13.4656546; 78.0413322; 80; 14.59; 88.9311951; 75; 
90; 14.8385482; 35.5; 15.7493036; 38.9171335; 80; 14.59; 39.7260303; 75; 14.8385482; 97.5; 15.7493036; 93.2331269; 80; 14.59; 71.7777428; 80; 
91; 17.3550271; 35.5; 15.7493036; 32.1211302; 80; 14.59; 26.7211856; 80; 17.3550271; 97.5; 15.7493036; 92.9980726; 80; 14.59; 73.5679027; 77.5924225; 
92; 17.3550271; 35.5; 15.7493036; 25.3673467; 80; 14.59; 28.255215; 75.726254; 17.3550271; 97.5; 15.7493036; 98.1582198; 80; 14.59; 114.979162; 77.5720018; 
93; 17.3550271; 35.5; 15.7493036; 36.910684; 80; 14.59; 29.128277; 80; 17.3550271; 97.5; 15.7493036; 97.8740333; 80; 14.59; 111.621905; 80; 
94; 17.3550271; 35.5; 15.7493036; 38.0866138; 80; 14.59; 27.1892777; 80; 17.3550271; 97.5; 15.7493036; 69.6708819; 80; 14.59; 70.2995181; 75.8818834; 
95; 17.3550271; 35.5; 15.7493036; 26.6455518; 80; 14.59; 26.0134682; 80; 17.3550271; 97.5; 15.7493036; 69.6708819; 80; 14.59; 69.705873; 80; 
96; 17.3550271; 35.5; 26.11; 36.7262219; 80; 32.92; 28.9984867; 80; 17.3550271; 97.5; 26.11; 102.909318; 80; 32.92; 111.440253; 75; 
