Iterations; CPUmaster; CPUsubproblem; CPUsolveSub; CPUgenerateCuts; CPUfeasPt; Buses; AcceptGap; CoopPotentialPercent; SpeedupVsL1
47; 1.36590695; 2.89309096; 2.51848602; 0.374240994; 0.629064023; 1; 0.0001; 98.9322224; 2.145999986
72; 2.79588509; 8.93315506; 7.78922987; 1.14336002; 0.904564977; 2; 0.0001; 99.7370403; 6.146176314
126; 6.52154303; 23.8848763; 20.8981514; 2.98556805; 2.23828506; 3; 0.0001; 99.534255; 15.50859842
161; 10.80867; 41.7406731; 36.6496544; 5.08947992; 2.61206794; 4; 0.0001; 99.7247501; 31.20701025