t; nomPriceB5; nomPlPowB5; integrPriceB5; integrPlPowB5; integrT_in_B5; disagg_price_bus5; PlPowB5; disaggT_in_B5;  initFeasThres; finalFeasThres; accept_gap; iterations; CPUmaster; CPUsubproblem; CPUsubsolve; CPUsubcutgen; CPUfeasPt; finalDetectGap; nomCongestionCost; intCongestionCost; disaggCongestionCost; Objective; nomImprovPercent; CoopPotentialPercent; nominalCost; integratedCost
1; 13.32; 71; 10.52; 60.8165523; 80; 10.52; 60.8165523; 80; 142; 142; 0.0001; 34; 1.47981596; 4.43262291; 3.85980201; 0.572498977; 0.643822014; 8.08771406e-05; 232380.919; 34199.6176; 33169.1085; 1816334.01; 15.1727714; 99.9732492; 2141215.78; 1816247.08
2; 13.32; 71; 16.6088889; 66.0938793; 80; 14.72; 63.2321401; 80; 
3; 13.32; 71; 16.6088889; 65.9406578; 80; 14.72; 63.1081966; 80; 
4; 13.32; 71; 16.6088889; 51.4260892; 80; 14.72; 50.7354158; 80; 
5; 13.32; 71; 16.6088889; 65.6566306; 80; 14.72; 68.4908327; 80; 
6; 13.32; 71; 16.6088889; 81.4352202; 80; 14.72; 81.4349774; 80; 
7; 13.32; 71; 16.6088889; 68.8543434; 80; 14.72; 65.4050087; 80; 
8; 13.32; 71; 16.6088889; 69.4629257; 80; 14.72; 69.4626828; 80; 
9; 13.32; 71; 16.6088889; 67.6292688; 80; 23.22; 67.6292713; 80; 
10; 13.32; 71; 16.6088889; 50.7346935; 80; 23.22; 50.7346935; 80; 
11; 39.15; 71; 30.1; 50.7346935; 80; 30.1; 50.7346935; 80; 
12; 39.15; 71; 30.1; 50.7346935; 80; 30.1; 50.7346935; 80; 
13; 39.15; 71; 30.1; 50.7346935; 80; 30.1; 50.7346935; 80; 
14; 39.15; 71; 30.1; 50.7346935; 80; 30.1; 50.7346935; 80; 
15; 36.65; 71; 30.1; 50.7346935; 80; 30.1; 50.7346935; 80; 
16; 39.15; 71; 30.1; 50.7346935; 80; 30.1; 50.7346935; 80; 
17; 39.15; 71; 30.1; 50.7346935; 80; 30.1; 50.7346935; 80; 
18; 39.15; 71; 30.1; 50.7346935; 80; 30.1; 50.7346935; 80; 
19; 39.15; 71; 30.1; 50.7346935; 80; 30.1; 50.7346935; 80; 
20; 39.15; 71; 30.1; 50.7346935; 80; 30.1; 50.7346935; 80; 
21; 39.15; 71; 30.1; 50.7346935; 80; 30.1; 50.7346935; 80; 
22; 39.15; 71; 30.1; 50.7346935; 80; 30.1; 50.7346935; 80; 
23; 39.15; 71; 30.1; 50.7346935; 80; 30.1; 50.7346935; 80; 
24; 39.15; 71; 30.1; 50.7346935; 80; 30.1; 50.7346935; 80; 
25; 255.566746; 71; 47.6610347; 50.7346935; 80; 46.3580162; 50.7346935; 80; 
26; 255.566746; 71; 47.6610347; 50.7346935; 80; 46.3580162; 50.7346935; 80; 
27; 255.566746; 71; 47.6610347; 50.7346935; 80; 46.3580162; 50.7346935; 80; 
28; 218.509568; 71; 47.6610347; 50.7346935; 80; 46.3580162; 50.7346935; 80; 
29; 255.566746; 71; 21.6940825; 50.7346935; 80; 21.468566; 50.7346935; 80; 
30; 25.0072091; 71; 21.6940825; 50.7346935; 80; 21.468566; 50.7346935; 80; 
31; 25.0072091; 71; 21.6940825; 50.7346935; 80; 21.468566; 50.7346935; 80; 
32; 25.0072091; 71; 21.6940825; 50.7346935; 80; 21.468566; 50.7346935; 80; 
33; 25.0072091; 71; 21.6940825; 50.7346935; 80; 21.468566; 50.7346935; 80; 
34; 25.0072091; 71; 21.6940825; 50.7346935; 80; 21.468566; 50.7346935; 80; 
35; 25.0072091; 71; 21.6940825; 50.7346935; 80; 21.468566; 50.7346935; 80; 
36; 25.0072091; 71; 21.6940825; 50.7346935; 80; 21.468566; 50.7346935; 80; 
37; 29.2481977; 71; 25.3731959; 50.7346935; 80; 25.109434; 50.7346935; 80; 
38; 29.2481977; 71; 25.3731959; 50.7346935; 80; 25.109434; 50.7346935; 80; 
39; 29.2481977; 71; 25.3731959; 50.7346935; 80; 25.109434; 50.7346935; 80; 
40; 29.2481977; 71; 25.3731959; 50.7346935; 80; 25.109434; 54.4109516; 80; 
41; 29.2481977; 71; 25.3731959; 50.7346935; 80; 25.109434; 54.3742777; 80; 
42; 29.2481977; 71; 25.3731959; 50.7346935; 80; 25.109434; 50.7346935; 80; 
43; 29.2481977; 71; 25.3731959; 50.7346935; 80; 25.109434; 50.8291769; 80; 
44; 29.2481977; 71; 13.6480111; 51.565733; 80; 15.2522437; 52.6930196; 80; 
45; 6.30720906; 71; 15.9625861; 67.4119288; 80; 17.8388815; 72.9329503; 80; 
46; 5.47; 71; 13.6480111; 79.006082; 80; 15.2522437; 82.5019588; 80; 
47; 5.47; 71; 13.6480111; 79.649995; 80; 17.8388815; 83.1461147; 77.5223102; 
48; 5.47; 71; 13.6480111; 89.4180393; 75.5356706; 17.8388815; 95.2169806; 75; 
49; 5.47; 71; 15.9625861; 96.340589; 75; 5.47; 97.6952324; 75.1773953; 
50; 5.47; 71; 5.47; 97.4111221; 75; 5.47; 97.3442198; 75.1752945; 
51; 5.47; 71; 5.47; 97.4348965; 75; 5.47; 97.358135; 75; 
52; 5.47; 71; 5.47; 97.4447693; 75; 5.47; 97.3603017; 75.3545897; 
53; 5.47; 71; 5.47; 97.4452702; 75; 5.47; 97.3567219; 75.183747; 
54; 5.47; 71; 5.47; 97.4407701; 75; 5.47; 97.3494615; 75; 
55; 5.47; 71; 5.47; 97.4329806; 75; 5.47; 97.3393872; 75; 
56; 5.47; 71; 5.47; 97.4225602; 75; 5.47; 97.3269837; 75.0381654; 
57; 5.47; 71; 5.47; 97.4099028; 75; 5.47; 97.3124919; 75.3696433; 
58; 5.47; 71; 5.47; 97.395201; 75; 5.47; 97.2960321; 75.0763766; 
59; 5.47; 71; 5.47; 97.3785527; 75; 5.47; 97.2776684; 75.1135127; 
60; 5.47; 71; 5.47; 97.3600111; 75; 5.47; 97.257438; 75.2517399; 
61; 5.47; 71; 5.47; 97.3396086; 75; 5.47; 97.2353656; 75.0831279; 
62; 5.47; 71; 5.47; 97.3173673; 75; 5.47; 97.2114698; 75; 
63; 5.47; 71; 6.565; 97.2933049; 75; 6.39766082; 97.1857664; 75; 
64; 5.47; 71; 6.565; 97.2674366; 75; 6.39766082; 97.1582699; 75; 
65; 6.39766082; 71; 6.565; 97.2397765; 75; 6.39766082; 97.1289939; 75; 
66; 6.39766082; 71; 6.565; 97.2103383; 75; 6.39766082; 97.0979517; 75; 
67; 6.39766082; 71; 6.565; 97.1791352; 75; 6.39766082; 97.0651564; 75.2483372; 
68; 5.47; 71; 6.565; 97.1461801; 75; 6.39766082; 97.0306209; 75.3788167; 
69; 5.47; 71; 6.565; 97.111486; 75; 6.39766082; 96.9943581; 75; 
70; 5.47; 71; 5.613075; 97.0750657; 75; 5.47; 96.9563805; 75.2404412; 
71; 5.47; 71; 5.613075; 97.0369319; 75; 5.47; 96.9167008; 75.1643672; 
72; 5.47; 71; 5.613075; 96.9970971; 75; 5.47; 96.8753315; 75; 
73; 5.47; 71; 5.613075; 96.9555738; 75; 5.47; 96.7588782; 75; 
74; 5.47; 71; 5.613075; 96.9123744; 75; 5.47; 96.7487995; 75.368232; 
75; 5.47; 71; 5.613075; 96.8675111; 75; 5.47; 96.7745822; 75.1565237; 
76; 5.47; 71; 5.613075; 96.8209963; 75; 5.47; 96.6928291; 75; 
77; 8.07204466; 71; 15.213475; 84.3291274; 80; 16; 84.4238474; 80; 
78; 17.3550271; 71; 16; 61.3066776; 80; 16; 61.4639419; 80; 
79; 17.3550271; 71; 16; 50.7346935; 80; 16; 50.7765034; 80; 
80; 17.3550271; 71; 16; 50.7346935; 80; 16; 50.7760863; 80; 
81; 17.3550271; 71; 16; 50.7346935; 80; 16; 50.7346935; 80; 
82; 17.3550271; 71; 16; 53.6624486; 77.4395459; 16; 50.7752978; 78.7201101; 
83; 16; 71; 16; 62.8958798; 75; 16; 61.0919773; 75; 
84; 14.8385482; 71; 13.68; 88.8636214; 75; 14.3970175; 87.0597188; 75; 
85; 14.8385482; 71; 16; 105.386494; 75; 16; 103.582591; 75; 
86; 14.8385482; 71; 13.68; 99.4670376; 75; 13.68; 100.42536; 75; 
87; 14.8385482; 71; 15.88; 94.242701; 75; 16; 92.4387984; 75; 
88; 14.8385482; 71; 13.68; 83.3441524; 80; 13.8946784; 81.5402499; 75; 
89; 14.8385482; 71; 16; 68.2233762; 80; 16; 66.4194736; 80; 
90; 14.8385482; 71; 13.68; 63.6228033; 80; 13.68; 61.7241808; 75; 
91; 17.3550271; 71; 16; 58.0827972; 80; 16; 57.9089802; 80; 
92; 17.3550271; 71; 16; 53.2177162; 80; 14.9483041; 51.3190937; 80; 
93; 17.3550271; 71; 16; 53.1929458; 80; 16; 51.3132638; 78.4126556; 
94; 17.3550271; 71; 16; 50.7346935; 80; 16; 50.7346935; 80; 
95; 17.3550271; 71; 16; 50.7346935; 80; 16; 50.7346935; 78.8963595; 
96; 17.3550271; 71; 25.4; 81.1549111; 77.2217754; 25.4; 81.1549111; 75; 
