t; nomPriceB7; nomPlPowB7; integrPriceB7; integrPlPowB7; integrT_in_B7; disagg_price_bus7; PlPowB7; disaggT_in_B7; nomPriceB6; nomPlPowB6; integrPriceB6; integrPlPowB6; integrT_in_B6; disagg_price_bus6; PlPowB6; disaggT_in_B6;  initFeasThres; finalFeasThres; accept_gap; iterations; CPUmaster; CPUsubproblem; CPUfeasPt; finalDetectGap; nomCongestionCost; intCongestionCost; disaggCongestionCost; Objective; nomImprovPercent; CoopPotentialPercent; nominalCost; integratedCost
1; 13.32; 62.5; 13.32; 53.5356974; 80; 13.32; 53.5356974; 80; 13.32; 68; 13.32; 58.2468388; 80; 13.32; 58.2468388; 80; 130.5; 9.25374729; 0.0001; 960; 62.2932396; 61.2611288; 0.434706561; 8.75797203e-05; 238018.068; 38663.9828; 37680.9989; 1817799.46; 15.505891; 99.9553849; 2151391.95; 1817650.56
2; 13.32; 62.5; 13.32; 53.1399181; 80; 13.32; 52.9431317; 80; 13.32; 68; 13.32; 48.590974; 80; 13.32; 48.7863923; 80; 
3; 13.32; 62.5; 16.3239513; 53.0553316; 80; 16.67; 57.2669153; 80; 13.32; 68; 16.3239513; 48.590974; 80; 16.67; 49.3959076; 80; 
4; 13.32; 62.5; 16.3239513; 44.6608217; 80; 16.67; 52.0008778; 80; 13.32; 68; 16.3239513; 48.590974; 80; 16.67; 51.6097798; 80; 
5; 13.32; 62.5; 16.3239513; 49.6301066; 80; 16.67; 56.94629; 80; 13.32; 68; 16.3239513; 48.590974; 80; 16.67; 51.1214884; 80; 
6; 13.32; 62.5; 16.3239513; 61.6517954; 80; 16.67; 61.7844418; 80; 13.32; 68; 16.3239513; 58.3441357; 80; 16.67; 48.8935052; 80; 
7; 13.32; 62.5; 16.3239513; 57.7130495; 80; 16.67; 54.2410591; 80; 13.32; 68; 16.3239513; 58.2468393; 80; 16.67; 48.7521396; 80; 
8; 13.32; 62.5; 16.3239513; 61.9571475; 80; 16.67; 47.4909939; 80; 13.32; 68; 16.3239513; 48.590974; 80; 16.67; 63.531609; 80; 
9; 13.32; 62.5; 16.3239513; 60.7050788; 80; 16.67; 45.880548; 80; 13.32; 68; 16.3239513; 48.590974; 80; 16.67; 63.3825629; 80; 
10; 14.9866667; 62.5; 19.0923407; 44.6608217; 80; 16.67; 45.1355357; 80; 14.9866667; 68; 19.0923407; 48.590974; 80; 16.67; 48.590974; 80; 
11; 38.7333333; 62.5; 30.1; 44.6608217; 80; 30.1; 44.9719255; 80; 38.7333333; 68; 30.1; 48.590974; 80; 30.1; 48.590974; 80; 
12; 38.7333333; 62.5; 30.1; 44.6608217; 80; 30.1; 44.6608217; 80; 38.7333333; 68; 30.1; 48.590974; 80; 30.1; 48.590974; 80; 
13; 38.7333333; 62.5; 30.1; 44.6608217; 80; 30.1; 44.6608217; 80; 38.7333333; 68; 30.1; 48.590974; 80; 30.1; 48.590974; 80; 
14; 38.7333333; 62.5; 30.1; 44.6608217; 80; 30.1; 44.6608217; 80; 38.7333333; 68; 30.1; 48.590974; 80; 30.1; 48.590974; 80; 
15; 20.7; 62.5; 30.1; 44.6608217; 80; 30.1; 44.6608217; 80; 38.7333333; 68; 30.1; 48.590974; 80; 30.1; 48.590974; 80; 
16; 20.7; 62.5; 20.7; 44.6608217; 80; 20.7; 44.6608217; 80; 38.7333333; 68; 30.1; 48.590974; 80; 30.1; 48.590974; 80; 
17; 20.7; 62.5; 20.7; 44.6608217; 80; 20.7; 44.6608217; 80; 38.7333333; 68; 30.1; 48.590974; 80; 30.1; 48.590974; 80; 
18; 20.7; 62.5; 20.7; 44.6608217; 80; 20.7; 46.0990149; 80; 38.7333333; 68; 30.1; 48.590974; 80; 30.1; 48.590974; 80; 
19; 20.7; 62.5; 20.7; 44.6608217; 80; 20.7; 46.0846677; 80; 38.7333333; 68; 30.1; 48.590974; 80; 30.1; 48.590974; 80; 
20; 20.7; 62.5; 20.7; 44.6608217; 80; 20.7; 44.6608217; 80; 38.7333333; 68; 30.1; 48.590974; 80; 30.1; 48.590974; 80; 
21; 20.7; 62.5; 20.7; 44.6608217; 80; 20.7; 45.1071497; 80; 38.7333333; 68; 30.1; 48.590974; 80; 30.1; 48.590974; 80; 
22; 20.7; 62.5; 20.7; 44.6608217; 80; 20.7; 45.1026972; 80; 38.7333333; 68; 30.1; 48.590974; 80; 30.1; 48.590974; 80; 
23; 20.7; 62.5; 20.7; 44.6608217; 80; 20.7; 45.9544428; 80; 38.7333333; 68; 30.1; 48.590974; 80; 30.1; 48.590974; 80; 
24; 20.7; 62.5; 20.7; 44.6608217; 80; 20.7; 45.9415378; 80; 38.7333333; 68; 30.1; 48.590974; 80; 30.1; 48.590974; 80; 
25; 20.7; 62.5; 20.7; 44.6608217; 80; 20.7; 44.9541872; 80; 254.927478; 68; 54.7842611; 48.590974; 80; 53.3799984; 48.590974; 80; 
26; 20.7; 62.5; 20.7; 44.6608217; 80; 20.7; 44.9512606; 80; 254.927478; 68; 54.7842611; 48.590974; 80; 53.3799984; 48.590974; 80; 
27; 20.7; 62.5; 20.7; 44.6608217; 80; 20.7; 45.4129128; 80; 254.927478; 68; 54.7842611; 48.590974; 80; 53.3799984; 48.590974; 80; 
28; 20.7; 62.5; 20.7; 44.6608217; 80; 20.7; 45.40541; 80; 254.927478; 68; 54.7842611; 48.590974; 80; 53.3799984; 48.590974; 80; 
29; 20.7; 62.5; 20.7; 44.6608217; 80; 20.7; 44.6608217; 80; 254.927478; 68; 20.7; 48.590974; 80; 20.7; 48.590974; 80; 
30; 20.7; 62.5; 20.7; 44.6608217; 80; 20.7; 44.6608217; 80; 25.0162612; 68; 20.7; 48.590974; 80; 20.7; 48.6185376; 80; 
31; 20.7; 62.5; 20.7; 44.6608217; 80; 20.7; 44.6608217; 80; 25.0162612; 68; 20.7; 48.590974; 80; 20.7; 48.6182626; 80; 
32; 25.0162612; 62.5; 20.7; 44.6608217; 80; 20.7; 45.0000841; 80; 25.0162612; 68; 20.7; 48.590974; 80; 20.7; 48.590974; 80; 
33; 25.0162612; 62.5; 20.7; 44.6608217; 80; 20.7; 44.9966997; 80; 25.0162612; 68; 20.7; 48.590974; 80; 20.7; 48.590974; 80; 
34; 25.0162612; 62.5; 20.7; 44.6608217; 80; 20.7; 46.4057992; 80; 25.0162612; 68; 20.7; 48.590974; 80; 20.7; 48.6517048; 80; 
35; 25.0162612; 62.5; 20.7; 44.6608217; 80; 20.7; 46.3883915; 80; 25.0162612; 68; 20.7; 48.590974; 80; 20.7; 48.6996197; 80; 
36; 25.0162612; 62.5; 20.7; 44.6608217; 80; 20.7; 44.6608217; 80; 25.0162612; 68; 20.7; 48.590974; 80; 20.7; 48.6390108; 80; 
37; 29.258785; 62.5; 24.2105263; 44.6608217; 80; 24.2105263; 44.6608217; 80; 29.258785; 68; 24.2105263; 48.590974; 80; 24.2105263; 48.590974; 80; 
38; 29.258785; 62.5; 24.2105263; 44.6608217; 80; 24.2105263; 44.6608217; 80; 29.258785; 68; 24.2105263; 48.590974; 80; 24.2105263; 48.6290368; 80; 
39; 29.258785; 62.5; 24.2105263; 44.6608217; 80; 24.2105263; 44.6608217; 80; 29.258785; 68; 24.2105263; 48.590974; 80; 24.2105263; 48.628657; 80; 
40; 29.258785; 62.5; 24.2105263; 44.6608217; 80; 24.2105263; 44.6608217; 80; 29.258785; 68; 24.2105263; 48.590974; 80; 24.2105263; 48.590974; 80; 
41; 29.258785; 62.5; 24.2105263; 44.6608217; 80; 24.2105263; 44.6608217; 80; 29.258785; 68; 24.2105263; 48.590974; 80; 24.2105263; 48.6530034; 80; 
42; 29.258785; 62.5; 24.2105263; 44.6608217; 80; 24.2105263; 44.6608217; 80; 29.258785; 68; 24.2105263; 48.590974; 80; 24.2105263; 48.6523846; 80; 
43; 29.258785; 62.5; 24.2105263; 44.6608217; 80; 17.9441085; 45.7031652; 80; 29.258785; 68; 24.2105263; 48.590974; 80; 17.9441085; 48.6527827; 80; 
44; 29.258785; 62.5; 20.7; 44.6608217; 80; 17.9441085; 45.6927669; 80; 29.258785; 68; 20.7; 48.590974; 80; 17.9441085; 48.7129701; 80; 
45; 6.79841422; 62.5; 24.2105263; 47.3690248; 80; 20.9872614; 48.8613948; 80; 6.79841422; 68; 24.2105263; 72.8162742; 80; 20.9872614; 72.8219022; 80; 
46; 5.47; 62.5; 9.710931; 52.2651622; 80; 17.9441085; 48.9700696; 80; 5.47; 68; 9.710931; 72.5746053; 80; 17.9441085; 75.2244968; 80; 
47; 5.47; 62.5; 11.357814; 69.2299843; 80; 20.9872614; 59.8758297; 80; 5.47; 68; 11.357814; 55.2914262; 80; 20.9872614; 67.8228204; 80; 
48; 5.47; 62.5; 11.357814; 64.1594667; 80; 7.32999375; 61.8302155; 80; 5.47; 68; 11.357814; 70.9384145; 80; 7.32999375; 74.3720504; 80; 
49; 5.47; 62.5; 9.710931; 65.6434135; 75; 8.57309211; 68.0593639; 77.7507743; 5.47; 68; 9.710931; 83.4730005; 75; 8.57309211; 82.1614348; 75; 
50; 5.47; 62.5; 9.710931; 88.4211029; 75; 8.57309211; 86.5579023; 75; 5.47; 68; 9.710931; 92.1379893; 75; 8.57309211; 95.1055747; 75; 
51; 5.47; 62.5; 5.47; 87.9970398; 75; 5.47; 86.0059905; 75; 5.47; 68; 5.47; 95.1055313; 75; 5.47; 93.26693; 75; 
52; 5.47; 62.5; 5.47; 85.6205953; 75; 5.47; 85.358927; 75.1956754; 5.47; 68; 5.47; 93.06369; 75; 5.47; 93.170247; 75.0188231; 
53; 5.47; 62.5; 5.47; 85.6304689; 75; 5.47; 84.8440349; 75.0721299; 5.47; 68; 5.47; 93.0750937; 75; 5.47; 93.1784518; 75.0003797; 
54; 5.47; 62.5; 5.47; 85.632148; 75; 5.47; 85.2924011; 75; 5.47; 68; 5.47; 93.0776381; 75; 5.47; 93.2154608; 75; 
55; 5.47; 62.5; 5.47; 85.6299476; 75; 5.47; 85.6912952; 75; 5.47; 68; 5.47; 93.0759435; 75; 5.47; 93.1972135; 75.0087045; 
56; 5.47; 62.5; 5.47; 85.6248419; 75; 5.47; 85.658541; 75; 5.47; 68; 5.47; 93.0710161; 75; 5.47; 93.1811719; 75; 
57; 5.47; 62.5; 5.47; 85.6175141; 75; 5.47; 85.7777767; 75; 5.47; 68; 5.47; 93.063695; 75; 5.47; 93.1935262; 75; 
58; 5.47; 62.5; 5.47; 85.6082351; 75; 5.47; 85.3851123; 75.185833; 5.47; 68; 5.47; 93.0542461; 75; 5.47; 93.1934652; 75; 
59; 5.47; 62.5; 5.47; 85.5971576; 75; 5.47; 85.3801259; 75; 5.47; 68; 5.47; 93.0428358; 75; 5.47; 93.161931; 75; 
60; 5.47; 62.5; 5.47; 85.58436; 75; 5.47; 85.3714436; 75.1836454; 5.47; 68; 5.47; 93.0295492; 75; 5.47; 93.1544707; 75; 
61; 5.47; 62.5; 8.79315789; 85.5698854; 75; 9.02197368; 85.3638423; 75; 5.47; 68; 8.79315789; 93.0144334; 75; 9.02197368; 93.1337016; 75; 
62; 5.47; 62.5; 8.79315789; 85.5537606; 75; 9.02197368; 85.0098417; 75.387651; 5.47; 68; 8.79315789; 92.9975176; 75; 9.02197368; 93.0657308; 75; 
63; 6.39766082; 62.5; 8.79315789; 85.5360045; 75; 9.02197368; 84.9727291; 75; 6.39766082; 68; 8.79315789; 92.9788222; 75; 9.02197368; 93.0893085; 75; 
64; 6.39766082; 62.5; 8.79315789; 85.5166322; 75; 9.02197368; 85.6123473; 75; 6.39766082; 68; 8.79315789; 92.958364; 75; 9.02197368; 93.0896371; 75; 
65; 6.39766082; 62.5; 8.79315789; 85.4956572; 75; 9.02197368; 85.1799515; 75; 6.39766082; 68; 8.79315789; 92.9361573; 75; 9.02197368; 93.0163962; 75; 
66; 6.39766082; 62.5; 8.79315789; 85.4730917; 75; 9.02197368; 85.3515884; 75; 6.39766082; 68; 8.79315789; 92.9122159; 75; 9.02197368; 93.0292708; 75; 
67; 6.39766082; 62.5; 8.79315789; 85.448948; 75; 9.02197368; 85.7695564; 75; 6.39766082; 68; 8.79315789; 92.8865527; 75; 9.02197368; 93.0283589; 75; 
68; 6.39766082; 62.5; 8.79315789; 85.4232376; 75; 9.02197368; 85.2361101; 75; 6.39766082; 68; 8.79315789; 92.8591806; 75; 9.02197368; 92.9687524; 75.0081841; 
69; 6.39766082; 62.5; 8.79315789; 85.3959722; 75; 9.02197368; 85.1017417; 75; 6.39766082; 68; 8.79315789; 92.8301123; 75; 9.02197368; 92.9349597; 75.0022472; 
70; 5.47; 62.5; 7.51815; 85.3671632; 75; 7.7137875; 85.4960463; 75; 5.47; 68; 7.51815; 92.7993601; 75; 7.7137875; 92.9181361; 75; 
71; 5.47; 62.5; 7.51815; 85.336822; 75; 7.7137875; 85.5730989; 75; 5.47; 68; 7.51815; 92.7669364; 75; 7.7137875; 92.8611269; 75.0153872; 
72; 5.47; 62.5; 7.51815; 85.3049597; 75; 7.7137875; 85.4266679; 75; 5.47; 68; 7.51815; 92.7328536; 75; 7.7137875; 92.8266391; 75; 
73; 5.47; 62.5; 7.51815; 85.2715875; 75; 7.7137875; 84.7370828; 75; 5.47; 68; 7.51815; 92.6971238; 75; 7.7137875; 92.7784645; 75; 
74; 5.47; 62.5; 7.51815; 85.2367166; 75; 7.7137875; 84.9509943; 75; 5.47; 68; 7.51815; 92.6597591; 75; 7.7137875; 92.7010816; 75; 
75; 5.47; 62.5; 7.51815; 85.2003579; 75; 7.7137875; 85.5917478; 75; 5.47; 68; 7.51815; 92.6207715; 75; 7.7137875; 92.7136851; 75; 
76; 5.47; 62.5; 7.51815; 85.1625224; 75; 7.7137875; 85.1771548; 75; 5.47; 68; 7.51815; 92.5801728; 75; 7.7137875; 92.71739; 75; 
77; 10.1652712; 62.5; 8.79315789; 85.1232208; 75; 11.0316454; 84.3089079; 75.5216046; 10.1652712; 68; 8.79315789; 92.537975; 75; 11.0316454; 92.6610962; 75; 
78; 17.3550271; 62.5; 16; 76.7757726; 80; 14.59; 65.8051349; 80; 17.3550271; 68; 16; 83.4564034; 80; 14.59; 70.6572538; 80; 
79; 17.3550271; 62.5; 16; 68.5524745; 80; 14.59; 70.7978557; 75; 17.3550271; 68; 16; 74.5100869; 80; 14.59; 48.8843081; 80; 
80; 17.3550271; 62.5; 16; 63.4940634; 80; 14.59; 70.4848054; 75; 17.3550271; 68; 16; 71.2502933; 80; 14.59; 63.1896603; 80; 
81; 17.3550271; 62.5; 13.68; 51.5284965; 75; 14.59; 46.3139293; 78.2260138; 17.3550271; 68; 13.68; 58.2468393; 75; 14.59; 63.0758178; 75.4193533; 
82; 17.3550271; 62.5; 16; 62.4974657; 75; 14.59; 50.219045; 76.1887086; 17.3550271; 68; 16; 58.3441357; 75; 14.59; 70.6774435; 75; 
83; 16; 62.5; 14.7876868; 76.8690052; 75; 14.59; 66.3433753; 75; 16; 68; 14.7876868; 75.7704372; 75; 14.59; 85.648592; 75; 
84; 14.8385482; 62.5; 16; 83.1173231; 75; 14.59; 84.6726353; 75; 14.8385482; 68; 16; 95.0746148; 75; 14.59; 91.4046599; 75; 
85; 14.8385482; 62.5; 13.68; 89.5113541; 75; 14.59; 89.528411; 75; 14.8385482; 68; 13.68; 99.4057875; 75; 14.59; 97.8921212; 75; 
86; 14.8385482; 62.5; 14.1431579; 85.7095436; 75; 14.59; 84.3105798; 75; 14.8385482; 68; 14.1431579; 92.2899855; 75; 14.59; 92.2096965; 75; 
87; 14.8385482; 62.5; 13.68; 78.685974; 75; 14.59; 65.0725338; 75; 14.8385482; 68; 13.68; 80.0727737; 75; 14.59; 92.2190462; 75; 
88; 14.8385482; 62.5; 14.7068421; 59.2236229; 80; 14.59; 52.3719481; 80; 14.8385482; 68; 14.7068421; 76.7302677; 80; 14.59; 82.1147748; 75; 
89; 14.8385482; 62.5; 13.68; 47.3925161; 80; 14.59; 71.871586; 75; 14.8385482; 68; 13.68; 66.8900138; 80; 14.59; 60.3978766; 75.2868084; 
90; 14.8385482; 62.5; 16; 50.6633303; 80; 14.59; 69.9977384; 75; 14.8385482; 68; 16; 67.4266568; 80; 14.59; 48.7452547; 80; 
91; 17.3550271; 62.5; 16; 48.6013191; 80; 14.59; 50.3161533; 80; 17.3550271; 68; 16; 67.2387542; 80; 14.59; 58.8661183; 80; 
92; 17.3550271; 62.5; 16; 52.5441025; 80; 14.59; 72.889074; 76.0777536; 17.3550271; 68; 16; 67.5289284; 80; 14.59; 67.1667641; 75; 
93; 17.3550271; 62.5; 16; 52.4654598; 80; 14.59; 72.6540917; 75; 17.3550271; 68; 16; 67.3400055; 80; 14.59; 57.3942315; 80; 
94; 17.3550271; 62.5; 16; 50.9831237; 80; 14.59; 48.1580492; 80; 17.3550271; 68; 16; 48.590974; 80; 14.59; 49.13965; 78.1082937; 
95; 17.3550271; 62.5; 16; 50.9200531; 80; 14.59; 46.5997846; 77.6497606; 17.3550271; 68; 16; 48.590974; 80; 14.59; 48.6598469; 80; 
96; 17.3550271; 62.5; 26.11; 65.0702439; 80; 32.92; 59.5133125; 75; 17.3550271; 68; 26.11; 71.792205; 80; 32.92; 77.3837797; 75; 
