optimal value of nominal OPF is: 1.83382e+06

Congested lines in nominal operation are: 


optimal DR to nominal grid planning prices of bus 5 has cost of: 8161.93
optimal DR to nominal grid planning prices of bus 10 has cost of: 22416.6
optimal DR to nominal grid planning prices of bus 9 has cost of: 20117.4
optimal value of integrated optimization is: 1.80797e+06
Congested lines in integrated operation are: 


220.5 MW flexible load is cooperating and the initial threshold tau is 441 MW
maxIters: 500, primary/secondary strategy: 4/0, acceptable gap: 0.0001
it 50done, CWsubProb on bus 5 has objective 0.59459, and distance 679.64, CWsubProb on bus 10 has objective 0.49423, and distance 1360.7, CWsubProb on bus 9 has objective 0.32995, and distance 865.57, master obj (lb of Decomp) was: 1.8061e+06
iteration 87, culm. feasible Gap is 3.93083e+02 MW, which is below 4.41000e+02 MW (current tau)
detect. Gap: 2.47832e-04, intsol-masterLB: 198.828, real Gap: 0.000137874, ub computation returns status2.
it 100done, CWsubProb on bus 5 has objective 0.14046, and distance 140.94, CWsubProb on bus 10 has objective 0.15994, and distance 413.42, CWsubProb on bus 9 has objective 0.038381, and distance 88.782, master obj (lb of Decomp) was: 1.8078e+06
iteration 105, culm. feasible Gap is 2.02842e+02 MW, which is below 2.11753e+02 MW (current tau)
detect. Gap: 1.69990e-04, intsol-masterLB: 101.799, real Gap: 0.00011369, ub computation returns status2.
iteration 116, culm. feasible Gap is 1.39926e+02 MW, which is below 1.48236e+02 MW (current tau)
detect. Gap: 1.20682e-04, intsol-masterLB: 64.5907, real Gap: 8.49597e-05, ub computation returns status2.
iteration 123, culm. feasible Gap is 1.40803e+02 MW, which is below 1.46169e+02 MW (current tau)
detect. Gap: 1.14274e-04, intsol-masterLB: 48.896, real Gap: 8.72312e-05, ub computation returns status2.
iteration 125, culm. feasible Gap is 1.25933e+02 MW, which is below 1.46169e+02 MW (current tau)
detect. Gap: 1.07305e-04, intsol-masterLB: 39.4408, real Gap: 8.54922e-05, ub computation returns status2.
iteration 126, culm. feasible Gap is 1.22442e+02 MW, which is below 1.46169e+02 MW (current tau)
detect. Gap: 8.72911e-05, intsol-masterLB: 37.4006, real Gap: 6.66059e-05, ub computation returns status2.
breaking the loop due to sufficently accurate feasible point in it126!
done, masterPplant and accepted solution are: 
bus 5: 
30.408; 30.408
25.367; 25.367
25.368; 25.368
25.367; 25.368
25.367; 25.367
25.367; 25.367
25.367; 25.367
25.367; 25.367
31.632; 31.632
31.57; 31.57
25.367; 25.367
25.367; 25.367
25.367; 25.367
25.367; 25.367
25.367; 25.367
25.367; 25.367
25.367; 25.367
25.367; 25.367
25.367; 25.367
25.367; 25.367
25.367; 25.367
25.367; 25.367
25.367; 25.367
25.367; 25.367
25.367; 25.367
25.367; 25.367
25.367; 25.367
25.367; 25.367
25.367; 25.367
25.367; 25.367
25.367; 25.367
25.367; 25.367
25.367; 25.367
25.367; 25.367
25.367; 25.367
25.367; 25.367
25.367; 25.367
25.367; 28.279
25.367; 28.25
25.367; 25.367
25.367; 25.367
25.367; 26.894
38.745; 38.745
38.612; 38.612
25.367; 26.849
25.367; 25.367
39.925; 40.123
51.612; 51.612
47.537; 47.774
48.158; 48.158
49.633; 48.92
48.953; 48.569
48.568; 48.568
48.492; 48.565
48.765; 48.562
49.058; 48.556
48.739; 48.55
48.696; 48.543
49.092; 48.534
48.572; 48.525
48.303; 48.515
48.842; 48.504
49.099; 48.492
48.889; 48.479
48.767; 48.465
48.81; 48.45
48.483; 48.435
48.265; 48.418
48.452; 48.401
48.767; 48.383
48.991; 48.364
48.595; 48.344
48.348; 48.323
48.673; 48.302
48.758; 48.279
48.447; 48.256
36.745; 36.748
25.367; 25.367
25.7; 25.7
25.696; 25.696
25.367; 25.367
40.577; 40.577
52.984; 52.984
37.801; 37.801
25.367; 25.367
40.577; 40.577
40.426; 40.426
40.577; 40.577
53.389; 52.73
50.174; 48.903
48.539; 47.951
36.572; 36.596
25.367; 25.367
25.367; 25.367
25.367; 25.367
40.577; 40.577

bus 10: 
83.515; 83.516
69.671; 69.671
69.672; 69.672
69.671; 69.672
78.961; 78.961
95.982; 95.982
86.614; 86.614
70.277; 70.277
70.27; 70.271
69.671; 69.671
69.671; 69.671
69.671; 69.671
69.671; 69.671
69.671; 69.671
69.671; 69.671
69.671; 69.671
69.671; 69.671
69.671; 69.671
69.671; 69.671
69.671; 69.671
69.671; 69.671
69.671; 69.671
69.671; 69.671
69.671; 69.671
69.671; 69.671
69.671; 69.671
69.671; 69.671
69.671; 69.671
69.671; 69.671
69.671; 69.671
69.671; 69.671
69.671; 69.671
69.671; 69.671
69.671; 69.671
69.671; 69.671
69.671; 69.671
69.671; 69.671
69.671; 69.671
69.671; 71.222
69.671; 71.207
69.671; 69.671
69.671; 69.671
69.671; 71.278
74.163; 74.163
94.96; 94.96
119.94; 119.94
129.49; 129.49
133.25; 133.25
134.15; 133.13
132.72; 133.16
133.18; 133.17
133.36; 133.17
133.16; 133.16
133.03; 133.15
133.39; 133.14
133.4; 133.12
133.19; 133.1
132.99; 132.99
132.87; 133.01
133.23; 133.07
133.19; 133
132.65; 132.96
133.14; 132.93
133.11; 132.89
133.01; 132.85
133.28; 132.81
133.47; 132.77
132.92; 132.72
132.31; 132.67
133; 132.62
132.77; 132.56
132.39; 132.39
132.55; 132.39
132.63; 132.44
132.53; 132.32
132.23; 132.26
132.41; 132.19
101; 101
69.671; 69.908
102.78; 102.78
118.01; 118.01
85.073; 85.073
69.671; 69.671
111.44; 111.44
146.05; 145.66
136.47; 135.36
101.48; 101.48
84.305; 84.305
84.159; 84.159
74.931; 74.931
74.879; 74.879
111.45; 111.45
111.03; 111.03
69.671; 70.338
69.671; 69.671
111.45; 111.45

bus 9: 
74.949; 74.95
79.119; 79.119
78.954; 78.954
80.876; 80.876
93.406; 93.406
87.496; 87.496
86.59; 86.59
93.752; 93.752
81.871; 81.871
62.525; 62.526
62.525; 62.525
62.525; 62.525
62.525; 62.525
62.525; 62.525
62.525; 62.525
62.525; 62.525
62.525; 62.525
62.525; 62.525
62.525; 62.525
62.525; 62.525
62.525; 62.525
62.525; 62.525
62.525; 62.525
62.525; 62.525
62.525; 62.525
62.525; 62.525
62.525; 62.525
62.525; 62.525
62.525; 62.525
62.525; 62.525
62.525; 62.525
62.525; 62.525
62.525; 62.525
62.525; 62.525
62.525; 62.525
62.525; 62.525
62.525; 62.525
62.525; 62.525
62.525; 63.463
62.525; 63.454
62.525; 62.525
62.525; 62.525
70.926; 71.087
93.638; 93.638
104.24; 104.24
106.42; 106.42
113.44; 113.44
118.61; 118.61
121.55; 121.09
120.09; 120.02
119.82; 120.02
120.16; 120.02
120.21; 120.01
119.99; 119.99
119.88; 119.96
119.95; 119.95
119.82; 119.82
119.84; 119.85
119.95; 119.94
119.85; 119.85
119.88; 119.82
119.84; 119.79
119.76; 119.75
119.76; 119.71
119.7; 119.67
119.66; 119.63
119.75; 119.59
119.47; 119.49
119.47; 119.47
119.74; 119.47
119.61; 119.39
119.56; 119.33
119.46; 119.28
119.21; 119.21
119.21; 119.15
119.38; 119.1
110.14; 110.14
107.14; 107.14
114.99; 114.99
89.515; 89.655
62.525; 62.525
62.525; 62.525
100.01; 100.01
99.641; 99.641
63.331; 63.331
63.323; 63.323
64.203; 64.203
64.186; 64.186
62.525; 62.525
62.525; 62.525
62.525; 62.525
62.525; 62.525
62.525; 62.525
77.075; 77.075
76.929; 76.929
100.01; 100.01

computed cost is: 1.8081e+06. It improved the nominal case cost by 1.4035% of the nominal cost. This lifts 99.534% of the cooperation potential
Spent 6.5215 sec in Master, 2.2383 sec trying to compute acceptably good feas Points, and 23.885 sec in subProblem stage.
Within subProblem stage, spent 20.898 sec solving and 2.9856 sec generating cuts.
Average CPU time per iteration is: 0.25908 sec.
Congested lines in disaggregated operation are: 


