t; nomPriceB7; nomPlPowB7; integrPriceB7; integrPlPowB7; integrT_in_B7; disagg_price_bus7; PlPowB7; disaggT_in_B7; nomPriceB6; nomPlPowB6; integrPriceB6; integrPlPowB6; integrT_in_B6; disagg_price_bus6; PlPowB6; disaggT_in_B6; nomPriceB10; nomPlPowB10; integrPriceB10; integrPlPowB10; integrT_in_B10; disagg_price_bus10; PlPowB10; disaggT_in_B10;  initFeasThres; finalFeasThres; accept_gap; iterations; CPUmaster; CPUsubproblem; CPUfeasPt; finalDetectGap; nomCongestionCost; intCongestionCost; disaggCongestionCost; Objective; nomImprovPercent; CoopPotentialPercent; nominalCost; integratedCost
1; 10.52; 62.5; 10.52; 53.5356974; 80; 10.52; 53.5356974; 80; 10.52; 68; 10.52; 58.2468388; 80; 10.52; 58.2468388; 80; 10.52; 97.5; 10.52; 83.515688; 80; 10.52; 83.515688; 80; 456; 166.211597; 0.0001; 76; 4.80484652; 6.39204951; 0.744569138; 9.30050349e-05; 3.29410517e-10; 8.19216053e-10; 6.2030349e-10; 1808390.89; 1.44246994; 99.5511195; 1834858.16; 1808271.54
2; 10.52; 62.5; 10.52; 60.9735549; 80; 10.52; 60.9727528; 80; 10.52; 68; 10.52; 48.590974; 80; 10.52; 48.5914472; 80; 10.52; 97.5; 10.52; 69.6708819; 80; 10.52; 69.6708819; 80; 
3; 10.52; 62.5; 10.52; 60.8108209; 80; 10.52; 60.8106691; 80; 10.52; 68; 10.52; 48.590974; 80; 10.52; 48.5914425; 80; 10.52; 97.5; 10.52; 69.6708819; 80; 10.52; 69.6708819; 80; 
4; 10.52; 62.5; 10.52; 52.4558008; 80; 10.52; 52.5628294; 80; 10.52; 68; 10.52; 58.3441357; 80; 10.52; 48.590974; 80; 10.52; 97.5; 10.52; 69.6708819; 80; 10.52; 79.3141874; 80; 
5; 10.52; 62.5; 10.52; 52.378039; 80; 10.52; 52.4839999; 80; 10.52; 68; 10.52; 68.000001; 80; 10.52; 49.3135889; 80; 10.52; 97.5; 10.52; 81.1502141; 80; 10.52; 100.449677; 80; 
6; 10.52; 62.5; 10.52; 53.6251248; 80; 10.52; 47.8183093; 80; 10.52; 68; 10.52; 58.2468393; 80; 10.52; 75.2975172; 78.0962498; 10.52; 97.5; 10.52; 101.935409; 80; 10.52; 90.6907669; 80; 
7; 10.52; 62.5; 10.52; 55.4464371; 80; 10.52; 47.7868106; 80; 10.52; 68; 10.52; 58.3441357; 80; 10.52; 86.6942008; 80; 10.52; 97.5; 10.52; 90.3621005; 80; 10.52; 69.6708819; 80; 
8; 10.52; 62.5; 10.52; 46.5524996; 80; 10.52; 55.8130491; 80; 10.52; 68; 10.52; 60.0513995; 80; 10.52; 69.0244566; 80; 10.52; 97.5; 10.52; 87.9052719; 80; 10.52; 69.6708853; 80; 
9; 10.52; 62.5; 10.52; 44.6608217; 80; 10.52; 55.7015798; 80; 10.52; 68; 10.52; 56.5759356; 80; 10.52; 63.5872169; 80; 10.52; 97.5; 10.52; 87.7233677; 80; 10.52; 69.6708853; 80; 
10; 10.52; 62.5; 10.52; 44.6608217; 80; 14.22; 44.6612067; 80; 10.52; 68; 10.52; 54.7275429; 80; 14.22; 55.4145935; 80; 10.52; 97.5; 10.52; 69.6708819; 80; 14.22; 69.6708819; 80; 
11; 15.4738462; 62.5; 14.59; 44.6608217; 80; 12.1581; 44.6608217; 80; 15.4738462; 68; 14.59; 48.590974; 80; 12.1581; 48.590974; 80; 15.4738462; 97.5; 14.59; 69.6708819; 80; 12.1581; 69.6708819; 80; 
12; 15.4738462; 62.5; 14.7685217; 44.6608217; 80; 14.6279421; 44.6608217; 80; 15.4738462; 68; 14.7685217; 48.590974; 80; 14.6279421; 48.590974; 80; 15.4738462; 97.5; 14.7685217; 69.6708819; 80; 14.6279421; 69.6708819; 80; 
13; 15.4738462; 62.5; 14.7685217; 44.6608217; 80; 14.6279421; 44.6608217; 80; 15.4738462; 68; 14.7685217; 48.590974; 80; 14.6279421; 48.590974; 80; 15.4738462; 97.5; 14.7685217; 69.6708819; 80; 14.6279421; 69.6708819; 80; 
14; 15.4738462; 62.5; 14.7685217; 44.6608217; 80; 14.6279421; 44.6608217; 80; 15.4738462; 68; 14.7685217; 48.590974; 80; 14.6279421; 48.590974; 80; 15.4738462; 97.5; 14.7685217; 69.6708819; 80; 14.6279421; 69.6708819; 80; 
15; 15.4738462; 62.5; 14.7685217; 44.6608217; 80; 14.6279421; 44.6608217; 80; 15.4738462; 68; 14.7685217; 48.590974; 80; 14.6279421; 48.590974; 80; 15.4738462; 97.5; 14.7685217; 69.6708819; 80; 14.6279421; 69.6708819; 80; 
16; 15.4738462; 62.5; 14.7685217; 44.6608217; 80; 14.6279421; 44.6608217; 80; 15.4738462; 68; 14.7685217; 48.590974; 80; 14.6279421; 48.590974; 80; 15.4738462; 97.5; 14.7685217; 69.6708819; 80; 14.6279421; 69.6708819; 80; 
17; 15.4738462; 62.5; 14.7685217; 44.6608217; 80; 14.6279421; 44.6608217; 80; 15.4738462; 68; 14.7685217; 48.590974; 80; 14.6279421; 48.590974; 80; 15.4738462; 97.5; 14.7685217; 69.6708819; 80; 14.6279421; 69.6708819; 80; 
18; 15.4738462; 62.5; 14.7685217; 44.6608217; 80; 14.6279421; 44.6608217; 80; 15.4738462; 68; 14.7685217; 48.590974; 80; 14.6279421; 48.590974; 80; 15.4738462; 97.5; 14.7685217; 69.6708819; 80; 14.6279421; 69.6708819; 80; 
19; 15.4738462; 62.5; 14.7685217; 44.6608217; 80; 14.6279421; 44.6608217; 80; 15.4738462; 68; 14.7685217; 48.590974; 80; 14.6279421; 48.590974; 80; 15.4738462; 97.5; 14.7685217; 69.6708819; 80; 14.6279421; 69.6708819; 80; 
20; 15.4738462; 62.5; 14.7685217; 44.6608217; 80; 14.6279421; 44.6608217; 80; 15.4738462; 68; 14.7685217; 48.590974; 80; 14.6279421; 48.590974; 80; 15.4738462; 97.5; 14.7685217; 69.6708819; 80; 14.6279421; 69.6708819; 80; 
21; 15.4738462; 62.5; 14.7685217; 44.6608217; 80; 14.6279421; 44.6608217; 80; 15.4738462; 68; 14.7685217; 48.590974; 80; 14.6279421; 48.590974; 80; 15.4738462; 97.5; 14.7685217; 69.6708819; 80; 14.6279421; 69.6708819; 80; 
22; 15.4738462; 62.5; 14.7685217; 44.6608217; 80; 14.6279421; 44.6608217; 80; 15.4738462; 68; 14.7685217; 48.590974; 80; 14.6279421; 48.590974; 80; 15.4738462; 97.5; 14.7685217; 69.6708819; 80; 14.6279421; 69.6708819; 80; 
23; 15.4738462; 62.5; 14.7685217; 44.6608217; 80; 14.6279421; 44.6608217; 80; 15.4738462; 68; 14.7685217; 48.590974; 80; 14.6279421; 48.590974; 80; 15.4738462; 97.5; 14.7685217; 69.6708819; 80; 14.6279421; 69.6708819; 80; 
24; 15.4738462; 62.5; 14.7685217; 44.6608217; 80; 14.6279421; 44.6608217; 80; 15.4738462; 68; 14.7685217; 48.590974; 80; 14.6279421; 48.590974; 80; 15.4738462; 97.5; 14.7685217; 69.6708819; 80; 14.6279421; 69.6708819; 80; 
25; 18.0061538; 62.5; 14.469609; 44.6608217; 80; 14.7493261; 44.6608217; 80; 18.0061538; 68; 14.469609; 48.590974; 80; 14.7493261; 48.590974; 80; 18.0061538; 97.5; 14.469609; 69.6708819; 80; 14.7493261; 69.6708819; 80; 
26; 16; 62.5; 14.469609; 44.6608217; 80; 14.7493261; 44.6608217; 80; 16; 68; 14.469609; 48.590974; 80; 14.7493261; 48.590974; 80; 16; 97.5; 14.469609; 69.6708819; 80; 14.7493261; 69.6708819; 80; 
27; 16; 62.5; 14.469609; 44.6608217; 80; 14.7493261; 44.6608217; 80; 16; 68; 14.469609; 48.590974; 80; 14.7493261; 48.590974; 80; 16; 97.5; 14.469609; 69.6708819; 80; 14.7493261; 69.6708819; 80; 
28; 16; 62.5; 14.469609; 44.6608217; 80; 14.7493261; 44.6608217; 80; 16; 68; 14.469609; 48.590974; 80; 14.7493261; 48.590974; 80; 16; 97.5; 14.469609; 69.6708819; 80; 14.7493261; 69.6708819; 80; 
29; 16; 62.5; 14.469609; 44.6608217; 80; 14.7493261; 44.6608217; 80; 16; 68; 14.469609; 48.590974; 80; 14.7493261; 48.590974; 80; 16; 97.5; 14.469609; 69.6708819; 80; 14.7493261; 69.6708819; 80; 
30; 16; 62.5; 14.469609; 44.6608217; 80; 14.7493261; 44.6608217; 80; 16; 68; 14.469609; 48.590974; 80; 14.7493261; 48.590974; 80; 16; 97.5; 14.469609; 69.6708819; 80; 14.7493261; 69.6708819; 80; 
31; 16; 62.5; 14.469609; 44.6608217; 80; 14.7493261; 44.6608217; 80; 16; 68; 14.469609; 48.590974; 80; 14.7493261; 48.590974; 80; 16; 97.5; 14.469609; 69.6708819; 80; 14.7493261; 69.6708819; 80; 
32; 16; 62.5; 14.469609; 44.6608217; 80; 14.7493261; 44.6608217; 80; 16; 68; 14.469609; 48.590974; 80; 14.7493261; 48.590974; 80; 16; 97.5; 14.469609; 69.6708819; 80; 14.7493261; 69.6708819; 80; 
33; 16; 62.5; 14.469609; 44.6608217; 80; 14.7493261; 44.6608217; 80; 16; 68; 14.469609; 48.590974; 80; 14.7493261; 48.590974; 80; 16; 97.5; 14.469609; 69.6708819; 80; 14.7493261; 69.6708819; 80; 
34; 16; 62.5; 14.469609; 44.6608217; 80; 14.7493261; 44.6608217; 80; 16; 68; 14.469609; 48.590974; 80; 14.7493261; 48.590974; 80; 16; 97.5; 14.469609; 69.6708819; 80; 14.7493261; 69.6708819; 80; 
35; 16; 62.5; 14.469609; 44.6608217; 80; 14.7493261; 44.6608217; 80; 16; 68; 14.469609; 48.590974; 80; 14.7493261; 48.590974; 80; 16; 97.5; 14.469609; 69.6708819; 80; 14.7493261; 69.6708819; 80; 
36; 20.7; 62.5; 16.9235193; 44.6608217; 80; 17.2506739; 44.6608217; 80; 20.7; 68; 16.9235193; 48.590974; 80; 17.2506739; 48.590974; 80; 20.7; 97.5; 16.9235193; 69.6708819; 80; 17.2506739; 69.6708819; 80; 
37; 20.7; 62.5; 16.9235193; 44.6608217; 80; 17.2506739; 44.6608217; 80; 20.7; 68; 16.9235193; 48.590974; 80; 17.2506739; 48.590974; 80; 20.7; 97.5; 16.9235193; 69.6708819; 80; 17.2506739; 69.6708819; 80; 
38; 20.7; 62.5; 16.9235193; 44.6608217; 80; 17.2506739; 44.6608217; 80; 20.7; 68; 16.9235193; 48.590974; 80; 17.2506739; 48.590974; 80; 20.7; 97.5; 16.9235193; 69.6708819; 80; 17.2506739; 69.6708819; 80; 
39; 20.7; 62.5; 16.9235193; 44.6608217; 80; 17.2506739; 45.9056714; 80; 20.7; 68; 16.9235193; 48.590974; 80; 17.2506739; 48.590974; 80; 20.7; 97.5; 16.9235193; 69.6708819; 80; 17.2506739; 70.2606375; 80; 
40; 20.7; 62.5; 16.9235193; 44.6608217; 80; 17.2506739; 45.8932529; 80; 20.7; 68; 16.9235193; 48.590974; 80; 17.2506739; 53.1454111; 80; 20.7; 97.5; 16.9235193; 69.6708819; 80; 17.2506739; 70.2547541; 80; 
41; 20.7; 62.5; 16.9235193; 44.6608217; 80; 17.2506739; 44.6608217; 80; 20.7; 68; 16.9235193; 48.590974; 80; 17.2506739; 53.0999765; 80; 20.7; 97.5; 16.9235193; 69.6708819; 80; 17.2506739; 69.6708819; 80; 
42; 20.7; 62.5; 16.9235193; 44.6608217; 80; 17.2506739; 44.6608217; 80; 20.7; 68; 16.9235193; 48.590974; 80; 17.2506739; 48.590974; 80; 20.7; 97.5; 16.9235193; 69.6708819; 80; 17.2506739; 69.6708819; 80; 
43; 6.52; 62.5; 12.3059229; 53.6251248; 80; 12.2512186; 44.6608217; 80; 6.52; 68; 12.3059229; 58.3441357; 80; 12.2512186; 48.590974; 80; 6.52; 97.5; 12.3059229; 71.5088791; 80; 12.2512186; 91.125103; 80; 
44; 5.47; 62.5; 9.23534662; 65.6891903; 80; 12.2512186; 46.4743707; 80; 5.47; 68; 9.23534662; 68.000001; 80; 12.2512186; 48.590974; 80; 5.47; 97.5; 9.23534662; 71.4905434; 80; 12.2512186; 109.664834; 80; 
45; 5.47; 62.5; 10.801575; 71.5841525; 80; 14.3289106; 67.2859308; 80; 5.47; 68; 10.801575; 76.0734175; 80; 14.3289106; 65.4543005; 80; 5.47; 97.5; 10.801575; 95.056758; 80; 14.3289106; 103.63287; 80; 
46; 5.47; 62.5; 9.23534662; 71.5670892; 80; 5.47; 78.047768; 78.5416228; 5.47; 68; 9.23534662; 79.4212729; 80; 5.47; 78.9749282; 79.771014; 5.47; 97.5; 9.23534662; 117.234741; 80; 5.47; 106.738677; 79.993984; 
47; 5.47; 62.5; 9.23534662; 77.2484259; 75; 5.47; 77.8035137; 75; 5.47; 68; 9.23534662; 84.0022433; 75; 5.47; 81.7072927; 75; 5.47; 97.5; 9.23534662; 124.112244; 75; 5.47; 121.390377; 75.3007093; 
48; 5.47; 62.5; 9.23534662; 85.5815737; 75; 5.47; 84.1376194; 75; 5.47; 68; 9.23534662; 93.1127102; 75; 5.47; 91.5472129; 75; 5.47; 97.5; 9.23534662; 133.564562; 75; 5.47; 132.112284; 75; 
49; 5.47; 62.5; 5.47; 85.6291828; 75; 5.47; 84.4738023; 75; 5.47; 68; 5.47; 93.1486563; 75; 5.47; 94.2805182; 75; 5.47; 97.5; 5.47; 133.33421; 75; 5.47; 134.050213; 75.0087334; 
50; 5.47; 62.5; 5.47; 85.6485139; 75; 5.47; 85.8371809; 75.5857618; 5.47; 68; 5.47; 93.1697825; 75; 5.47; 93.0501229; 75; 5.47; 97.5; 5.47; 133.365827; 75; 5.47; 133.508634; 75.0383044; 
51; 5.47; 62.5; 5.47; 85.655802; 75; 5.47; 85.5718743; 75.1365337; 5.47; 68; 5.47; 93.1778593; 75; 5.47; 93.0592394; 75; 5.47; 97.5; 5.47; 133.379489; 75; 5.47; 133.52054; 75; 
52; 5.47; 62.5; 5.47; 85.6548287; 75; 5.47; 85.5740925; 75.1880509; 5.47; 68; 5.47; 93.1769059; 75; 5.47; 93.0598952; 75; 5.47; 97.5; 5.47; 133.379613; 75; 5.47; 133.521232; 75.0534296; 
53; 5.47; 62.5; 5.47; 85.6501386; 75; 5.47; 85.5701108; 75.2835721; 5.47; 68; 5.47; 93.1719158; 75; 5.47; 93.0552641; 75; 5.47; 97.5; 5.47; 133.374051; 75; 5.47; 133.501901; 75.0355284; 
54; 5.47; 62.5; 5.47; 85.6425997; 75; 5.47; 85.5635257; 75; 5.47; 68; 5.47; 93.1638267; 75; 5.47; 93.0474998; 75; 5.47; 97.5; 5.47; 133.364052; 75; 5.47; 133.491379; 75.0369681; 
55; 5.47; 62.5; 5.47; 85.6328169; 75; 5.47; 85.5545792; 75; 5.47; 68; 5.47; 93.1532954; 75; 5.47; 93.0371893; 75.3276544; 5.47; 97.5; 5.47; 133.350539; 75; 5.47; 133.489993; 75.0369266; 
56; 5.47; 62.5; 5.47; 85.6211009; 75; 5.47; 85.5436414; 75; 5.47; 68; 5.47; 93.1406599; 75; 5.47; 93.0247252; 75.1404807; 5.47; 97.5; 5.47; 133.333998; 75; 5.47; 133.461877; 75.036089; 
57; 5.47; 62.5; 5.47; 85.6076042; 75; 5.47; 85.5308928; 75; 5.47; 68; 5.47; 93.1260863; 75; 5.47; 93.0102992; 75.1547667; 5.47; 97.5; 5.47; 133.314667; 75; 5.47; 133.446889; 75.0358728; 
58; 5.47; 62.5; 5.47; 85.5924052; 75; 5.47; 85.5164248; 75; 5.47; 68; 5.47; 93.1096597; 75; 5.47; 92.9940084; 75.071817; 5.47; 97.5; 5.47; 133.292667; 75; 5.47; 133.434759; 75.0316924; 
59; 5.47; 62.5; 5.47; 85.5755468; 75; 5.47; 85.5002867; 75.3009544; 5.47; 68; 5.47; 93.0914269; 75; 5.47; 92.9759056; 75; 5.47; 97.5; 5.47; 133.268066; 75; 5.47; 133.404402; 75.0195916; 
60; 5.47; 62.5; 5.47; 85.5570557; 75; 5.47; 85.4825081; 75.091077; 5.47; 68; 5.47; 93.071417; 75; 5.47; 92.9560222; 75.4211329; 5.47; 97.5; 5.47; 133.240905; 75; 5.47; 133.376467; 75; 
61; 5.47; 62.5; 5.47; 85.5369507; 75; 5.47; 85.4631091; 75; 5.47; 68; 5.47; 93.0496502; 75; 5.47; 92.9343801; 75.2561404; 5.47; 97.5; 5.47; 133.211215; 75; 5.47; 133.346007; 75.0606556; 
62; 5.47; 62.5; 5.47; 85.5152467; 75; 5.47; 85.4421054; 75.3712987; 5.47; 68; 5.47; 93.026143; 75; 5.47; 92.9109961; 75.1824734; 5.47; 97.5; 5.47; 133.179018; 75; 5.47; 133.313045; 75.0136317; 
63; 5.47; 62.5; 5.47; 85.491957; 75; 5.47; 85.4195106; 75.230375; 5.47; 68; 5.47; 93.0009098; 75; 5.47; 92.8858849; 75.2125306; 5.47; 97.5; 5.47; 133.144334; 75; 5.47; 133.277602; 75; 
64; 5.47; 62.5; 5.47; 85.467094; 75; 5.47; 85.3953372; 75; 5.47; 68; 5.47; 92.973964; 75; 5.47; 92.8590601; 75.2355828; 5.47; 97.5; 5.47; 133.107185; 75; 5.47; 133.239698; 75; 
65; 5.47; 62.5; 5.47; 85.4406695; 75; 5.47; 85.3695972; 75.1085064; 5.47; 68; 5.47; 92.9453186; 75; 5.47; 92.8305347; 75.1130025; 5.47; 97.5; 5.47; 133.067587; 75; 5.47; 133.199352; 75; 
66; 5.47; 62.5; 5.47; 85.4126951; 75; 5.47; 85.3073792; 75.3585993; 5.47; 68; 5.47; 92.9149861; 75; 5.47; 92.8003214; 75.3528514; 5.47; 97.5; 5.47; 133.02556; 75; 5.47; 133.156581; 75; 
67; 5.47; 62.5; 5.47; 85.3831822; 75; 5.47; 85.2950174; 75.0661828; 5.47; 68; 5.47; 92.882979; 75; 5.47; 92.7684326; 75.2391439; 5.47; 97.5; 5.47; 132.981121; 75; 5.47; 133.111405; 75; 
68; 5.47; 62.5; 5.47; 85.3521423; 75; 5.47; 85.2989706; 75.1753441; 5.47; 68; 5.47; 92.8493096; 75; 5.47; 92.7348807; 75; 5.47; 97.5; 5.47; 132.934288; 75; 5.47; 133.063839; 75; 
69; 5.47; 62.5; 5.47; 85.3195864; 75; 5.47; 85.2510237; 75.093059; 5.47; 68; 5.47; 92.8139903; 75; 5.47; 92.6996778; 75; 5.47; 97.5; 5.47; 132.885078; 75; 5.47; 133.013902; 75; 
70; 5.47; 62.5; 5.47; 85.2855258; 75; 5.47; 85.2176242; 75.1980517; 5.47; 68; 5.47; 92.777033; 75; 5.47; 92.6628362; 75; 5.47; 97.5; 5.47; 132.833509; 75; 5.47; 132.961612; 75; 
71; 5.47; 62.5; 5.47; 85.2499715; 75; 5.47; 85.182726; 75.1322633; 5.47; 68; 5.47; 92.7384497; 75; 5.47; 92.6243678; 75; 5.47; 97.5; 5.47; 132.779599; 75; 5.47; 132.906099; 75; 
72; 5.47; 62.5; 5.47; 85.2129344; 75; 5.47; 85.0700815; 75; 5.47; 68; 5.47; 92.6982525; 75; 5.47; 92.3676451; 75; 5.47; 97.5; 5.47; 132.723364; 75; 5.47; 132.849571; 75; 
73; 5.47; 62.5; 5.47; 85.1744253; 75; 5.47; 85.0681975; 75; 5.47; 68; 5.47; 92.6564532; 75; 5.47; 92.1664574; 75; 5.47; 97.5; 5.47; 132.664822; 75; 5.47; 132.791194; 75; 
74; 5.47; 62.5; 5.47; 85.1344552; 75; 5.47; 85.1038193; 75; 5.47; 68; 5.47; 92.6130634; 75; 5.47; 92.4595748; 75; 5.47; 97.5; 5.47; 132.603989; 75; 5.47; 132.729253; 75; 
75; 5.47; 62.5; 5.47; 85.0930348; 75; 5.47; 85.0279764; 75; 5.47; 68; 5.47; 92.5680949; 75; 5.47; 92.5723379; 75.5823585; 5.47; 97.5; 5.47; 132.540883; 75; 5.47; 132.616153; 75; 
76; 5.47; 62.5; 10.3030101; 85.0501746; 75; 10.21; 84.9857516; 75; 5.47; 68; 10.3030101; 92.5215593; 75; 10.21; 92.2118953; 75; 5.47; 97.5; 10.3030101; 132.475519; 75; 10.21; 132.573357; 75; 
77; 5.47; 62.5; 9.37208683; 74.3965259; 75; 10.52; 84.9420929; 75; 5.47; 68; 9.37208683; 80.1876077; 75; 10.52; 70.4670864; 80; 5.47; 97.5; 9.37208683; 132.407915; 75; 10.52; 132.55352; 75; 
78; 5.47; 62.5; 9.37208683; 54.2175712; 80; 10.3794749; 84.3212487; 75; 5.47; 68; 9.37208683; 68.000001; 80; 10.3794749; 48.8702307; 80; 5.47; 97.5; 9.37208683; 119.139452; 80; 10.3794749; 108.821877; 75; 
79; 5.47; 62.5; 10.9615051; 62.9639284; 80; 10.6605251; 64.1982153; 75; 5.47; 68; 10.9615051; 68.000001; 80; 10.6605251; 48.590974; 80; 5.47; 97.5; 10.9615051; 106.431964; 80; 10.6605251; 114.811987; 75; 
80; 11.9143302; 62.5; 10.9615051; 62.7813387; 80; 10.3794749; 44.7613099; 78.354939; 11.9143302; 68; 10.9615051; 58.2468393; 80; 10.3794749; 48.590974; 80; 11.9143302; 97.5; 10.9615051; 88.1537164; 80; 10.3794749; 106.622671; 75; 
81; 11.9143302; 62.5; 10.9615051; 62.392536; 80; 10.6605251; 71.4391823; 75; 11.9143302; 68; 10.9615051; 58.3441357; 80; 10.6605251; 55.9006843; 80; 11.9143302; 97.5; 10.9615051; 75.263029; 80; 10.6605251; 69.6708819; 80; 
82; 11.9143302; 62.5; 10.9615051; 74.2291697; 80; 10.2389498; 71.1720444; 75; 11.9143302; 68; 10.9615051; 58.2468393; 80; 10.2389498; 55.8277634; 76.7611429; 11.9143302; 97.5; 10.9615051; 90.4423794; 80; 10.2389498; 69.6708819; 78.7852601; 
83; 10.1867523; 62.5; 9.37208683; 56.5544994; 80; 10.6605251; 44.6608239; 78.7092245; 10.1867523; 68; 9.37208683; 69.9965612; 80; 10.6605251; 77.7258304; 75; 10.1867523; 97.5; 9.37208683; 98.3230602; 80; 10.6605251; 111.444794; 75; 
84; 10.1867523; 62.5; 9.37208683; 51.6367976; 80; 10.6605251; 44.6608239; 79.1770318; 10.1867523; 68; 9.37208683; 79.5361832; 80; 10.6605251; 101.617652; 75; 10.1867523; 97.5; 9.37208683; 107.186563; 80; 10.6605251; 111.028389; 80; 
85; 10.1867523; 62.5; 10.9615051; 62.4889002; 80; 9.11474896; 44.6608217; 80; 10.1867523; 68; 10.9615051; 68.000001; 80; 9.11474896; 94.4564687; 75; 10.1867523; 97.5; 10.9615051; 112.329183; 80; 9.11474896; 103.502947; 75; 
86; 10.1867523; 62.5; 9.37208683; 55.4735623; 80; 10.6605251; 61.386132; 80; 10.1867523; 68; 9.37208683; 68.000001; 80; 10.6605251; 92.20201; 75; 10.1867523; 97.5; 9.37208683; 107.270809; 80; 10.6605251; 103.165442; 80; 
87; 13.32; 62.5; 10.9615051; 57.8058388; 80; 10.6605251; 61.2192821; 80; 13.32; 68; 10.9615051; 68.000001; 80; 10.6605251; 70.2779292; 75; 13.32; 97.5; 10.9615051; 88.4527451; 80; 10.6605251; 83.3416467; 80; 
88; 13.32; 62.5; 10.9615051; 57.6747055; 80; 10.6605251; 71.4391823; 75; 13.32; 68; 10.9615051; 68.000001; 80; 10.6605251; 48.590974; 80; 13.32; 97.5; 10.9615051; 81.5922131; 80; 10.6605251; 83.2052687; 75.2586345; 
89; 13.32; 62.5; 10.9615051; 44.6608217; 80; 10.6605251; 71.1720444; 80; 13.32; 68; 10.9615051; 58.2468393; 80; 10.6605251; 57.7415558; 75; 13.32; 97.5; 10.9615051; 86.3055445; 80; 10.6605251; 109.051846; 78.4804295; 
90; 13.32; 62.5; 10.9615051; 55.8910532; 80; 10.6605251; 44.6608217; 75.7183673; 13.32; 68; 10.9615051; 58.3441357; 80; 10.6605251; 57.6502706; 78.4367083; 13.32; 97.5; 10.9615051; 88.4392459; 80; 10.6605251; 108.658986; 80; 
91; 13.32; 62.5; 10.9615051; 55.7790217; 80; 10.6605251; 44.6608217; 80; 13.32; 68; 10.9615051; 58.2468393; 80; 10.6605251; 77.7258304; 75; 13.32; 97.5; 10.9615051; 103.544841; 80; 10.6605251; 69.6711867; 80; 
92; 13.32; 62.5; 10.9615051; 63.3655813; 80; 10.6605251; 44.6608217; 80; 13.32; 68; 10.9615051; 58.3441357; 80; 10.6605251; 77.4351843; 80; 13.32; 97.5; 10.9615051; 89.5002259; 80; 10.6605251; 85.5745829; 75; 
93; 13.32; 62.5; 10.9615051; 63.1789848; 80; 10.6605251; 44.6608217; 80; 13.32; 68; 10.9615051; 60.6506137; 80; 10.6605251; 48.590974; 80; 13.32; 97.5; 10.9615051; 84.54299; 80; 10.6605251; 85.4159328; 80; 
94; 13.32; 62.5; 10.9615051; 52.7731747; 80; 10.6605251; 71.4391781; 75; 13.32; 68; 10.9615051; 60.7239304; 80; 10.6605251; 48.590974; 77.3513936; 13.32; 97.5; 10.9615051; 84.3946275; 80; 10.6605251; 69.6708853; 78.1440127; 
95; 13.32; 62.5; 10.4269899; 52.6922468; 80; 10.6605251; 71.1720444; 79.4588587; 13.32; 68; 10.4269899; 58.2468393; 80; 10.6605251; 48.590974; 80; 13.32; 97.5; 10.4269899; 69.6708819; 80; 10.6605251; 69.6708819; 80; 
96; 13.32; 62.5; 20.93; 71.4391823; 75; 20.93; 71.4391864; 75; 13.32; 68; 20.93; 77.7258304; 75; 20.93; 77.7258304; 75; 13.32; 97.5; 20.93; 111.422566; 75; 20.93; 111.445124; 75; 
