Strategy; time_master; time_subproblem; time_solveSub; time_generateCuts; time_feasPt; Iterations 
3; 8.30185342; 11.1541257; 0.456809375; 149; 
4; 8.49010774; 9.30340819; 0.340276517; 96; 
5; 5.66773666; 8.16143189; 0.870098187; 105; 
6; 3.755507; 5.6244836; 0.866253441; 63; 
