t; nomPriceB5; nomPlPowB5; integrPriceB5; integrPlPowB5; integrT_in_B5; disagg_price_bus5; PlPowB5; disaggT_in_B5;  initFeasThres; finalFeasThres; accept_gap; iterations; CPUmaster; CPUsubproblem; CPUfeasPt; finalDetectGap; nomCongestionCost; intCongestionCost; disaggCongestionCost; Objective; nomImprovPercent; CoopPotentialPercent; nominalCost; integratedCost
1; 10.52; 71; 10.52; 60.8165523; 80; 10.52; 60.8165523; 80; 142; 142; 0.0001; 52; 1.28887625; 3.65102282; 0.444689627; 5.95871464e-05; 6.18824889e-10; 5.68573351e-10; 3.4177477e-09; 1804471.8; 0.508593757; 99.0021095; 1813696.15; 1804378.83
2; 10.52; 71; 10.52; 50.7346935; 80; 10.52; 50.7346935; 80; 
3; 10.52; 71; 10.52; 50.7346935; 80; 10.52; 50.7346935; 80; 
4; 10.52; 71; 10.52; 50.7346935; 80; 10.52; 50.7346935; 80; 
5; 10.52; 71; 10.52; 50.7346935; 80; 10.52; 50.7346935; 80; 
6; 10.52; 71; 10.52; 50.7346935; 80; 10.52; 50.7346935; 80; 
7; 10.52; 71; 10.52; 50.7346935; 80; 10.52; 51.2652921; 80; 
8; 10.52; 71; 10.52; 69.8574689; 80; 10.52; 70.7267156; 80; 
9; 10.52; 71; 10.52; 77.2645831; 80; 10.52; 77.6053038; 80; 
10; 10.52; 71; 10.52; 58.2567787; 80; 13.5363881; 58.2569872; 80; 
11; 14.59; 71; 14.59; 50.7346935; 80; 11.5736119; 50.7346935; 80; 
12; 15.5475; 71; 15.3761538; 50.7346935; 80; 15.3761538; 50.7346935; 80; 
13; 15.5475; 71; 15.3761538; 50.7346935; 80; 15.3761538; 50.7346935; 80; 
14; 15.5475; 71; 15.3761538; 50.7346935; 80; 15.3761538; 50.7346935; 80; 
15; 15.5475; 71; 15.3761538; 50.7346935; 80; 15.3761538; 50.7346935; 80; 
16; 15.5475; 71; 15.3761538; 50.7346935; 80; 15.3761538; 50.7346935; 80; 
17; 15.5475; 71; 15.3761538; 50.7346935; 80; 15.3761538; 50.7346935; 80; 
18; 15.5475; 71; 15.3761538; 50.7346935; 80; 15.3761538; 50.7346935; 80; 
19; 15.5475; 71; 15.3761538; 50.7346935; 80; 15.3761538; 50.7346935; 80; 
20; 15.5475; 71; 15.3761538; 50.7346935; 80; 15.3761538; 50.7346935; 80; 
21; 15.5475; 71; 15.3761538; 50.7346935; 80; 15.3761538; 50.7346935; 80; 
22; 15.5475; 71; 15.3761538; 50.7346935; 80; 15.3761538; 50.7346935; 80; 
23; 15.5475; 71; 15.3761538; 50.7346935; 80; 15.3761538; 50.7346935; 80; 
24; 15.5475; 71; 15.3761538; 50.7346935; 80; 15.3761538; 50.7346935; 80; 
25; 17.81; 71; 16.6238462; 50.7346935; 80; 16.6238462; 50.7346935; 80; 
26; 16; 71; 16; 50.7346935; 80; 16; 50.7346935; 80; 
27; 16; 71; 16; 50.7346935; 80; 16; 50.7346935; 80; 
28; 16; 71; 16; 50.7346935; 80; 16; 50.7346935; 80; 
29; 16; 71; 16; 50.7346935; 80; 16; 50.7346935; 80; 
30; 16; 71; 16; 50.7346935; 80; 16; 50.7346935; 80; 
31; 16; 71; 16; 50.7346935; 80; 16; 50.7346935; 80; 
32; 16; 71; 16; 50.7346935; 80; 16; 50.7346935; 80; 
33; 16; 71; 16; 50.7346935; 80; 16; 50.7346935; 80; 
34; 16; 71; 16; 50.7346935; 80; 16; 50.7346935; 80; 
35; 16; 71; 16; 50.7346935; 80; 16; 50.7346935; 80; 
36; 16; 71; 16; 50.7346935; 80; 16; 50.7346935; 80; 
37; 20.4725; 71; 18.7134503; 50.7346935; 80; 18.7134503; 50.7346935; 80; 
38; 20.4725; 71; 18.7134503; 50.7346935; 80; 18.7134503; 50.7346935; 80; 
39; 20.7; 71; 18.7134503; 50.7346935; 80; 18.7134503; 50.7346935; 80; 
40; 20.7; 71; 20.7; 50.7346935; 80; 20.7; 50.7346935; 80; 
41; 20.4725; 71; 18.7134503; 50.7346935; 80; 18.7134503; 50.7346935; 80; 
42; 20.4725; 71; 18.7134503; 50.7346935; 80; 18.7134503; 57.6518109; 80; 
43; 13.4015; 71; 12.9127485; 64.1023604; 80; 11.8056723; 62.6202271; 80; 
44; 4.67685; 71; 6.32194144; 83.6109579; 79.7482587; 6.57707627; 77.3919853; 75.8427488; 
45; 5.47; 71; 7.39408356; 93.3287969; 75; 7.69248687; 95.8966613; 75; 
46; 4.67685; 71; 6.32194144; 96.8411562; 75; 6.57707627; 97.3834079; 75.949595; 
47; 4.67685; 71; 7.39408356; 96.8946516; 75; 7.69248687; 96.8838028; 75; 
48; 4.67685; 71; 4.67685; 96.9154079; 75; 4.67685; 96.911765; 75.7557979; 
49; 4.67685; 71; 4.67685; 96.9238076; 75; 4.67685; 96.6069526; 75.4113827; 
50; 4.67685; 71; 4.67685; 96.9223545; 75; 4.67685; 96.7515993; 75.4788699; 
51; 4.67685; 71; 4.67685; 96.9169829; 75; 4.67685; 97.048789; 75.1351511; 
52; 4.67685; 71; 4.67685; 96.9083789; 75; 4.67685; 96.5065563; 75.8802644; 
53; 4.67685; 71; 4.67685; 96.8972429; 75; 4.67685; 96.5012885; 75.1591249; 
54; 4.67685; 71; 4.67685; 96.8839188; 75; 4.67685; 96.8783982; 75.3687016; 
55; 5.47; 71; 5.47; 96.8685758; 75; 5.47; 96.4258069; 75.6914505; 
56; 5.47; 71; 5.47; 96.8513006; 75; 5.47; 96.472326; 75.5512646; 
57; 5.47; 71; 5.47; 96.8321414; 75; 5.47; 96.888718; 75.2791602; 
58; 5.47; 71; 5.47; 96.8111279; 75; 5.47; 96.8117072; 75.4722862; 
59; 5.47; 71; 5.47; 96.7882811; 75; 5.47; 96.7892995; 75.2348596; 
60; 5.47; 71; 5.47; 96.7636181; 75; 5.47; 96.7648156; 75.3323409; 
61; 5.47; 71; 5.47; 96.7371538; 75; 5.47; 96.7377077; 75.5511917; 
62; 5.47; 71; 5.47; 96.7089022; 75; 5.47; 95.489205; 76.047749; 
63; 5.47; 71; 5.47; 96.6788769; 75; 5.47; 96.0253899; 75.187518; 
64; 5.47; 71; 5.47; 96.6470909; 75; 5.47; 97.1932183; 75.4516664; 
65; 5.47; 71; 5.47; 96.6135574; 75; 5.47; 96.6089548; 75.3668905; 
66; 5.47; 71; 5.47; 96.5782891; 75; 5.47; 96.5230889; 75.6963128; 
67; 5.47; 71; 5.47; 96.5412988; 75; 5.47; 96.510002; 75; 
68; 4.67685; 71; 5.47; 96.5025991; 75; 5.47; 96.5210722; 75; 
69; 4.67685; 71; 4.67685; 96.4622026; 75; 4.67685; 96.4574016; 75; 
70; 4.67685; 71; 4.67685; 96.4201218; 75; 4.67685; 96.4153242; 75; 
71; 4.67685; 71; 4.67685; 96.3763689; 75; 4.67685; 96.3715739; 75; 
72; 4.67685; 71; 4.67685; 96.3309562; 75; 4.67685; 96.3261634; 75.6532914; 
73; 4.67685; 71; 4.67685; 96.283896; 75; 4.67685; 96.2791052; 75; 
74; 4.67685; 71; 4.67685; 96.2352003; 75; 4.67685; 96.2304113; 75.6597875; 
75; 4.67685; 71; 4.67685; 96.1848811; 75; 4.67685; 95.3755666; 75.7003075; 
76; 4.67685; 71; 4.67685; 96.1329503; 75; 4.67685; 95.7032081; 75.0854729; 
77; 4.67685; 71; 4.67685; 96.0794198; 75; 4.67685; 96.4403992; 75.644086; 
78; 9.43575; 71; 10.89; 77.043261; 80; 9.039175; 77.0343204; 80; 
79; 9.43575; 71; 10.89; 74.6388615; 78.7103688; 9.039175; 74.629921; 79.163609; 
80; 9.43575; 71; 10.89; 70.7118016; 80; 11.2082782; 70.7073675; 80; 
81; 9.43575; 71; 10.89; 50.7346935; 80; 11.2082782; 50.7346935; 80; 
82; 9.43575; 71; 10.89; 50.7346935; 77.5654272; 11.2082782; 50.7346935; 77.2216705; 
83; 8.06756625; 71; 9.31095; 79.5255668; 75; 9.58307787; 79.5166262; 75; 
84; 8.06756625; 71; 10.89; 102.071678; 75; 11.2082782; 103.128995; 75; 
85; 8.06756625; 71; 9.31095; 97.4102042; 75; 9.58307787; 97.50724; 75; 
86; 8.06756625; 71; 9.31095; 84.4861361; 80; 9.58307787; 84.4771956; 80; 
87; 9.194135; 71; 10.51715; 67.122388; 80; 9.58307787; 67.1134474; 75; 
88; 13.32; 71; 10.89; 57.2342779; 80; 11.2082782; 56.3040958; 80; 
89; 13.32; 71; 10.89; 50.7346935; 80; 11.2082782; 50.7346957; 80; 
90; 13.32; 71; 10.89; 50.7346935; 80; 11.2082782; 50.7346935; 78.0643394; 
91; 13.32; 71; 10.89; 50.7346935; 80; 11.2082782; 50.7346935; 80; 
92; 13.32; 71; 10.89; 50.7346935; 80; 11.2082782; 50.7346935; 80; 
93; 13.32; 71; 10.89; 50.7346935; 80; 11.2082782; 50.7346935; 78.4559649; 
94; 13.32; 71; 10.89; 50.7346935; 80; 11.2082782; 50.7346935; 80; 
95; 13.32; 71; 10.89; 50.7346935; 80; 11.2082782; 50.7346935; 80; 
96; 13.32; 71; 16; 81.1549111; 75; 16; 81.1549111; 75; 
