t; nomPriceB7; nomPlPowB7; integrPriceB7; integrPlPowB7; integrT_in_B7; disagg_price_bus7; PlPowB7; disaggT_in_B7; nomPriceB6; nomPlPowB6; integrPriceB6; integrPlPowB6; integrT_in_B6; disagg_price_bus6; PlPowB6; disaggT_in_B6;  initFeasThres; finalFeasThres; accept_gap; iterations; CPUmaster; CPUsubproblem; CPUsubsolve; CPUsubcutgen; CPUfeasPt; finalDetectGap; nomCongestionCost; intCongestionCost; disaggCongestionCost; Objective; nomImprovPercent; CoopPotentialPercent; nominalCost; integratedCost
1; 13.32; 62.5; 13.32; 53.5356974; 80; 13.32; 53.5356974; 80; 13.32; 68; 13.32; 58.2468388; 80; 13.32; 58.2468388; 80; 261; 261; 0.0001; 52; 2.57573009; 13.6559677; 11.9195871; 1.73576903; 1.32536995; 8.53150515e-05; 231549.283; 38663.9828; 38665.4813; 1817720.63; 15.509555; 99.9790037; 2151391.95; 1817650.56
2; 13.32; 62.5; 13.32; 53.1399181; 80; 13.32; 44.6608217; 80; 13.32; 68; 13.32; 48.590974; 80; 13.32; 57.068916; 80; 
3; 13.32; 62.5; 16.3239513; 53.0553316; 80; 13.32; 44.6612545; 80; 13.32; 68; 16.3239513; 48.590974; 80; 13.32; 56.9850398; 80; 
4; 13.32; 62.5; 16.3239513; 44.6608217; 80; 13.32; 44.6612502; 80; 13.32; 68; 16.3239513; 48.590974; 80; 13.32; 48.5916659; 80; 
5; 13.32; 62.5; 16.3239513; 49.6301066; 80; 13.32; 44.6608217; 80; 13.32; 68; 16.3239513; 48.590974; 80; 13.32; 56.9512985; 80; 
6; 13.32; 62.5; 16.3239513; 58.5448366; 80; 13.32; 44.6608217; 80; 13.32; 68; 16.3239513; 61.4510945; 80; 13.32; 75.3008389; 80; 
7; 13.32; 62.5; 16.3239513; 54.6370854; 80; 13.32; 44.6608217; 80; 13.32; 68; 16.3239513; 61.3228034; 80; 13.32; 67.9407374; 80; 
8; 13.32; 62.5; 16.3239513; 61.9571475; 80; 13.32; 44.6608217; 80; 13.32; 68; 16.3239513; 48.590974; 80; 13.32; 65.8868512; 80; 
9; 13.32; 62.5; 16.3239513; 60.7050788; 80; 28.8086253; 44.6608217; 80; 13.32; 68; 16.3239513; 48.590974; 80; 28.8086253; 64.6354547; 80; 
10; 14.9866667; 62.5; 19.0923407; 44.6608217; 80; 24.6313747; 44.6608217; 80; 14.9866667; 68; 19.0923407; 48.590974; 80; 24.6313747; 48.590974; 80; 
11; 38.7333333; 62.5; 30.1; 44.6608217; 80; 30.1; 44.6608217; 80; 38.7333333; 68; 30.1; 48.590974; 80; 30.1; 48.590974; 80; 
12; 38.7333333; 62.5; 30.1; 44.6608217; 80; 30.1; 44.6608217; 80; 38.7333333; 68; 30.1; 48.590974; 80; 30.1; 48.590974; 80; 
13; 38.7333333; 62.5; 30.1; 44.6608217; 80; 30.1; 44.6608217; 80; 38.7333333; 68; 30.1; 48.590974; 80; 30.1; 48.590974; 80; 
14; 38.7333333; 62.5; 30.1; 44.6608217; 80; 30.1; 44.6608217; 80; 38.7333333; 68; 30.1; 48.590974; 80; 30.1; 48.590974; 80; 
15; 20.7; 62.5; 30.1; 44.6608217; 80; 30.1; 44.6608217; 80; 38.7333333; 68; 30.1; 48.590974; 80; 30.1; 48.590974; 80; 
16; 20.7; 62.5; 20.7; 44.6608217; 80; 20.7; 44.6608217; 80; 38.7333333; 68; 30.1; 48.590974; 80; 30.1; 48.590974; 80; 
17; 20.7; 62.5; 20.7; 44.6608217; 80; 20.7; 44.6608217; 80; 38.7333333; 68; 30.1; 48.590974; 80; 30.1; 48.590974; 80; 
18; 20.7; 62.5; 20.7; 44.6608217; 80; 20.7; 44.6608217; 80; 38.7333333; 68; 30.1; 48.590974; 80; 30.1; 48.590974; 80; 
19; 20.7; 62.5; 20.7; 44.6608217; 80; 20.7; 44.6608217; 80; 38.7333333; 68; 30.1; 48.590974; 80; 30.1; 48.590974; 80; 
20; 20.7; 62.5; 20.7; 44.6608217; 80; 20.7; 44.6608217; 80; 38.7333333; 68; 30.1; 48.590974; 80; 30.1; 48.590974; 80; 
21; 20.7; 62.5; 20.7; 44.6608217; 80; 20.7; 44.6608217; 80; 38.7333333; 68; 30.1; 48.590974; 80; 30.1; 48.590974; 80; 
22; 20.7; 62.5; 20.7; 44.6608217; 80; 20.7; 44.6608217; 80; 38.7333333; 68; 30.1; 48.590974; 80; 30.1; 48.590974; 80; 
23; 20.7; 62.5; 20.7; 44.6608217; 80; 20.7; 44.6608217; 80; 38.7333333; 68; 30.1; 48.590974; 80; 30.1; 48.590974; 80; 
24; 20.7; 62.5; 20.7; 44.6608217; 80; 20.7; 44.6608217; 80; 38.7333333; 68; 30.1; 48.590974; 80; 30.1; 48.590974; 80; 
25; 20.7; 62.5; 20.7; 44.6608217; 80; 20.7; 44.6608217; 80; 254.927478; 68; 54.7842611; 48.590974; 80; 54.7864019; 48.590974; 80; 
26; 20.7; 62.5; 20.7; 44.6608217; 80; 20.7; 44.6608217; 80; 254.927478; 68; 54.7842611; 48.590974; 80; 54.7864019; 48.590974; 80; 
27; 20.7; 62.5; 20.7; 44.6608217; 80; 20.7; 44.6608217; 80; 217.962993; 68; 54.7842611; 48.590974; 80; 54.7864019; 48.590974; 80; 
28; 20.7; 62.5; 20.7; 44.6608217; 80; 20.7; 44.6608217; 80; 254.927478; 68; 54.7842611; 48.590974; 80; 54.7864019; 48.590974; 80; 
29; 20.7; 62.5; 20.7; 44.6608217; 80; 20.7; 44.6608217; 80; 254.927478; 68; 20.7; 48.590974; 80; 20.7; 48.590974; 80; 
30; 20.7; 62.5; 20.7; 44.6608217; 80; 20.7; 44.6608217; 80; 25.0162612; 68; 20.7; 48.590974; 80; 20.7; 48.590974; 80; 
31; 20.7; 62.5; 20.7; 44.6608217; 80; 20.7; 44.6608217; 80; 25.0162612; 68; 20.7; 48.590974; 80; 20.7; 48.590974; 80; 
32; 25.0162612; 62.5; 20.7; 44.6608217; 80; 20.7; 44.6608217; 80; 25.0162612; 68; 20.7; 48.590974; 80; 20.7; 48.590974; 80; 
33; 25.0162612; 62.5; 20.7; 44.6608217; 80; 20.7; 44.6608217; 80; 25.0162612; 68; 20.7; 48.590974; 80; 20.7; 48.590974; 80; 
34; 25.0162612; 62.5; 20.7; 44.6608217; 80; 20.7; 44.6608217; 80; 25.0162612; 68; 20.7; 48.590974; 80; 20.7; 48.590974; 80; 
35; 25.0162612; 62.5; 20.7; 44.6608217; 80; 20.7; 44.6608217; 80; 25.0162612; 68; 20.7; 48.590974; 80; 20.7; 48.590974; 80; 
36; 25.0162612; 62.5; 20.7; 44.6608217; 80; 20.7; 44.6608217; 80; 25.0162612; 68; 20.7; 48.590974; 80; 20.7; 48.590974; 80; 
37; 29.258785; 62.5; 24.2105263; 44.6608217; 80; 24.2105263; 44.6608217; 80; 29.258785; 68; 24.2105263; 48.590974; 80; 24.2105263; 48.590974; 80; 
38; 29.258785; 62.5; 24.2105263; 44.6608217; 80; 24.2105263; 44.6608217; 80; 29.258785; 68; 24.2105263; 48.590974; 80; 24.2105263; 48.590974; 80; 
39; 29.258785; 62.5; 24.2105263; 44.6608217; 80; 24.2105263; 44.6608217; 80; 29.258785; 68; 24.2105263; 48.590974; 80; 24.2105263; 48.590974; 80; 
40; 29.258785; 62.5; 24.2105263; 44.6608217; 80; 24.2105263; 44.6608217; 80; 29.258785; 68; 24.2105263; 48.590974; 80; 24.2105263; 48.590974; 80; 
41; 29.258785; 62.5; 24.2105263; 44.6608217; 80; 24.2105263; 44.6608217; 80; 29.258785; 68; 24.2105263; 48.590974; 80; 24.2105263; 49.1249335; 80; 
42; 29.258785; 62.5; 24.2105263; 44.6608217; 80; 24.2105263; 44.6608217; 80; 29.258785; 68; 24.2105263; 48.590974; 80; 24.2105263; 49.1196068; 80; 
43; 29.258785; 62.5; 24.2105263; 44.6608217; 80; 24.2105263; 44.6608217; 80; 29.258785; 68; 24.2105263; 48.590974; 80; 24.2105263; 48.590974; 80; 
44; 29.258785; 62.5; 20.7; 44.6608217; 80; 20.7; 44.6608217; 80; 29.258785; 68; 20.7; 48.590974; 80; 20.7; 49.0159343; 80; 
45; 6.79841422; 62.5; 24.2105263; 47.3509357; 80; 24.2105263; 44.6608217; 80; 6.79841422; 68; 24.2105263; 72.8343633; 80; 24.2105263; 73.2489884; 80; 
46; 5.47; 62.5; 9.710931; 52.2472535; 80; 10.530091; 44.6608217; 80; 5.47; 68; 9.710931; 72.592514; 80; 10.530091; 79.2321357; 80; 
47; 5.47; 62.5; 11.357814; 58.4991661; 80; 10.530091; 66.9571639; 80; 5.47; 68; 11.357814; 66.0222444; 80; 10.530091; 56.1844668; 80; 
48; 5.47; 62.5; 11.357814; 59.4963675; 80; 12.3158959; 74.9165526; 80; 5.47; 68; 11.357814; 75.6015137; 80; 12.3158959; 59.0012457; 77.423819; 
49; 5.47; 62.5; 9.710931; 76.2527973; 75; 12.3158959; 62.1402461; 77.5555296; 5.47; 68; 9.710931; 72.8636167; 75; 12.3158959; 85.7960849; 75; 
50; 5.47; 62.5; 9.710931; 90.6391995; 75; 5.47; 80.3187964; 75; 5.47; 68; 9.710931; 89.9198927; 75; 5.47; 98.6541311; 75; 
51; 5.47; 62.5; 5.47; 85.5579712; 75; 5.47; 91.2028271; 75.5227641; 5.47; 68; 5.47; 97.5445999; 75; 5.47; 93.282322; 75; 
52; 5.47; 62.5; 5.47; 85.5802934; 75; 5.47; 85.3316472; 76.0017298; 5.47; 68; 5.47; 93.1039919; 75; 5.47; 93.3054486; 75.2555473; 
53; 5.47; 62.5; 5.47; 85.5904582; 75; 5.47; 85.0576559; 75.9448846; 5.47; 68; 5.47; 93.1151044; 75; 5.47; 93.2201708; 75.1880599; 
54; 5.47; 62.5; 5.47; 85.5924533; 75; 5.47; 85.1965216; 75.9382078; 5.47; 68; 5.47; 93.1173329; 75; 5.47; 93.2298594; 75.1408225; 
55; 5.47; 62.5; 5.47; 85.5905609; 75; 5.47; 85.4775747; 75.7836609; 5.47; 68; 5.47; 93.1153303; 75; 5.47; 93.318264; 75.1393123; 
56; 5.47; 62.5; 5.47; 85.5857315; 75; 5.47; 85.3429833; 75.9911591; 5.47; 68; 5.47; 93.1101264; 75; 5.47; 93.3042596; 75.1402361; 
57; 5.47; 62.5; 5.47; 85.5786907; 75; 5.47; 85.200724; 75.9397635; 5.47; 68; 5.47; 93.1025184; 75; 5.47; 93.2950691; 75.1661943; 
58; 5.47; 62.5; 5.47; 85.5696964; 75; 5.47; 85.2581326; 75.6687824; 5.47; 68; 5.47; 93.0927848; 75; 5.47; 93.2837217; 75.0577933; 
59; 5.47; 62.5; 5.47; 85.5589017; 75; 5.47; 85.3837405; 75.9268979; 5.47; 68; 5.47; 93.0810917; 75; 5.47; 93.2704065; 75.0399417; 
60; 5.47; 62.5; 5.47; 85.5463846; 75; 5.47; 85.3099806; 75.8927644; 5.47; 68; 5.47; 93.0675245; 75; 5.47; 93.2552195; 75; 
61; 5.47; 62.5; 8.79315789; 85.5321886; 75; 9.02197368; 85.2975187; 75.5882881; 5.47; 68; 8.79315789; 93.0521302; 75; 9.02197368; 93.2382129; 75; 
62; 5.47; 62.5; 8.79315789; 85.5163404; 75; 9.02197368; 85.2833919; 76.109547; 5.47; 68; 8.79315789; 93.0349378; 75; 9.02197368; 93.2194179; 75.2064344; 
63; 6.39766082; 62.5; 8.79315789; 85.4988587; 75; 9.02197368; 85.0795234; 75.9448652; 6.39766082; 68; 8.79315789; 93.015968; 75; 9.02197368; 93.1988563; 75.0884731; 
64; 6.39766082; 62.5; 8.79315789; 85.479759; 75; 9.02197368; 85.150862; 75.9167128; 6.39766082; 68; 8.79315789; 92.9952372; 75; 9.02197368; 93.1765449; 75.0581384; 
65; 6.39766082; 62.5; 8.79315789; 85.4590544; 75; 9.02197368; 85.3167087; 75.9431431; 6.39766082; 68; 8.79315789; 92.9727601; 75; 9.02197368; 93.1524985; 75.0131913; 
66; 6.39766082; 62.5; 8.79315789; 85.4367575; 75; 9.02197368; 85.2096073; 75.9529362; 6.39766082; 68; 8.79315789; 92.9485501; 75; 9.02197368; 93.1267307; 75; 
67; 6.39766082; 62.5; 8.79315789; 85.4128802; 75; 9.02197368; 85.1873964; 75.9295221; 6.39766082; 68; 8.79315789; 92.9226204; 75; 9.02197368; 93.0992545; 75; 
68; 6.39766082; 62.5; 8.79315789; 85.3874345; 75; 9.02197368; 85.1636046; 75.9519565; 6.39766082; 68; 8.79315789; 92.8949838; 75; 9.02197368; 93.0700827; 75; 
69; 6.39766082; 62.5; 8.79315789; 85.3604317; 75; 9.02197368; 85.1382438; 75.9968186; 6.39766082; 68; 8.79315789; 92.8656528; 75; 9.02197368; 92.6048685; 75; 
70; 5.47; 62.5; 7.51815; 85.3318834; 75; 7.7137875; 85.1113253; 75.9896672; 5.47; 68; 7.51815; 92.8346399; 75; 7.7137875; 92.7772706; 75; 
71; 5.47; 62.5; 7.51815; 85.3018009; 75; 7.7137875; 85.0028652; 76.1506336; 5.47; 68; 7.51815; 92.8019575; 75; 7.7137875; 93.1699914; 75; 
72; 5.47; 62.5; 7.51815; 85.2701955; 75; 7.7137875; 85.0106072; 75.9396907; 5.47; 68; 7.51815; 92.7676178; 75; 7.7137875; 92.9344667; 75; 
73; 5.47; 62.5; 7.51815; 85.2370784; 75; 7.7137875; 85.057707; 76.0645587; 5.47; 68; 7.51815; 92.731633; 75; 7.7137875; 92.6650144; 75; 
74; 5.47; 62.5; 7.51815; 85.2024606; 75; 7.7137875; 84.9878943; 76.0097661; 5.47; 68; 7.51815; 92.6940151; 75; 7.7137875; 92.7354018; 75; 
75; 5.47; 62.5; 7.51815; 85.1663532; 75; 7.7137875; 84.9533608; 76.0401411; 5.47; 68; 7.51815; 92.6547762; 75; 7.7137875; 92.9227433; 75; 
76; 5.47; 62.5; 7.51815; 85.1287671; 75; 7.7137875; 84.9173371; 76.0502368; 5.47; 68; 7.51815; 92.6139281; 75; 7.7137875; 92.7738011; 75; 
77; 10.1652712; 62.5; 10.0941068; 85.0897131; 75; 14.3962313; 84.879834; 75.7290469; 10.1652712; 68; 10.0941068; 92.5714826; 75; 14.3962313; 92.7299434; 75.1627968; 
78; 17.3550271; 62.5; 15.633368; 76.742464; 80; 14.3962313; 84.8408625; 76.2675388; 17.3550271; 68; 15.633368; 83.489712; 80; 14.3962313; 70.5387761; 80; 
79; 17.3550271; 62.5; 15.633368; 68.5194452; 80; 14.3962313; 64.6403063; 80; 17.3550271; 68; 15.633368; 74.5431185; 80; 14.3962313; 56.3889678; 75.2911719; 
80; 17.3550271; 62.5; 15.633368; 61.2506466; 80; 14.3962313; 62.4441309; 75.4535351; 17.3550271; 68; 15.633368; 73.4937123; 80; 14.3962313; 56.3111759; 80; 
81; 17.3550271; 62.5; 15.633368; 49.3236284; 75; 14.3962313; 62.2667266; 75; 17.3550271; 68; 15.633368; 60.4517074; 75; 14.3962313; 48.590974; 80; 
82; 17.3550271; 62.5; 15.633368; 65.4470021; 75; 14.3962313; 67.0102193; 75; 17.3550271; 68; 15.633368; 55.3945994; 75; 14.3962313; 54.6035894; 75.4263961; 
83; 16; 62.5; 13.3665297; 74.2039445; 75; 14.3962313; 90.8655916; 75; 16; 68; 13.3665297; 78.4354978; 75; 14.3962313; 62.6136681; 75; 
84; 14.8385482; 62.5; 15.633368; 79.6035401; 75; 12.7755637; 88.4917533; 75; 14.8385482; 68; 15.633368; 98.5883978; 75; 12.7755637; 85.7153843; 75; 
85; 14.8385482; 62.5; 13.3665297; 91.4780357; 75; 14.3962313; 84.4247016; 75; 14.8385482; 68; 13.3665297; 97.439106; 75; 14.3962313; 101.735033; 75; 
86; 14.8385482; 62.5; 14.4566282; 85.6522776; 75; 14.3962313; 83.8223438; 75; 14.8385482; 68; 14.4566282; 92.3472515; 75; 14.3962313; 94.6405468; 75; 
87; 14.8385482; 62.5; 15.633368; 73.6153173; 75; 14.3962313; 84.0375383; 75; 14.8385482; 68; 15.633368; 92.2994511; 75; 14.3962313; 92.3335578; 75; 
88; 14.8385482; 62.5; 13.3665297; 62.5000009; 80; 14.3962313; 84.5356258; 75; 14.8385482; 68; 13.3665297; 73.4538896; 80; 14.3962313; 70.5886259; 75; 
89; 14.8385482; 62.5; 15.633368; 54.4613421; 80; 14.3962313; 83.8486531; 75; 14.8385482; 68; 15.633368; 64.005679; 80; 14.3962313; 48.8354921; 80; 
90; 14.8385482; 62.5; 15.633368; 54.5415348; 80; 14.3962313; 63.9565118; 80; 14.8385482; 68; 15.633368; 60.7836033; 80; 14.3962313; 77.7258304; 75; 
91; 17.3550271; 62.5; 15.633368; 53.5356979; 80; 14.3962313; 52.692878; 80; 17.3550271; 68; 15.633368; 58.0330288; 80; 14.3962313; 77.4351843; 80; 
92; 17.3550271; 62.5; 15.633368; 53.6251248; 80; 14.3962313; 52.6127511; 75.2289896; 17.3550271; 68; 15.633368; 67.6919976; 80; 14.3962313; 48.590974; 76.1512724; 
93; 17.3550271; 62.5; 15.633368; 53.5356979; 80; 14.3962313; 44.6608217; 80; 17.3550271; 68; 15.633368; 58.2468393; 80; 14.3962313; 48.590974; 80; 
94; 17.3550271; 62.5; 15.633368; 52.226584; 80; 14.3962313; 44.6608217; 78.578827; 17.3550271; 68; 15.633368; 48.590974; 80; 14.3962313; 48.590974; 80; 
95; 17.3550271; 62.5; 15.633368; 52.1511088; 80; 14.3962313; 44.6608217; 80; 17.3550271; 68; 15.633368; 48.590974; 80; 14.3962313; 48.590974; 80; 
96; 17.3550271; 62.5; 26.11; 64.7198531; 80; 36.865892; 69.1761135; 75; 17.3550271; 68; 26.11; 72.1425958; 80; 36.865892; 77.7258304; 75; 
