t; nomPriceB5; nomPlPowB5; integrPriceB5; integrPlPowB5; integrT_in_B5; disagg_price_bus5; PlPowB5; disaggT_in_B5;  initFeasThres; finalFeasThres; accept_gap; iterations; CPUmaster; CPUsubproblem; CPUfeasPt; finalDetectGap; nomCongestionCost; intCongestionCost; disaggCongestionCost; Objective; nomImprovPercent; CoopPotentialPercent; nominalCost; integratedCost
1; 10.52; 71; 10.52; 60.8165523; 80; 10.52; 60.8165523; 80; 71; 33.2087922; 0.0001; 143; 6.53145696; 8.94182915; 0.408922476; 8.43794232e-05; 6.18824889e-10; 5.68573351e-10; -6.72020558e-10; 1804476.38; 0.508341271; 98.9529609; 1813696.15; 1804378.83
2; 10.52; 71; 10.52; 50.7346935; 80; 10.52; 50.7346935; 80; 
3; 10.52; 71; 10.52; 50.7346935; 80; 10.52; 57.8264358; 80; 
4; 10.52; 71; 10.52; 50.7346935; 80; 10.52; 58.5884278; 80; 
5; 10.52; 71; 10.52; 50.7346935; 80; 10.52; 57.3549769; 80; 
6; 10.52; 71; 10.52; 50.7346935; 80; 10.52; 62.0862383; 80; 
7; 10.52; 71; 10.52; 50.7346935; 80; 10.52; 68.2935564; 80; 
8; 10.52; 71; 10.52; 69.8574689; 80; 10.52; 79.5396141; 79.8544832; 
9; 10.52; 71; 10.52; 77.2645831; 80; 10.52; 70.4589522; 80; 
10; 10.52; 71; 10.52; 58.2567787; 80; 10.52; 53.6748573; 80; 
11; 14.59; 71; 14.59; 50.7346935; 80; 14.59; 50.7346935; 80; 
12; 15.5475; 71; 15.3761538; 50.7346935; 80; 15.3761538; 50.7346935; 80; 
13; 15.5475; 71; 15.3761538; 50.7346935; 80; 15.3761538; 50.7346935; 80; 
14; 15.5475; 71; 15.3761538; 50.7346935; 80; 15.3761538; 50.7346935; 80; 
15; 15.5475; 71; 15.3761538; 50.7346935; 80; 15.3761538; 50.7346935; 80; 
16; 15.5475; 71; 15.3761538; 50.7346935; 80; 15.3761538; 50.7346935; 80; 
17; 15.5475; 71; 15.3761538; 50.7346935; 80; 15.3761538; 50.7346935; 80; 
18; 15.5475; 71; 15.3761538; 50.7346935; 80; 15.3761538; 50.7346935; 80; 
19; 15.5475; 71; 15.3761538; 50.7346935; 80; 15.3761538; 50.7346935; 80; 
20; 15.5475; 71; 15.3761538; 50.7346935; 80; 15.3761538; 50.7346935; 80; 
21; 15.5475; 71; 15.3761538; 50.7346935; 80; 15.3761538; 50.7346935; 80; 
22; 15.5475; 71; 15.3761538; 50.7346935; 80; 15.3761538; 50.7346935; 80; 
23; 15.5475; 71; 15.3761538; 50.7346935; 80; 15.3761538; 50.7346935; 80; 
24; 15.5475; 71; 15.3761538; 50.7346935; 80; 15.3761538; 50.7346935; 80; 
25; 17.81; 71; 16.6238462; 50.7346935; 80; 16.6238462; 50.7346935; 80; 
26; 16; 71; 16; 50.7346935; 80; 16; 50.7346935; 80; 
27; 16; 71; 16; 50.7346935; 80; 16; 50.7346935; 80; 
28; 16; 71; 16; 50.7346935; 80; 16; 50.7346935; 80; 
29; 16; 71; 16; 50.7346935; 80; 16; 50.7346935; 80; 
30; 16; 71; 16; 50.7346935; 80; 16; 50.7346935; 80; 
31; 16; 71; 16; 50.7346935; 80; 16; 50.7346935; 80; 
32; 16; 71; 16; 50.7346935; 80; 16; 50.7346935; 80; 
33; 16; 71; 16; 50.7346935; 80; 16; 50.7346935; 80; 
34; 16; 71; 16; 50.7346935; 80; 16; 50.7346935; 80; 
35; 16; 71; 16; 50.7346935; 80; 16; 50.7346935; 80; 
36; 16; 71; 16; 50.7346935; 80; 16; 50.7346935; 80; 
37; 20.4725; 71; 18.7134503; 50.7346935; 80; 18.7134503; 50.7346935; 80; 
38; 20.4725; 71; 18.7134503; 50.7346935; 80; 18.7134503; 50.7346935; 80; 
39; 20.7; 71; 18.7134503; 50.7346935; 80; 18.7134503; 50.7346935; 80; 
40; 20.7; 71; 20.7; 50.7346935; 80; 20.7; 50.7346935; 80; 
41; 20.4725; 71; 18.7134503; 50.7346935; 80; 18.7134503; 50.7346935; 80; 
42; 20.4725; 71; 18.7134503; 50.7346935; 80; 18.7134503; 51.4682555; 80; 
43; 13.4015; 71; 12.9127485; 64.1023604; 80; 12.9127485; 63.7530735; 80; 
44; 4.67685; 71; 6.32194144; 83.6109579; 79.7482587; 7.75261456; 83.8364047; 79.3220968; 
45; 5.47; 71; 7.39408356; 93.3287969; 75; 9.06738544; 92.4881127; 76.1458804; 
46; 4.67685; 71; 6.32194144; 96.8411562; 75; 4.67685; 94.8286531; 75; 
47; 4.67685; 71; 7.39408356; 96.8946516; 75; 5.47; 97.0565255; 75; 
48; 4.67685; 71; 4.67685; 96.9154079; 75; 4.67685; 97.073756; 75; 
49; 4.67685; 71; 4.67685; 96.9238076; 75; 5.14205; 97.084659; 75; 
50; 4.67685; 71; 4.67685; 96.9223545; 75; 4.67685; 96.1279079; 75.5062107; 
51; 4.67685; 71; 4.67685; 96.9169829; 75; 4.67685; 96.1372995; 75; 
52; 4.67685; 71; 4.67685; 96.9083789; 75; 4.67685; 96.1482086; 75.4945585; 
53; 4.67685; 71; 4.67685; 96.8972429; 75; 4.67685; 96.1538428; 75; 
54; 4.67685; 71; 4.67685; 96.8839188; 75; 4.67685; 96.8314983; 75.127575; 
55; 5.47; 71; 5.47; 96.8685758; 75; 5.47; 96.8229171; 75; 
56; 5.47; 71; 5.47; 96.8513006; 75; 5.47; 97.0469774; 75; 
57; 5.47; 71; 5.47; 96.8321414; 75; 5.47; 97.0289469; 75; 
58; 5.47; 71; 5.47; 96.8111279; 75; 5.47; 96.5920238; 75; 
59; 5.47; 71; 5.47; 96.7882811; 75; 5.47; 96.7655657; 75; 
60; 5.47; 71; 5.47; 96.7636181; 75; 5.47; 97.1498538; 75; 
61; 5.47; 71; 5.47; 96.7371538; 75; 5.47; 96.9317624; 75; 
62; 5.47; 71; 5.47; 96.7089022; 75; 5.47; 96.9032406; 75; 
63; 5.47; 71; 5.47; 96.6788769; 75; 5.47; 95.4216371; 75; 
64; 5.47; 71; 5.47; 96.6470909; 75; 5.47; 96.074269; 75; 
65; 5.47; 71; 5.47; 96.6135574; 75; 5.47; 97.4668267; 75; 
66; 5.47; 71; 5.47; 96.5782891; 75; 5.47; 96.5364291; 75; 
67; 5.47; 71; 5.47; 96.5412988; 75; 5.47; 96.6065868; 75; 
68; 4.67685; 71; 5.47; 96.5025991; 75; 5.47; 96.7913562; 75; 
69; 4.67685; 71; 4.67685; 96.4622026; 75; 4.67685; 96.6460815; 75; 
70; 4.67685; 71; 4.67685; 96.4201218; 75; 4.67685; 96.603776; 75; 
71; 4.67685; 71; 4.67685; 96.3763689; 75; 4.67685; 96.5193875; 75; 
72; 4.67685; 71; 4.67685; 96.3309562; 75; 4.67685; 95.6130339; 75; 
73; 4.67685; 71; 4.67685; 96.283896; 75; 4.67685; 96.0205497; 75; 
74; 4.67685; 71; 4.67685; 96.2352003; 75; 4.67685; 96.8177433; 75; 
75; 4.67685; 71; 4.67685; 96.1848811; 75; 4.67685; 96.362732; 75; 
76; 4.67685; 71; 4.67685; 96.1329503; 75; 4.67685; 96.3106206; 75; 
77; 4.67685; 71; 4.67685; 96.0794198; 75; 4.67685; 95.2072264; 75.5564113; 
78; 9.43575; 71; 10.89; 77.043261; 80; 10.7881508; 81.8038625; 75; 
79; 9.43575; 71; 10.89; 74.6388615; 78.7103688; 9.22386894; 66.1372078; 75; 
80; 9.43575; 71; 10.89; 70.7118016; 80; 10.7881508; 56.8130392; 78.2941931; 
81; 9.43575; 71; 10.89; 50.7346935; 80; 10.7881508; 53.555234; 77.8910164; 
82; 9.43575; 71; 10.89; 50.7346935; 77.5654272; 10.7881508; 53.4131539; 80; 
83; 8.06756625; 71; 9.31095; 79.5255668; 75; 10.7881508; 78.1733768; 78.7276628; 
84; 8.06756625; 71; 10.89; 102.071678; 75; 10.7881508; 91.8911184; 75; 
85; 8.06756625; 71; 9.31095; 97.4102042; 75; 9.22386894; 85.1541506; 75; 
86; 8.06756625; 71; 9.31095; 84.4861361; 80; 10.7881508; 83.1339461; 80; 
87; 9.194135; 71; 10.51715; 67.122388; 80; 10.7881508; 65.770198; 80; 
88; 13.32; 71; 10.89; 57.2342779; 80; 10.7881508; 56.6847384; 80; 
89; 13.32; 71; 10.89; 50.7346935; 80; 10.7881508; 53.5685769; 80; 
90; 13.32; 71; 10.89; 50.7346935; 80; 10.7881508; 50.7346935; 80; 
91; 13.32; 71; 10.89; 50.7346935; 80; 10.7881508; 50.7346935; 80; 
92; 13.32; 71; 10.89; 50.7346935; 80; 10.7881508; 50.7346935; 80; 
93; 13.32; 71; 10.89; 50.7346935; 80; 10.7881508; 52.417671; 80; 
94; 13.32; 71; 10.89; 50.7346935; 80; 10.7881508; 54.7627677; 80; 
95; 13.32; 71; 10.89; 50.7346935; 80; 10.7881508; 53.0730174; 77.8935999; 
96; 13.32; 71; 16; 81.1549111; 75; 15.8518492; 73.4219879; 75; 
