t; nomPriceB5; nomPlPowB5; integrPriceB5; integrPlPowB5; integrT_in_B5; disagg_price_bus5; PlPowB5; disaggT_in_B5; nomPriceB7; nomPlPowB7; integrPriceB7; integrPlPowB7; integrT_in_B7; disagg_price_bus7; PlPowB7; disaggT_in_B7; nomPriceB8; nomPlPowB8; integrPriceB8; integrPlPowB8; integrT_in_B8; disagg_price_bus8; PlPowB8; disaggT_in_B8;  initFeasThres; finalFeasThres; accept_gap; iterations; CPUmaster; CPUsubproblem; CPUsubsolve; CPUsubcutgen; CPUfeasPt; finalDetectGap; nomCongestionCost; intCongestionCost; disaggCongestionCost; Objective; nomImprovPercent; CoopPotentialPercent; nominalCost; integratedCost
1; 10.52; 32.802; 10.52; 28.0972472; 80; 10.52; 28.0972472; 80; 10.52; 31.7; 10.52; 27.1533057; 80; 10.52; 27.1533057; 80; 10.52; 6.498; 10.52; 5.56599939; 80; 10.52; 5.56599939; 80; 142; 142; 0.0001; 42; 2.11680293; 17.0683861; 14.9893732; 2.07850409; 1.35823703; 6.17963587e-05; 9.56826312e-11; -9.49630628e-11; 8.02261806e-10; 1804460.4; 0.509222518; 99.124503; 1813696.15; 1804378.83
2; 10.52; 32.802; 10.52; 23.4394284; 80; 10.52; 23.4394284; 80; 10.52; 31.7; 10.52; 22.6519688; 80; 10.52; 22.6519688; 80; 10.52; 6.498; 10.52; 4.64329631; 80; 10.52; 4.64329631; 80; 
3; 10.52; 32.802; 10.52; 23.4394284; 80; 10.52; 23.4394284; 80; 10.52; 31.7; 10.52; 22.6519688; 80; 10.52; 22.6519688; 80; 10.52; 6.498; 10.52; 4.64329631; 80; 10.52; 4.64329631; 80; 
4; 10.52; 32.802; 10.52; 23.4394284; 80; 10.52; 23.4394284; 80; 10.52; 31.7; 10.52; 22.6519688; 80; 10.52; 22.6519688; 80; 10.52; 6.498; 10.52; 4.64329631; 80; 10.52; 4.64329631; 80; 
5; 10.52; 32.802; 10.52; 23.4394284; 80; 10.52; 23.4394284; 80; 10.52; 31.7; 10.52; 22.6519688; 80; 10.52; 22.6519688; 80; 10.52; 6.498; 10.52; 4.64329631; 80; 10.52; 4.64329631; 80; 
6; 10.52; 32.802; 10.52; 23.4394284; 80; 10.52; 23.4394284; 80; 10.52; 31.7; 10.52; 22.6519688; 80; 10.52; 22.6519688; 80; 10.52; 6.498; 10.52; 4.64329631; 80; 10.52; 4.64329631; 80; 
7; 10.52; 32.802; 10.52; 23.4394284; 80; 10.52; 23.4394284; 80; 10.52; 31.7; 10.52; 22.6519688; 80; 10.52; 22.6519688; 80; 10.52; 6.498; 10.52; 4.64329631; 80; 10.52; 4.64329631; 80; 
8; 10.52; 32.802; 10.52; 34.5479206; 80; 10.52; 30.5596519; 80; 10.52; 31.7; 10.52; 29.7342501; 80; 10.52; 29.4176983; 80; 10.52; 6.498; 10.52; 5.57529697; 80; 10.52; 4.64329631; 80; 
9; 10.52; 32.802; 10.52; 39.1418566; 80; 10.52; 30.4888286; 80; 10.52; 31.7; 10.52; 32.168866; 80; 10.52; 36.9482853; 80; 10.52; 6.498; 10.52; 5.9538593; 80; 10.52; 4.64331537; 80; 
10; 10.52; 32.802; 10.52; 28.0972474; 80; 13.5363881; 23.4396336; 80; 10.52; 31.7; 10.52; 25.1322444; 80; 13.5363881; 30.1742524; 80; 10.52; 6.498; 10.52; 5.02728693; 80; 13.5363881; 4.64331518; 80; 
11; 14.59; 32.802; 14.59; 23.4394284; 80; 11.5736119; 23.4394284; 80; 14.59; 31.7; 14.59; 22.6519688; 80; 11.5736119; 22.6519688; 80; 14.59; 6.498; 14.59; 4.64329631; 80; 11.5736119; 4.64329631; 80; 
12; 15.5475; 32.802; 15.3761538; 23.4394284; 80; 15.3761538; 23.4394284; 80; 15.5475; 31.7; 15.3761538; 22.6519688; 80; 15.3761538; 22.6519688; 80; 15.5475; 6.498; 15.3761538; 4.64329631; 80; 15.3761538; 4.64329631; 80; 
13; 15.5475; 32.802; 15.3761538; 23.4394284; 80; 15.3761538; 23.4394284; 80; 15.5475; 31.7; 15.3761538; 22.6519688; 80; 15.3761538; 22.6519688; 80; 15.5475; 6.498; 15.3761538; 4.64329631; 80; 15.3761538; 4.64329631; 80; 
14; 15.5475; 32.802; 15.3761538; 23.4394284; 80; 15.3761538; 23.4394284; 80; 15.5475; 31.7; 15.3761538; 22.6519688; 80; 15.3761538; 22.6519688; 80; 15.5475; 6.498; 15.3761538; 4.64329631; 80; 15.3761538; 4.64329631; 80; 
15; 15.5475; 32.802; 15.3761538; 23.4394284; 80; 15.3761538; 23.4394284; 80; 15.5475; 31.7; 15.3761538; 22.6519688; 80; 15.3761538; 22.6519688; 80; 15.5475; 6.498; 15.3761538; 4.64329631; 80; 15.3761538; 4.64329631; 80; 
16; 15.5475; 32.802; 15.3761538; 23.4394284; 80; 15.3761538; 23.4394284; 80; 15.5475; 31.7; 15.3761538; 22.6519688; 80; 15.3761538; 22.6519688; 80; 15.5475; 6.498; 15.3761538; 4.64329631; 80; 15.3761538; 4.64329631; 80; 
17; 15.5475; 32.802; 15.3761538; 23.4394284; 80; 15.3761538; 23.4394284; 80; 15.5475; 31.7; 15.3761538; 22.6519688; 80; 15.3761538; 22.6519688; 80; 15.5475; 6.498; 15.3761538; 4.64329631; 80; 15.3761538; 4.64329631; 80; 
18; 15.5475; 32.802; 15.3761538; 23.4394284; 80; 15.3761538; 23.4394284; 80; 15.5475; 31.7; 15.3761538; 22.6519688; 80; 15.3761538; 22.6519688; 80; 15.5475; 6.498; 15.3761538; 4.64329631; 80; 15.3761538; 4.64329631; 80; 
19; 15.5475; 32.802; 15.3761538; 23.4394284; 80; 15.3761538; 23.4394284; 80; 15.5475; 31.7; 15.3761538; 22.6519688; 80; 15.3761538; 22.6519688; 80; 15.5475; 6.498; 15.3761538; 4.64329631; 80; 15.3761538; 4.64329631; 80; 
20; 15.5475; 32.802; 15.3761538; 23.4394284; 80; 15.3761538; 23.4394284; 80; 15.5475; 31.7; 15.3761538; 22.6519688; 80; 15.3761538; 22.6519688; 80; 15.5475; 6.498; 15.3761538; 4.64329631; 80; 15.3761538; 4.64329631; 80; 
21; 15.5475; 32.802; 15.3761538; 23.4394284; 80; 15.3761538; 23.4394284; 80; 15.5475; 31.7; 15.3761538; 22.6519688; 80; 15.3761538; 22.6519688; 80; 15.5475; 6.498; 15.3761538; 4.64329631; 80; 15.3761538; 4.64329631; 80; 
22; 15.5475; 32.802; 15.3761538; 23.4394284; 80; 15.3761538; 23.4394284; 80; 15.5475; 31.7; 15.3761538; 22.6519688; 80; 15.3761538; 22.6519688; 80; 15.5475; 6.498; 15.3761538; 4.64329631; 80; 15.3761538; 4.64329631; 80; 
23; 15.5475; 32.802; 15.3761538; 23.4394284; 80; 15.3761538; 23.4394284; 80; 15.5475; 31.7; 15.3761538; 22.6519688; 80; 15.3761538; 22.6519688; 80; 15.5475; 6.498; 15.3761538; 4.64329631; 80; 15.3761538; 4.64329631; 80; 
24; 15.5475; 32.802; 15.3761538; 23.4394284; 80; 15.3761538; 23.4394284; 80; 15.5475; 31.7; 15.3761538; 22.6519688; 80; 15.3761538; 22.6519688; 80; 15.5475; 6.498; 15.3761538; 4.64329631; 80; 15.3761538; 4.64329631; 80; 
25; 17.81; 32.802; 16.6238462; 23.4394284; 80; 16.6238462; 23.4394284; 80; 17.81; 31.7; 16.6238462; 22.6519688; 80; 16.6238462; 22.6519688; 80; 17.81; 6.498; 16.6238462; 4.64329631; 80; 16.6238462; 4.64329631; 80; 
26; 16; 32.802; 16; 23.4394284; 80; 16; 23.4394284; 80; 16; 31.7; 16; 22.6519688; 80; 16; 22.6519688; 80; 16; 6.498; 16; 4.64329631; 80; 16; 4.64329631; 80; 
27; 16; 32.802; 16; 23.4394284; 80; 16; 23.4394284; 80; 16; 31.7; 16; 22.6519688; 80; 16; 22.6519688; 80; 16; 6.498; 16; 4.64329631; 80; 16; 4.64329631; 80; 
28; 16; 32.802; 16; 23.4394284; 80; 16; 23.4394284; 80; 16; 31.7; 16; 22.6519688; 80; 16; 22.6519688; 80; 16; 6.498; 16; 4.64329631; 80; 16; 4.64329631; 80; 
29; 16; 32.802; 16; 23.4394284; 80; 16; 23.4394284; 80; 16; 31.7; 16; 22.6519688; 80; 16; 22.6519688; 80; 16; 6.498; 16; 4.64329631; 80; 16; 4.64329631; 80; 
30; 16; 32.802; 16; 23.4394284; 80; 16; 23.4394284; 80; 16; 31.7; 16; 22.6519688; 80; 16; 22.6519688; 80; 16; 6.498; 16; 4.64329631; 80; 16; 4.64329631; 80; 
31; 16; 32.802; 16; 23.4394284; 80; 16; 23.4394284; 80; 16; 31.7; 16; 22.6519688; 80; 16; 22.6519688; 80; 16; 6.498; 16; 4.64329631; 80; 16; 4.64329631; 80; 
32; 16; 32.802; 16; 23.4394284; 80; 16; 23.4394284; 80; 16; 31.7; 16; 22.6519688; 80; 16; 22.6519688; 80; 16; 6.498; 16; 4.64329631; 80; 16; 4.64329631; 80; 
33; 16; 32.802; 16; 23.4394284; 80; 16; 23.4394284; 80; 16; 31.7; 16; 22.6519688; 80; 16; 22.6519688; 80; 16; 6.498; 16; 4.64329631; 80; 16; 4.64329631; 80; 
34; 16; 32.802; 16; 23.4394284; 80; 16; 23.4394284; 80; 16; 31.7; 16; 22.6519688; 80; 16; 22.6519688; 80; 16; 6.498; 16; 4.64329631; 80; 16; 4.64329631; 80; 
35; 16; 32.802; 16; 23.4394284; 80; 16; 23.4394284; 80; 16; 31.7; 16; 22.6519688; 80; 16; 22.6519688; 80; 16; 6.498; 16; 4.64329631; 80; 16; 4.64329631; 80; 
36; 16; 32.802; 16; 23.4394284; 80; 16; 23.4394284; 80; 16; 31.7; 16; 22.6519688; 80; 16; 22.6519688; 80; 16; 6.498; 16; 4.64329631; 80; 16; 4.64329631; 80; 
37; 20.4725; 32.802; 18.7134503; 23.4394284; 80; 18.7134503; 25.1116867; 80; 20.4725; 31.7; 18.7134503; 22.6519688; 80; 18.7134503; 22.9025744; 80; 20.4725; 6.498; 18.7134503; 4.64329631; 80; 18.7134503; 5.94125274; 80; 
38; 20.4725; 32.802; 18.7134503; 23.4394284; 80; 18.7134503; 25.0950044; 80; 20.4725; 31.7; 18.7134503; 22.6519688; 80; 18.7134503; 22.9000744; 80; 20.4725; 6.498; 18.7134503; 4.64329631; 80; 18.7134503; 5.92830447; 80; 
39; 20.7; 32.802; 18.7134503; 23.4394284; 80; 18.7134503; 23.4394284; 80; 20.7; 31.7; 18.7134503; 22.6519688; 80; 18.7134503; 22.6519688; 80; 20.7; 6.498; 18.7134503; 4.64329631; 80; 18.7134503; 4.64329631; 80; 
40; 20.7; 32.802; 20.7; 23.4394284; 80; 20.7; 23.4394284; 80; 20.7; 31.7; 20.7; 22.6519688; 80; 20.7; 22.6519688; 80; 20.7; 6.498; 20.7; 4.64329631; 80; 20.7; 4.64329631; 80; 
41; 20.4725; 32.802; 18.7134503; 23.4394284; 80; 18.7134503; 23.4394284; 80; 20.4725; 31.7; 18.7134503; 22.6519688; 80; 18.7134503; 22.6519688; 80; 20.4725; 6.498; 18.7134503; 4.64329631; 80; 18.7134503; 4.64329631; 80; 
42; 20.4725; 32.802; 18.7134503; 23.4394284; 80; 18.7134503; 23.9089365; 80; 20.4725; 31.7; 18.7134503; 22.6519688; 80; 18.7134503; 23.3436889; 80; 20.4725; 6.498; 18.7134503; 4.64329631; 80; 18.7134503; 4.64329631; 80; 
43; 13.4015; 32.802; 12.9127485; 28.1441815; 80; 12.9127485; 34.1177929; 78.7725856; 13.4015; 31.7; 12.9127485; 31.3148826; 80; 12.9127485; 27.0277903; 80; 13.4015; 6.498; 12.9127485; 4.64329631; 80; 12.9127485; 5.19910027; 80; 
44; 4.67685; 32.802; 6.32194144; 37.90999; 79.7049885; 7.75261456; 43.4901038; 75; 4.67685; 31.7; 6.32194144; 38.5274149; 80; 7.75261456; 34.080063; 75.3875634; 4.67685; 6.498; 6.32194144; 7.17355302; 78.7385859; 7.75261456; 7.03549148; 80; 
45; 5.47; 32.802; 7.39408356; 43.8557892; 75; 9.06738544; 43.9619754; 75; 5.47; 31.7; 7.39408356; 40.2138525; 75; 9.06738544; 43.259076; 75; 5.47; 6.498; 7.39408356; 9.25915519; 75; 9.06738544; 8.69088411; 78.5673788; 
46; 4.67685; 32.802; 6.32194144; 44.754551; 75; 4.89126833; 44.7091908; 75; 4.67685; 31.7; 6.32194144; 43.2392764; 75; 4.89126833; 45.7480783; 75.4445523; 4.67685; 6.498; 6.32194144; 8.84732887; 75; 4.89126833; 8.9634241; 75.1692986; 
47; 4.67685; 32.802; 7.39408356; 44.7790291; 75; 5.72078167; 44.7240711; 75.6060691; 4.67685; 31.7; 7.39408356; 43.2638693; 75; 5.72078167; 43.0088605; 75.5262383; 4.67685; 6.498; 7.39408356; 8.85175326; 75; 5.72078167; 8.8598153; 77.0228549; 
48; 4.67685; 32.802; 4.67685; 44.788458; 75; 4.67685; 44.7294911; 75.0487584; 4.67685; 31.7; 4.67685; 43.273467; 75; 4.67685; 43.0765468; 75.2445669; 4.67685; 6.498; 4.67685; 8.85348441; 75; 4.67685; 8.82478714; 76.9527384; 
49; 4.67685; 32.802; 4.67685; 44.792185; 75; 4.67685; 44.7303972; 75.1648453; 4.67685; 31.7; 4.67685; 43.2774307; 75; 4.67685; 43.2474067; 75.3349272; 4.67685; 6.498; 4.67685; 8.85419264; 75; 4.67685; 8.82467288; 76.9643072; 
50; 4.67685; 32.802; 4.67685; 44.7913941; 75; 4.67685; 44.6800749; 75.169494; 4.67685; 31.7; 4.67685; 43.2768868; 75; 4.67685; 43.1852614; 75.3411723; 4.67685; 6.498; 4.67685; 8.85407277; 75; 4.67685; 8.8372257; 76.4359818; 
51; 4.67685; 32.802; 4.67685; 44.7887991; 75; 4.67685; 44.6773151; 75.1859694; 4.67685; 31.7; 4.67685; 43.2745684; 75; 4.67685; 43.1817784; 75.2356894; 4.67685; 6.498; 4.67685; 8.85361544; 75; 4.67685; 8.85027519; 75; 
52; 4.67685; 32.802; 4.67685; 44.7847118; 75; 4.67685; 44.7207988; 75.0925249; 4.67685; 31.7; 4.67685; 43.2707919; 75; 4.67685; 43.1771003; 75.1016569; 4.67685; 6.498; 4.67685; 8.85287515; 75; 4.67685; 8.87344056; 75; 
53; 4.67685; 32.802; 4.67685; 44.7794569; 75; 4.67685; 44.7150965; 75.1806232; 4.67685; 31.7; 4.67685; 43.265877; 75; 4.67685; 43.171414; 75.4006317; 4.67685; 6.498; 4.67685; 8.85190896; 75; 4.67685; 8.86102569; 78.3020769; 
54; 4.67685; 32.802; 4.67685; 44.7731926; 75; 4.67685; 44.7083606; 75.0558108; 4.67685; 31.7; 4.67685; 43.2599811; 75; 4.67685; 43.1648105; 75.3100542; 4.67685; 6.498; 4.67685; 8.85074503; 75; 4.67685; 8.85988905; 76.7908367; 
55; 5.47; 32.802; 5.47; 44.7659966; 75; 5.47; 44.7006835; 75; 5.47; 31.7; 5.47; 43.2531819; 75; 5.47; 43.1573362; 75.2491577; 5.47; 6.498; 5.47; 8.84939728; 75; 5.47; 8.85856097; 76.8474052; 
56; 5.47; 32.802; 5.47; 44.7579089; 75; 5.47; 44.6921122; 75; 5.47; 31.7; 5.47; 43.2455188; 75; 5.47; 43.1490159; 75.2997475; 5.47; 6.498; 5.47; 8.84787294; 75; 5.47; 8.85705265; 77.0460168; 
57; 5.47; 32.802; 5.47; 44.7489516; 75; 5.47; 44.6826719; 75; 5.47; 31.7; 5.47; 43.2370137; 75; 5.47; 43.1398645; 75.2586779; 5.47; 6.498; 5.47; 8.84617605; 75; 5.47; 8.84105348; 76.9712307; 
58; 5.47; 32.802; 5.47; 44.7391384; 75; 5.47; 44.672378; 75; 5.47; 31.7; 5.47; 43.2276803; 75; 5.47; 43.1298922; 75.4353444; 5.47; 6.498; 5.47; 8.84430917; 75; 5.47; 8.81849186; 77.1718042; 
59; 5.47; 32.802; 5.47; 44.7284791; 75; 5.47; 44.6612408; 75; 5.47; 31.7; 5.47; 43.2175279; 75; 5.47; 43.1191071; 75.13107; 5.47; 6.498; 5.47; 8.84227418; 75; 5.47; 8.83387604; 76.985692; 
60; 5.47; 32.802; 5.47; 44.7169814; 75; 5.47; 44.6492684; 75; 5.47; 31.7; 5.47; 43.2065641; 75; 5.47; 43.1075159; 75.3896776; 5.47; 6.498; 5.47; 8.84007258; 75; 5.47; 8.85252468; 77.0650111; 
61; 5.47; 32.802; 5.47; 44.7046522; 75; 5.47; 44.636468; 75.2570487; 5.47; 31.7; 5.47; 43.1947958; 75; 5.47; 43.095125; 75.4297694; 5.47; 6.498; 5.47; 8.83770573; 75; 5.47; 8.83641153; 77.0849355; 
62; 5.47; 32.802; 5.47; 44.6914982; 75; 5.47; 44.622846; 75.0831737; 5.47; 31.7; 5.47; 43.1822292; 75; 5.47; 43.0819405; 75.0903729; 5.47; 6.498; 5.47; 8.83517491; 75; 5.47; 8.82379609; 77.1479867; 
63; 5.47; 32.802; 5.47; 44.6775253; 75; 5.47; 44.6084087; 75.2026859; 5.47; 31.7; 5.47; 43.1688702; 75; 5.47; 43.0679683; 75.5119114; 5.47; 6.498; 5.47; 8.83248135; 75; 5.47; 8.82596634; 77.1036723; 
64; 5.47; 32.802; 5.47; 44.6627398; 75; 5.47; 44.5931621; 75.1604614; 5.47; 31.7; 5.47; 43.1547249; 75; 5.47; 43.0532142; 75.1370803; 5.47; 6.498; 5.47; 8.82962626; 75; 5.47; 8.83327821; 77.1427435; 
65; 5.47; 32.802; 5.47; 44.6471477; 75; 5.47; 44.5771123; 75.0705724; 5.47; 31.7; 5.47; 43.1397989; 75; 5.47; 43.0376839; 75.4084248; 5.47; 6.498; 5.47; 8.82661084; 75; 5.47; 8.82588977; 77.1635288; 
66; 5.47; 32.802; 5.47; 44.6307549; 75; 5.47; 44.560265; 75.0336473; 5.47; 31.7; 5.47; 43.124098; 75; 5.47; 43.0213832; 75.0991628; 5.47; 6.498; 5.47; 8.82343626; 75; 5.47; 8.82261418; 77.1841942; 
67; 5.47; 32.802; 5.47; 44.6135672; 75; 5.47; 44.5426263; 75.0596258; 5.47; 31.7; 5.47; 43.107628; 75; 5.47; 43.0043178; 75.3850138; 5.47; 6.498; 5.47; 8.82010368; 75; 5.47; 8.81936299; 77.2047922; 
68; 4.67685; 32.802; 5.47; 44.5955904; 75; 5.47; 44.5242018; 75.0166133; 4.67685; 31.7; 5.47; 43.0903945; 75; 5.47; 42.9864932; 75.0624872; 4.67685; 6.498; 5.47; 8.81661428; 75; 5.47; 8.81605075; 77.2255888; 
69; 4.67685; 32.802; 4.67685; 44.5768305; 75; 4.67685; 44.5049974; 75.0209375; 4.67685; 31.7; 4.67685; 43.072403; 75; 4.67685; 42.967915; 75.4855777; 4.67685; 6.498; 4.67685; 8.81296919; 75; 4.67685; 8.81249829; 77.2471765; 
70; 4.67685; 32.802; 4.67685; 44.5572931; 75; 4.67685; 44.4850188; 75; 4.67685; 31.7; 4.67685; 43.0536591; 75; 4.67685; 42.9485888; 75.2013748; 4.67685; 6.498; 4.67685; 8.80916957; 75; 4.67685; 8.7975342; 77.3179843; 
71; 4.67685; 32.802; 4.67685; 44.536984; 75; 4.67685; 44.4642717; 75; 4.67685; 31.7; 4.67685; 43.0341684; 75; 4.67685; 42.9285199; 75.51356; 4.67685; 6.498; 4.67685; 8.80521654; 75; 4.67685; 8.79162324; 77.3183639; 
72; 4.67685; 32.802; 4.67685; 44.5159087; 75; 4.67685; 44.4427617; 75; 4.67685; 31.7; 4.67685; 43.0139364; 75; 4.67685; 42.8328863; 75.3443213; 4.67685; 6.498; 4.67685; 8.80111124; 75; 4.67685; 8.79982106; 77.291093; 
73; 4.67685; 32.802; 4.67685; 44.4940729; 75; 4.67685; 44.4204944; 75; 4.67685; 31.7; 4.67685; 42.9929684; 75; 4.67685; 42.8466518; 75.3006878; 4.67685; 6.498; 4.67685; 8.79685477; 75; 4.67685; 8.79101936; 77.3879464; 
74; 4.67685; 32.802; 4.67685; 44.4714822; 75; 4.67685; 44.3974753; 75; 4.67685; 31.7; 4.67685; 42.9712699; 75; 4.67685; 42.8979313; 75.3333129; 4.67685; 6.498; 4.67685; 8.79244825; 75; 4.67685; 8.77431752; 77.3873737; 
75; 4.67685; 32.802; 4.67685; 44.4481422; 75; 4.67685; 44.37371; 75; 4.67685; 31.7; 4.67685; 42.9488462; 75; 4.67685; 42.8405446; 75; 4.67685; 6.498; 4.67685; 8.78789278; 75; 4.67685; 8.79317302; 77.3602599; 
76; 4.67685; 32.802; 4.67685; 44.4240583; 75; 4.67685; 44.3492039; 75; 4.67685; 31.7; 4.67685; 42.9257026; 75; 4.67685; 42.8168466; 75; 4.67685; 6.498; 4.67685; 8.78318945; 75; 4.67685; 8.80102067; 77.3496149; 
77; 4.67685; 32.802; 4.67685; 44.399236; 75; 4.67685; 44.1875149; 75; 4.67685; 31.7; 4.67685; 42.9018445; 75; 4.67685; 42.7924381; 75; 4.67685; 6.498; 4.67685; 8.77833934; 75; 4.67685; 8.78508002; 77.4576571; 
78; 9.43575; 32.802; 10.7443237; 33.8605629; 80; 10.89; 33.746969; 80; 9.43575; 31.7; 10.7443237; 35.5514624; 80; 10.89; 37.639487; 75; 9.43575; 6.498; 10.7443237; 7.6312357; 80; 10.89; 6.69997454; 80; 
79; 9.43575; 32.802; 10.7443237; 32.4483794; 80; 10.89; 29.4314653; 80; 9.43575; 31.7; 10.7443237; 34.4193748; 78.1364727; 10.89; 40.0329519; 75; 9.43575; 6.498; 10.7443237; 7.77110736; 75; 10.89; 5.23289939; 80; 
80; 9.43575; 32.802; 10.9871176; 32.3585071; 80; 10.89; 29.3138175; 80; 9.43575; 31.7; 10.9871176; 31.5268881; 80; 10.89; 36.0984609; 80; 9.43575; 6.498; 10.9871176; 6.82640632; 80; 10.89; 5.22701758; 80; 
81; 9.43575; 32.802; 10.9871176; 23.4394284; 80; 10.89; 23.4394284; 80; 9.43575; 31.7; 10.9871176; 22.6519688; 80; 10.89; 23.7549052; 80; 9.43575; 6.498; 10.9871176; 4.64329631; 80; 10.89; 4.64329631; 80; 
82; 9.43575; 32.802; 10.9871176; 23.4394284; 77.5841164; 10.89; 23.4394284; 77.6011204; 9.43575; 31.7; 10.9871176; 22.6519688; 77.5680735; 10.89; 22.839514; 77.1470737; 9.43575; 6.498; 10.9871176; 4.64329631; 77.4581742; 10.89; 4.64329609; 80; 
83; 8.06756625; 32.802; 9.39398551; 37.4935689; 75; 9.31095; 37.4935678; 75; 8.06756625; 31.7; 9.39398551; 36.2339533; 75; 9.31095; 34.6046103; 75; 8.06756625; 6.498; 9.39398551; 5.79804459; 75; 9.31095; 7.42738869; 75; 
84; 8.06756625; 32.802; 10.9871176; 46.7089658; 75; 10.89; 48.8525191; 75; 8.06756625; 31.7; 10.9871176; 47.2647771; 75; 10.89; 43.0600458; 75; 8.06756625; 6.498; 10.9871176; 8.09793509; 75; 10.89; 9.68238666; 75; 
85; 8.06756625; 32.802; 9.39398551; 44.2340018; 75; 9.31095; 45.2851694; 75; 8.06756625; 31.7; 9.39398551; 43.8524983; 75; 9.31095; 42.7457874; 75; 8.06756625; 6.498; 9.39398551; 9.32370413; 75; 9.31095; 8.97919151; 75; 
86; 8.06756625; 32.802; 9.39398551; 41.618498; 75; 9.31095; 41.1150542; 78.6818994; 8.06756625; 31.7; 9.39398551; 34.9241479; 75; 9.31095; 34.1408877; 75; 8.06756625; 6.498; 9.39398551; 7.94349013; 75; 9.31095; 8.7724442; 75; 
87; 9.194135; 32.802; 9.39398551; 30.1337835; 80; 9.31095; 34.2867115; 75; 9.194135; 31.7; 9.39398551; 28.8454083; 80; 9.31095; 22.8303451; 80; 9.194135; 6.498; 9.39398551; 8.14319611; 75; 9.31095; 8.76821584; 75; 
88; 13.32; 32.802; 10.9871176; 23.4394284; 80; 10.89; 27.0051076; 80; 13.32; 31.7; 10.9871176; 26.6000664; 80; 10.89; 22.6519688; 80; 13.32; 6.498; 10.9871176; 7.19478317; 80; 10.89; 7.39961511; 80; 
89; 13.32; 32.802; 10.9871176; 23.4394284; 80; 10.89; 23.4394284; 80; 13.32; 31.7; 10.9871176; 22.6519688; 80; 10.89; 22.6519688; 80; 13.32; 6.498; 10.9871176; 4.64329631; 80; 10.89; 5.34159664; 75.3109714; 
90; 13.32; 32.802; 10.9871176; 23.4394284; 80; 10.89; 23.4394284; 77.9040177; 13.32; 31.7; 10.9871176; 22.6519688; 80; 10.89; 22.6519688; 80; 13.32; 6.498; 10.9871176; 4.64329631; 80; 10.89; 4.64329631; 80; 
91; 13.32; 32.802; 10.9871176; 23.4394284; 80; 10.89; 23.4394284; 80; 13.32; 31.7; 10.9871176; 22.6519688; 80; 10.89; 22.6519688; 80; 13.32; 6.498; 10.9871176; 4.64329631; 80; 10.89; 4.64329631; 78.338584; 
92; 13.32; 32.802; 10.9871176; 23.4394284; 80; 10.89; 23.4394284; 78.6922038; 13.32; 31.7; 10.9871176; 22.6519688; 80; 10.89; 22.6519688; 80; 13.32; 6.498; 10.9871176; 4.64329631; 80; 10.89; 4.64329631; 80; 
93; 13.32; 32.802; 10.9871176; 23.4394284; 80; 10.89; 23.4394284; 80; 13.32; 31.7; 10.9871176; 22.6519688; 80; 10.89; 22.6519688; 80; 13.32; 6.498; 10.9871176; 4.64329631; 80; 10.89; 4.64329631; 80; 
94; 13.32; 32.802; 10.9871176; 23.4394284; 80; 10.89; 23.4394284; 80; 13.32; 31.7; 10.9871176; 22.6519688; 80; 10.89; 22.6519688; 80; 13.32; 6.498; 10.9871176; 4.64329631; 80; 10.89; 4.64329631; 80; 
95; 13.32; 32.802; 10.9871176; 23.4394284; 80; 10.89; 23.4394284; 78.4586096; 13.32; 31.7; 10.9871176; 22.6519688; 80; 10.89; 22.6519688; 78.1231974; 13.32; 6.498; 10.9871176; 4.64329631; 80; 10.89; 4.64329631; 77.9467701; 
96; 13.32; 32.802; 16; 37.4935689; 75; 17.2062; 37.4935689; 75; 13.32; 31.7; 16; 36.2339533; 75; 17.2062; 36.2339533; 75; 13.32; 6.498; 16; 7.42738891; 75; 17.2062; 7.42738891; 75; 
