Iterations; CPUmaster; CPUsubproblem; CPUsolveSub; CPUgenerateCuts; CPUfeasPt; Buses; AcceptGap; CoopPotentialPercent
37; 1.47731304; 5.35295105; 4.76758003; 0.585033; 0.635914028; 1; 0.0001; 99.67249
55; 3.07035995; 13.431427; 11.6927099; 1.738132; 1.06229198; 2; 0.0001; 99.5193523
82; 5.16406679; 29.9205208; 26.0288715; 3.89070296; 2.09918594; 3; 0.0001; 99.5015283
94; 8.08878994; 47.5534096; 41.6338921; 5.91829205; 2.39348412; 4; 0.0001; 99.6573952
