t; nomPriceB7; nomPlPowB7; integrPriceB7; integrPlPowB7; integrT_in_B7; disagg_price_bus7; PlPowB7; disaggT_in_B7; nomPriceB6; nomPlPowB6; integrPriceB6; integrPlPowB6; integrT_in_B6; disagg_price_bus6; PlPowB6; disaggT_in_B6;  initFeasThres; finalFeasThres; accept_gap; iterations; CPUmaster; CPUsubproblem; CPUfeasPt; finalDetectGap; nomCongestionCost; intCongestionCost; disaggCongestionCost; Objective; nomImprovPercent; CoopPotentialPercent; nominalCost; integratedCost
1; 10.52; 62.5; 10.52; 53.5356974; 80; 6.45; 53.5356974; 80; 10.52; 68; 10.52; 58.2468388; 80; 6.45; 58.2468388; 80; 261; 245.77008; 0.0001; 54; 2.87149701; 4.53603992; 0.566909206; 7.35623712e-05; 4.50689585e-10; 1.80896667e-10; 1.88377817e-09; 1805373.38; 0.888467909; 99.5592114; 1821557.33; 1805301.72
2; 10.52; 62.5; 10.52; 53.1399181; 80; 11.334; 44.6608217; 80; 10.52; 68; 10.52; 48.590974; 80; 11.334; 62.7482088; 80; 
3; 10.52; 62.5; 10.52; 53.0553316; 80; 11.334; 44.6612523; 80; 10.52; 68; 10.52; 48.590974; 80; 11.334; 80.2999111; 77.322953; 
4; 10.52; 62.5; 10.52; 44.6608217; 80; 11.334; 69.2941953; 77.7715326; 10.52; 68; 10.52; 58.1752983; 80; 11.334; 78.4975079; 80; 
5; 10.52; 62.5; 10.52; 62.05193; 80; 11.334; 69.0484555; 80; 10.52; 68; 10.52; 58.0796861; 80; 11.334; 60.857475; 80; 
6; 10.52; 62.5; 10.52; 73.2716554; 80; 11.334; 50.2975879; 80; 10.52; 68; 10.52; 69.4846485; 80; 11.334; 48.590974; 80; 
7; 10.52; 62.5; 10.52; 57.0488298; 80; 11.334; 67.7395114; 79.1533759; 10.52; 68; 10.52; 81.65806; 80; 11.334; 48.590974; 80; 
8; 10.52; 62.5; 10.52; 54.6609745; 80; 11.334; 68.0210473; 80; 10.52; 68; 10.52; 73.3841481; 80; 11.334; 60.0236288; 80; 
9; 10.52; 62.5; 10.52; 60.5422766; 80; 11.334; 50.6368255; 80; 10.52; 68; 10.52; 61.0007773; 80; 11.334; 66.9768486; 80; 
10; 10.52; 62.5; 10.52; 51.6578228; 80; 11.334; 44.6608217; 80; 10.52; 68; 10.52; 48.590974; 80; 11.334; 55.5877424; 80; 
11; 14.59; 62.5; 14.59; 44.6608217; 80; 11.334; 44.6608217; 80; 14.59; 68; 14.59; 48.590974; 80; 11.334; 48.590974; 80; 
12; 15.5475; 62.5; 15.1991128; 44.6608217; 80; 15.1955493; 44.6608217; 80; 15.5475; 68; 15.1991128; 48.590974; 80; 15.1955493; 48.590974; 80; 
13; 15.5475; 62.5; 15.1991128; 44.6608217; 80; 15.1955493; 44.6608217; 80; 15.5475; 68; 15.1991128; 48.590974; 80; 15.1955493; 48.590974; 80; 
14; 15.5475; 62.5; 15.1991128; 44.6608217; 80; 15.1955493; 44.6608217; 80; 15.5475; 68; 15.1991128; 48.590974; 80; 15.1955493; 48.590974; 80; 
15; 15.5475; 62.5; 15.1991128; 44.6608217; 80; 15.1955493; 44.6608217; 80; 15.5475; 68; 15.1991128; 48.590974; 80; 15.1955493; 48.590974; 80; 
16; 15.5475; 62.5; 15.1991128; 44.6608217; 80; 15.1955493; 44.6608217; 80; 15.5475; 68; 15.1991128; 48.590974; 80; 15.1955493; 48.590974; 80; 
17; 15.5475; 62.5; 15.1991128; 44.6608217; 80; 15.1955493; 44.6608217; 80; 15.5475; 68; 15.1991128; 48.590974; 80; 15.1955493; 48.590974; 80; 
18; 15.5475; 62.5; 15.1991128; 44.6608217; 80; 15.1955493; 44.6608217; 80; 15.5475; 68; 15.1991128; 48.590974; 80; 15.1955493; 48.590974; 80; 
19; 15.5475; 62.5; 15.1991128; 44.6608217; 80; 15.1955493; 44.6608217; 80; 15.5475; 68; 15.1991128; 48.590974; 80; 15.1955493; 48.590974; 80; 
20; 15.5475; 62.5; 15.1991128; 44.6608217; 80; 15.1955493; 44.6608217; 80; 15.5475; 68; 15.1991128; 48.590974; 80; 15.1955493; 48.590974; 80; 
21; 15.5475; 62.5; 15.1991128; 44.6608217; 80; 15.1955493; 44.6608217; 80; 15.5475; 68; 15.1991128; 48.590974; 80; 15.1955493; 48.590974; 80; 
22; 15.5475; 62.5; 15.1991128; 44.6608217; 80; 15.1955493; 44.6608217; 80; 15.5475; 68; 15.1991128; 48.590974; 80; 15.1955493; 48.590974; 80; 
23; 15.5475; 62.5; 15.1991128; 44.6608217; 80; 15.1955493; 44.6608217; 80; 15.5475; 68; 15.1991128; 48.590974; 80; 15.1955493; 48.590974; 80; 
24; 15.5475; 62.5; 15.1991128; 44.6608217; 80; 15.1955493; 44.6608217; 80; 15.5475; 68; 15.1991128; 48.590974; 80; 15.1955493; 48.590974; 80; 
25; 17.81; 62.5; 15.6215334; 44.6608217; 80; 15.6678597; 44.6608217; 80; 17.81; 68; 15.6215334; 48.590974; 80; 15.6678597; 48.590974; 80; 
26; 16; 62.5; 15.6215334; 44.6608217; 80; 15.6678597; 44.6608217; 80; 16; 68; 15.6215334; 48.590974; 80; 15.6678597; 48.590974; 80; 
27; 16; 62.5; 15.6215334; 44.6608217; 80; 15.6678597; 44.6608217; 80; 16; 68; 15.6215334; 48.590974; 80; 15.6678597; 48.590974; 80; 
28; 16; 62.5; 16; 44.6608217; 80; 16.0442806; 44.6608217; 80; 16; 68; 16; 48.590974; 80; 16.0442806; 48.590974; 80; 
29; 16; 62.5; 16; 44.6608217; 80; 16; 44.6608217; 80; 16; 68; 16; 48.590974; 80; 16; 48.590974; 80; 
30; 16; 62.5; 15.6215334; 44.6608217; 80; 15.6678597; 44.6608217; 80; 16; 68; 15.6215334; 48.590974; 80; 15.6678597; 48.590974; 80; 
31; 16; 62.5; 15.6215334; 44.6608217; 80; 15.6678597; 44.6608217; 80; 16; 68; 15.6215334; 48.590974; 80; 15.6678597; 48.590974; 80; 
32; 16; 62.5; 15.6215334; 44.6608217; 80; 15.6678597; 44.6608217; 80; 16; 68; 15.6215334; 48.590974; 80; 15.6678597; 48.590974; 80; 
33; 16; 62.5; 15.6215334; 44.6608217; 80; 15.6678597; 44.6608217; 80; 16; 68; 15.6215334; 48.590974; 80; 15.6678597; 48.590974; 80; 
34; 16; 62.5; 15.6215334; 44.6608217; 80; 15.6678597; 44.6608217; 80; 16; 68; 15.6215334; 48.590974; 80; 15.6678597; 48.590974; 80; 
35; 16; 62.5; 15.6215334; 44.6608217; 80; 15.6678597; 44.6608217; 80; 16; 68; 15.6215334; 48.590974; 80; 15.6678597; 48.590974; 80; 
36; 16.27; 62.5; 15.6215334; 44.6608217; 80; 15.6678597; 44.6608217; 80; 16.27; 68; 15.6215334; 48.590974; 80; 15.6678597; 48.590974; 80; 
37; 20.7; 62.5; 18.2707993; 44.6608217; 80; 18.3249821; 44.6608217; 80; 20.7; 68; 18.2707993; 48.590974; 80; 18.3249821; 48.590974; 80; 
38; 20.7; 62.5; 18.2707993; 44.6608217; 80; 18.3249821; 44.6608217; 80; 20.7; 68; 18.2707993; 48.590974; 80; 18.3249821; 48.590974; 80; 
39; 20.7; 62.5; 18.2707993; 44.6608217; 80; 18.3249821; 44.6608217; 80; 20.7; 68; 18.2707993; 48.590974; 80; 18.3249821; 48.590974; 80; 
40; 20.7; 62.5; 18.2707993; 44.6608217; 80; 18.3249821; 44.6608217; 80; 20.7; 68; 18.2707993; 48.590974; 80; 18.3249821; 48.590974; 80; 
41; 20.7; 62.5; 18.2707993; 44.6608217; 80; 18.3249821; 44.6608217; 80; 20.7; 68; 18.2707993; 48.590974; 80; 18.3249821; 48.590974; 80; 
42; 20.7; 62.5; 18.2707993; 44.6608217; 80; 18.3249821; 44.6608217; 80; 20.7; 68; 18.2707993; 48.590974; 80; 18.3249821; 48.590974; 80; 
43; 6.67874889; 62.5; 11.5527365; 47.1652335; 80; 18.3249821; 70.3800843; 78.1591245; 6.67874889; 68; 11.5527365; 73.0041532; 80; 18.3249821; 48.590974; 80; 
44; 6.67874889; 62.5; 9.09326672; 62.9630955; 80; 5.60940259; 80.7841628; 75.2712419; 6.67874889; 68; 9.09326672; 82.5137717; 80; 5.60940259; 66.6492097; 77.9703447; 
45; 7.81140221; 62.5; 10.6353997; 83.3169238; 75; 6.56070478; 69.4224478; 75; 7.81140221; 68; 10.6353997; 82.1180703; 75; 6.56070478; 92.1164037; 75; 
46; 4.67685; 62.5; 5.47; 87.8927131; 75; 5.47; 82.3047413; 75; 4.67685; 68; 5.47; 94.5474343; 75; 5.47; 96.2061293; 75; 
47; 5.47; 62.5; 5.47; 85.4093466; 75; 5.47; 88.4236346; 75; 5.47; 68; 5.47; 93.0281561; 75; 5.47; 92.8324328; 75.0880345; 
48; 4.67685; 62.5; 5.47; 85.4279955; 75; 5.47; 85.301376; 75; 4.67685; 68; 5.47; 93.0476592; 75; 5.47; 92.8523019; 75.3032619; 
49; 5.47; 62.5; 5.47; 85.4344759; 75; 5.47; 85.305031; 75; 5.47; 68; 5.47; 93.0539093; 75; 5.47; 92.6767445; 75.4575656; 
50; 4.67685; 62.5; 5.47; 85.4328145; 75; 5.47; 85.3009049; 75; 4.67685; 68; 5.47; 93.0513475; 75; 5.47; 92.6932997; 75.2982603; 
51; 4.67685; 62.5; 5.47; 85.4274429; 75; 5.47; 85.2933827; 75; 4.67685; 68; 5.47; 93.0447859; 75; 5.47; 92.8659495; 75.2525318; 
52; 4.67685; 62.5; 5.47; 85.4192128; 75; 5.47; 85.2831115; 75.2223134; 4.67685; 68; 5.47; 93.0351; 75; 5.47; 92.8409675; 75.2473179; 
53; 4.67685; 62.5; 5.47; 85.4087439; 75; 5.47; 85.1519193; 75; 4.67685; 68; 5.47; 93.0229836; 75; 5.47; 92.8292776; 75.309707; 
54; 5.47; 62.5; 5.47; 85.3963468; 75; 5.47; 85.1936211; 75; 5.47; 68; 5.47; 93.0087747; 75; 5.47; 92.8154048; 75.3876377; 
55; 5.47; 62.5; 5.47; 85.3821741; 75; 5.47; 85.2942624; 75.1193012; 5.47; 68; 5.47; 92.9926392; 75; 5.47; 92.799562; 75.0709482; 
56; 5.47; 62.5; 5.47; 85.3663039; 75; 5.47; 85.2219139; 75; 5.47; 68; 5.47; 92.9746621; 75; 5.47; 92.7818561; 75.3203315; 
57; 5.47; 62.5; 5.47; 85.3487793; 75; 5.47; 85.2025286; 75; 5.47; 68; 5.47; 92.9548903; 75; 5.47; 92.7623443; 75.5177627; 
58; 5.47; 62.5; 5.47; 85.3296269; 75; 5.47; 85.1815303; 75; 5.47; 68; 5.47; 92.9333525; 75; 5.47; 92.7410605; 75.1109819; 
59; 5.47; 62.5; 5.47; 85.3088654; 75; 5.47; 85.1589371; 75; 5.47; 68; 5.47; 92.9100692; 75; 5.47; 92.7180272; 75.4719178; 
60; 5.47; 62.5; 5.47; 85.2865098; 75; 5.47; 85.1347635; 75; 5.47; 68; 5.47; 92.8850566; 75; 5.47; 92.6932618; 75.2496415; 
61; 5.47; 62.5; 5.47; 85.2625732; 75; 5.47; 85.1090225; 75; 5.47; 68; 5.47; 92.858329; 75; 5.47; 92.6667792; 75; 
62; 5.47; 62.5; 5.47; 85.2370681; 75; 5.47; 85.0817261; 75.1456972; 5.47; 68; 5.47; 92.8298997; 75; 5.47; 92.638593; 75; 
63; 5.47; 62.5; 5.47; 85.2100062; 75; 5.47; 85.0528862; 75.0760539; 5.47; 68; 5.47; 92.7997817; 75; 5.47; 92.6087161; 75; 
64; 5.47; 62.5; 5.47; 85.181399; 75; 5.47; 85.0225141; 75.073897; 5.47; 68; 5.47; 92.7679874; 75; 5.47; 92.5771611; 75; 
65; 5.47; 62.5; 5.47; 85.1512581; 75; 5.47; 84.9906211; 75.0746714; 5.47; 68; 5.47; 92.7345293; 75; 5.47; 92.5439405; 75; 
66; 5.47; 62.5; 5.47; 85.1195946; 75; 5.47; 84.9572185; 75.0743476; 5.47; 68; 5.47; 92.6994196; 75; 5.47; 92.5090666; 75.5963834; 
67; 5.47; 62.5; 5.47; 85.0864199; 75; 5.47; 84.9223174; 75.0740323; 5.47; 68; 5.47; 92.6626704; 75; 5.47; 92.3406211; 75; 
68; 5.47; 62.5; 5.47; 85.0517449; 75; 5.47; 84.8859286; 75.0737288; 5.47; 68; 5.47; 92.6242937; 75; 5.47; 92.3647206; 75; 
69; 4.67685; 62.5; 5.47; 85.0155807; 75; 5.47; 84.8480633; 75.0777893; 4.67685; 68; 5.47; 92.5843016; 75; 5.47; 92.4546252; 75.5307338; 
70; 4.67685; 62.5; 5.47; 84.9779382; 75; 5.47; 84.8087321; 75.0711566; 4.67685; 68; 5.47; 92.5427058; 75; 5.47; 92.2273213; 75; 
71; 4.67685; 62.5; 5.47; 84.9388282; 75; 5.47; 84.7679458; 75.0774339; 4.67685; 68; 5.47; 92.4995181; 75; 5.47; 92.2434733; 75; 
72; 4.67685; 62.5; 5.47; 84.8982616; 75; 5.47; 84.7257152; 75; 4.67685; 68; 5.47; 92.4547502; 75; 5.47; 92.3220685; 75; 
73; 4.67685; 62.5; 5.47; 84.8562489; 75; 5.47; 84.6820507; 75; 4.67685; 68; 5.47; 92.4084137; 75; 5.47; 92.2183627; 75; 
74; 4.67685; 62.5; 5.47; 84.8128009; 75; 5.47; 84.636963; 75; 4.67685; 68; 5.47; 92.3605201; 75; 5.47; 92.1707009; 75; 
75; 4.67685; 62.5; 5.47; 84.767928; 75; 5.47; 84.5904625; 75; 4.67685; 68; 5.47; 92.3110808; 75; 5.47; 91.8209314; 75; 
76; 4.67685; 62.5; 5.47; 84.7216407; 75; 5.47; 84.5425595; 75; 4.67685; 68; 5.47; 92.2601071; 75; 5.47; 91.9119885; 75; 
77; 4.67685; 62.5; 5.47; 84.6739493; 75; 5.47; 84.1980193; 75.4989703; 4.67685; 68; 5.47; 92.2076103; 75; 5.47; 92.1551206; 75; 
78; 8.44520358; 62.5; 6.39766082; 73.6839524; 80; 10.6011956; 64.172533; 75; 8.44520358; 68; 6.39766082; 70.2767884; 80; 10.6011956; 91.963156; 75; 
79; 9.63314642; 62.5; 10.86; 53.6985881; 80; 9.0640222; 44.6608217; 77.927842; 9.63314642; 68; 10.86; 65.0942149; 80; 9.0640222; 74.064982; 75; 
80; 9.63314642; 62.5; 10.86; 44.6608217; 80; 10.6011956; 44.6608217; 79.0672942; 9.63314642; 68; 10.86; 64.9295805; 80; 10.6011956; 55.3258935; 80; 
81; 9.63314642; 62.5; 10.86; 47.2065651; 80; 10.6011956; 44.6608217; 79.029406; 9.63314642; 68; 10.86; 48.590974; 80; 10.6011956; 51.4262089; 80; 
82; 9.63314642; 62.5; 10.86; 47.181169; 80; 10.6011956; 71.4391823; 75; 9.63314642; 68; 10.86; 48.590974; 80; 10.6011956; 48.590974; 77.6876867; 
83; 8.23634019; 62.5; 9.2853; 65.6645797; 80; 10.6011956; 93.0409793; 75; 8.23634019; 68; 9.2853; 58.9970659; 80; 10.6011956; 48.590974; 80; 
84; 8.23634019; 62.5; 10.86; 79.3818896; 78.7574909; 9.0640222; 84.4395673; 75; 8.23634019; 68; 10.86; 77.6731928; 80; 9.0640222; 53.7847762; 75.8404411; 
85; 8.23634019; 62.5; 10.86; 62.5125956; 80; 10.6011956; 62.6079518; 75; 8.23634019; 68; 10.86; 80.1219842; 80; 10.6011956; 82.8678198; 75; 
86; 8.23634019; 62.5; 9.2853; 64.2359993; 80; 9.0640222; 52.4647837; 80; 8.23634019; 68; 9.2853; 65.730968; 80; 9.0640222; 77.4351843; 75; 
87; 13.32; 62.5; 9.2853; 60.0575309; 80; 10.6011956; 52.3869322; 80; 13.32; 68; 9.2853; 52.8784184; 80; 10.6011956; 70.0668293; 75; 
88; 13.32; 62.5; 10.86; 46.7901181; 80; 10.6011956; 44.6608217; 76.9958275; 13.32; 68; 10.86; 48.590974; 80; 10.6011956; 69.8525886; 80; 
89; 13.32; 62.5; 10.86; 46.7688765; 80; 10.6011956; 44.6608217; 78.8995803; 13.32; 68; 10.86; 48.590974; 80; 10.6011956; 48.590974; 76.6647994; 
90; 13.32; 62.5; 10.86; 44.6608217; 80; 10.6011956; 44.6608217; 80; 13.32; 68; 10.86; 48.590974; 80; 10.6011956; 48.590974; 80; 
91; 13.32; 62.5; 10.86; 56.0692469; 80; 10.6011956; 44.6608217; 80; 13.32; 68; 10.86; 58.3441357; 80; 10.6011956; 48.590974; 78.3153581; 
92; 13.32; 62.5; 10.86; 55.9554377; 80; 10.6011956; 44.6608217; 80; 13.32; 68; 10.86; 58.2468393; 80; 10.6011956; 48.590974; 80; 
93; 13.32; 62.5; 10.86; 44.6608217; 80; 10.6011956; 44.6608217; 77.9658306; 13.32; 68; 10.86; 55.1354221; 80; 10.6011956; 48.590974; 80; 
94; 13.32; 62.5; 10.86; 44.6608217; 80; 10.6011956; 44.6608217; 80; 13.32; 68; 10.86; 55.0701354; 80; 10.6011956; 48.590974; 78.0135843; 
95; 13.32; 62.5; 10.86; 44.6608217; 80; 10.6011956; 44.6608217; 78.2932058; 13.32; 68; 10.86; 48.590974; 80; 10.6011956; 48.590974; 80; 
96; 13.32; 62.5; 20.7; 69.491122; 78.4641624; 20.7; 65.610504; 75; 13.32; 68; 20.7; 72.2917295; 80; 20.7; 77.7258304; 75; 
