t; nomPriceB5; nomPlPowB5; disagg_price_bus5; PlPowB5; disaggT_in_B5;  initFeasThres; finalFeasThres; accept_gap; iterations; CPUmaster; CPUsubproblem; CPUfeasPt; finalDetectGap; nomCongestionCost; disaggCongestionCost; Objective; nomImprovPercent; CoopPotentialPercent; nominalCost; integratedCost
1; 13.32; 71; 10.52; 61.8386676; 80; 142; 15.5180862; 0.0001; 166; 5.60081235; 8.26103042; 0.375199092; 9.51391322e-05; 232380.919; 31740.635; 1816380.19; 15.1706144; 2141215.78; 
2; 13.32; 71; 16.12; 66.0938793; 80; 
3; 13.32; 71; 16.12; 70.7225624; 80; 
4; 13.32; 71; 16.12; 64.3762584; 80; 
5; 13.32; 71; 16.12; 61.5505608; 80; 
6; 13.32; 71; 16.12; 69.192811; 80; 
7; 13.32; 71; 16.12; 67.4697769; 80; 
8; 13.32; 71; 16.12; 69.4626828; 80; 
9; 13.32; 71; 19.7520216; 67.9220216; 80; 
10; 13.32; 71; 16.8879784; 50.7346935; 80; 
11; 39.15; 71; 30.1; 50.7346935; 80; 
12; 39.15; 71; 30.1; 50.7346935; 80; 
13; 39.15; 71; 30.1; 50.7346935; 80; 
14; 39.15; 71; 30.1; 50.7346935; 80; 
15; 36.65; 71; 30.1; 50.7346935; 80; 
16; 39.15; 71; 30.1; 50.7346935; 80; 
17; 39.15; 71; 30.1; 50.7346935; 80; 
18; 39.15; 71; 30.1; 50.7346935; 80; 
19; 39.15; 71; 30.1; 50.7346935; 80; 
20; 39.15; 71; 30.1; 50.7346935; 80; 
21; 39.15; 71; 30.1; 50.7346935; 80; 
22; 39.15; 71; 30.1; 50.7346935; 80; 
23; 39.15; 71; 30.1; 50.7346935; 80; 
24; 39.15; 71; 30.1; 50.7346935; 80; 
25; 255.566746; 71; 44.1608246; 50.7346935; 80; 
26; 255.566746; 71; 44.1608246; 50.7346935; 80; 
27; 218.509568; 71; 44.1608246; 50.7346935; 80; 
28; 255.566746; 71; 44.1608246; 50.7346935; 80; 
29; 255.566746; 71; 21.6772528; 50.7346935; 80; 
30; 25.0072091; 71; 21.6772528; 50.7346935; 80; 
31; 25.0072091; 71; 21.6772528; 50.7346935; 80; 
32; 25.0072091; 71; 21.6772528; 50.7346935; 80; 
33; 25.0072091; 71; 21.6772528; 50.7346935; 80; 
34; 25.0072091; 71; 21.6772528; 50.7346935; 80; 
35; 25.0072091; 71; 21.6772528; 50.7346935; 80; 
36; 25.0072091; 71; 21.6772528; 50.7346935; 80; 
37; 29.2481977; 71; 25.3535121; 50.7346935; 80; 
38; 29.2481977; 71; 25.3535121; 50.7346935; 80; 
39; 29.2481977; 71; 25.3535121; 50.7346935; 80; 
40; 29.2481977; 71; 25.3535121; 50.7346935; 80; 
41; 29.2481977; 71; 25.3535121; 50.7346935; 80; 
42; 29.2481977; 71; 25.3535121; 50.7346935; 80; 
43; 29.2481977; 71; 25.3535121; 50.7346935; 80; 
44; 29.2481977; 71; 21.6772528; 51.6378993; 80; 
45; 6.30720906; 71; 25.3535121; 68.1222246; 80; 
46; 5.47; 71; 9.52332978; 79.0058391; 80; 
47; 5.47; 71; 9.52332978; 79.649995; 79.7530874; 
48; 5.47; 71; 9.52332978; 89.6690968; 75.5517194; 
49; 5.47; 71; 11.1383974; 96.1259348; 75; 
50; 5.47; 71; 5.47; 97.56036; 75; 
51; 5.47; 71; 5.47; 97.4306606; 75; 
52; 5.47; 71; 5.47; 97.4382065; 75; 
53; 5.47; 71; 5.47; 97.4399623; 75; 
54; 5.47; 71; 5.47; 96.8529916; 75; 
55; 5.47; 71; 5.47; 97.1195808; 75; 
56; 5.47; 71; 5.47; 97.0880736; 75; 
57; 5.47; 71; 5.47; 96.6780146; 75; 
58; 5.47; 71; 5.47; 97.4390748; 75; 
59; 5.47; 71; 5.47; 97.1874456; 75; 
60; 5.47; 71; 5.47; 97.1085586; 75; 
61; 5.47; 71; 5.47; 97.4674684; 75; 
62; 5.47; 71; 5.47; 97.3208479; 75; 
63; 5.47; 71; 6.49340009; 97.2764634; 75; 
64; 5.47; 71; 6.49340009; 96.5626827; 75; 
65; 6.39766082; 71; 6.49340009; 96.8595327; 75; 
66; 6.39766082; 71; 6.49340009; 97.385519; 75; 
67; 6.39766082; 71; 6.49340009; 96.2013386; 75; 
68; 5.47; 71; 6.49340009; 96.7085343; 75; 
69; 5.47; 71; 6.49340009; 97.4966534; 75; 
70; 5.47; 71; 5.55185708; 96.8904319; 75.0842669; 
71; 5.47; 71; 5.55185708; 96.8548135; 75; 
72; 5.47; 71; 5.55185708; 96.8297815; 75; 
73; 5.47; 71; 5.55185708; 96.5646949; 75; 
74; 5.47; 71; 5.55185708; 96.4987336; 75; 
75; 5.47; 71; 5.55185708; 96.8174259; 75; 
76; 5.47; 71; 5.55185708; 96.9337872; 75; 
77; 8.07204466; 71; 16; 84.8769699; 80; 
78; 17.3550271; 71; 16; 66.8544966; 80; 
79; 17.3550271; 71; 16; 59.9777106; 75; 
80; 17.3550271; 71; 16; 55.4124518; 80; 
81; 17.3550271; 71; 16; 53.000448; 77.8603125; 
82; 17.3550271; 71; 16; 54.7417494; 78.3878318; 
83; 16; 71; 16; 61.430503; 77.6645696; 
84; 14.8385482; 71; 15.8568002; 87.3982445; 75; 
85; 14.8385482; 71; 13.68; 103.921117; 75; 
86; 14.8385482; 71; 13.68; 98.153544; 75; 
87; 14.8385482; 71; 16; 92.7773241; 75; 
88; 14.8385482; 71; 13.7031998; 81.8787755; 75; 
89; 14.8385482; 71; 16; 66.7579993; 75; 
90; 14.8385482; 71; 13.68; 61.6095839; 80; 
91; 17.3550271; 71; 16; 58.3692331; 80; 
92; 17.3550271; 71; 16; 52.1479004; 80; 
93; 17.3550271; 71; 16; 51.2300263; 80; 
94; 17.3550271; 71; 16; 53.0794677; 80; 
95; 17.3550271; 71; 16; 52.9366382; 77.9894808; 
96; 17.3550271; 71; 25.4; 77.4123419; 75; 
