congInd; nominalCost; DisCost; DisRelCostSav; 1stBus; nomECost; DR_Cost; DR_RelECostSav; disECost; disaggRelECostSav; 2ndBus; nomECost2; DR_Cost2; DR_RelECostSav2; disECost2; disaggRelECostSav2; 3rdBus; nomECost3; DR_Cost3; DR_RelECostSav3; disECost3; disaggRelECostSav3 
L; 2134644; 1818665; 14.80241; 5; 23175.6; 18186.97; 21.52533; 12538.35; 45.8985; 7; 11873.46; 10056.14; 15.3058; 10351.62; 12.81716; 8; 4591.032; 3602.797; 21.52533; 2485.522; 45.86137
s; 2134644; 1818627; 14.8042; 5; 23175.6; 18186.97; 21.52533; 12485.19; 46.12786; 7; 11873.46; 10056.14; 15.3058; 10292.77; 13.3128; 8; 4591.032; 3602.797; 21.52533; 2468.471; 46.23276
m; 2134644; 1818629; 14.8041; 5; 23175.6; 18186.97; 21.52533; 12478.04; 46.15869; 7; 11873.46; 10056.14; 15.3058; 10311.81; 13.15245; 8; 4591.032; 3602.797; 21.52533; 2477.323; 46.03995
