Revert "Merge branch 'master' of https://git.rwth-aachen.de/astro/astrotools"

This reverts commit b3d11b9c
4 jobs for revert-b3d11b9c in 1 minute and 55 seconds (queued for 2 seconds)
Status Job ID Name Coverage
  Lint
passed #158241
docker
Lint

00:01:33

 
  Unittest
failed #158242
docker
Unittest27

00:00:19

failed #158243
docker
Unittest35

00:00:21

 
  Coverage
skipped #158244
docker
Coverage
 
Name Stage Failure
failed
Unittest35 Unittest There is an unknown failure, please try again
  File "test/test_cosmic_rays.py", line 700, in test_23_cut_crs_shape_sets
self.assertTrue(crs.shape == (nsets, 70))
AssertionError: False is not true

----------------------------------------------------------------------
Ran 61 tests in 0.051s

FAILED (failures=1, skipped=3)
ERROR: Job failed: exit code 1
failed
Unittest27 Unittest There is an unknown failure, please try again
  File "test/test_cosmic_rays.py", line 700, in test_23_cut_crs_shape_sets
self.assertTrue(crs.shape == (nsets, 70))
AssertionError: False is not true

----------------------------------------------------------------------
Ran 61 tests in 0.053s

FAILED (failures=1, skipped=3)
ERROR: Job failed: exit code 1