{
    "name": "VL",
    "data": {
    "adjacency" :{
        "0":[1,2,3,4],
        "1":[5,6],
        "2":[6],
        "3":[4,6,7],
        "4":[7],
        "5":[6,8,11],
        "6":[9,11],
        "7":[9,10],
        "8":[11,12,13],
        "9":[11,14],
        "10":[14,15],
        "11":[],
        "12":[10,13],
        "13":[],
        "14":[11],
        "15":[13]
    },
"coordinates" : {
    "0":  [0, 30], 
    "1":  [ 2, 15], 
    "2":  [16, 30], 
     "3":  [18, 45],
     "4":  [ 6, 54],
     "5":  [18,  3],
     "6":  [30, 27],
     "7":  [32, 63],
     "8":  [40,  3],
     "9":  [32, 42],
     "10": [44, 57],
     "11": [38, 20],
     "12": [47, 33],
     "13": [54, 15],
     "14": [38, 41],
     "15": [56, 48]
    } 
}
}
