{
    "assembly": {
        "uuid": "kpi-edc67a42-c536-46f2-9afd-ecb8c3bc54e7",
        "properties": {
            "label": "scooter",
            "manufacturer": "FST",
            "comment": "Faster! Harder! Scooter!",
            "mass [g]": 67.19
        },
        "layer": "kpi-SYSTEM",
        "components": [
            {
                "component": {
                    "uuid": "kpi-07356edf-81cd-44d2-9db2-5a22216ddc2f",
                    "properties": {
                        "label": "scooter frame",
                        "item number": 3703,
                        "item description": "Technic, Brick 1 x 16 with Holes",
                        "category": "frame",
                        "price [Euro]": 0.07,
                        "mass [g]": 5.87,
                        "delivery time [days]": 5,
                        "data source": "https://www.bricklink.com/v2/catalog/catalogitem.page?P=3703#T=C",
                        "dimension [studs]": "1 x 16 x 1",
                        "color": "red"
                    },
                    "layer": "kpi-COMPONENT"
                }
            }
        ],
        "assemblies": [
            {
                "assembly": {
                    "uuid": "kpi-ad2bfe31-527e-4133-8622-251837d769cf",
                    "properties": {
                        "label": "front wheel assembly",
                        "assembly_method": "stick together like lego blocks",
                        "mass [g]": 30.66
                    },
                    "layer": "kpi-SUBASSEMBLY",
                    "components": [
                        {
                            "component": {
                                "uuid": "kpi-23fab959-fe61-4d26-b7f0-2f146e6365fa",
                                "properties": {
                                    "label": "front wheel",
                                    "item number": "2903c02",
                                    "item description": "wheel 81,6",
                                    "category": "wheel",
                                    "related items": 2902,
                                    "price [Euro]": 1.31,
                                    "mass [g]": 30.0,
                                    "delivery time [days]": 5,
                                    "data source": "https://www.bricklink.com/v2/catalog/catalogitem.page?P=2903c02#T=C",
                                    "diameter [mm]": 81.6,
                                    "surface": "rough",
                                    "paint": "glossy"
                                },
                                "layer": "kpi-COMPONENT"
                            }
                        },
                        {
                            "component": {
                                "uuid": "kpi-eed0c427-3758-48cf-a69a-302d43c0b137",
                                "properties": {
                                    "label": "front axle",
                                    "item number": 32073,
                                    "item description": "Axle 5 studs",
                                    "category": "axle",
                                    "price [Euro]": 0.001,
                                    "mass [g]": 0.66,
                                    "delivery time [days]": 3,
                                    "data source": "https://www.bricklink.com/v2/catalog/catalogitem.page?P=32073#T=S&O={%22iconly%22:0}",
                                    "dimension [studs]": 5,
                                    "color": "grey"
                                },
                                "layer": "kpi-COMPONENT"
                            }
                        }
                    ],
                    "assemblies": []
                }
            },
            {
                "assembly": {
                    "uuid": "kpi-77c72877-2ec0-4863-a342-4f4ac1d62311",
                    "properties": {
                        "label": "back wheel assembly",
                        "mass [g]": 30.66
                    },
                    "layer": "kpi-SUBASSEMBLY",
                    "components": [
                        {
                            "component": {
                                "uuid": "kpi-49c071dd-f2f5-4761-a8a4-ae96cc7b7a33",
                                "properties": {
                                    "label": "back wheel",
                                    "item number": "2903c02",
                                    "item description": "wheel 81,6",
                                    "category": "wheel",
                                    "related items": 2902,
                                    "price [Euro]": 1.31,
                                    "mass [g]": 30.0,
                                    "delivery time [days]": 5,
                                    "data source": "https://www.bricklink.com/v2/catalog/catalogitem.page?P=2903c02#T=C",
                                    "diameter [mm]": 81.6,
                                    "surface": "rough",
                                    "paint": "glossy"
                                },
                                "layer": "kpi-COMPONENT"
                            }
                        },
                        {
                            "component": {
                                "uuid": "kpi-a959b18d-0dc0-43e8-8de2-a79c4d4b7139",
                                "properties": {
                                    "label": "back axle",
                                    "item number": 32073,
                                    "item description": "Axle 5 studs",
                                    "category": "axle",
                                    "price [Euro]": 0.001,
                                    "mass [g]": 0.66,
                                    "delivery time [days]": 3,
                                    "data source": "https://www.bricklink.com/v2/catalog/catalogitem.page?P=32073#T=S&O={%22iconly%22:0}",
                                    "dimension [studs]": 5,
                                    "color": "grey"
                                },
                                "layer": "kpi-COMPONENT"
                            }
                        }
                    ],
                    "assemblies": []
                }
            }
        ]
    }
}