resource;count;mean;standard deviation
1;55;0.63;0.241
2;55;0.612;0.286
3;55;0.617;0.144
4;55;0.556;0.219
5;55;0.628;0.157
6;55;0.661;0.113
7;55;0.622;0.17
8;55;0.607;0.185
9;55;0.492;0.184
10;55;0.548;0.18
11;55;0.543;0.178
12;55;0.662;0.19
13;55;0.582;0.208
14;55;0.622;0.232
15;55;0.621;0.259
16;55;0.654;0.213
17;55;0.599;0.252
18;55;0.385;0.143
19;55;0.623;0.231
20;54;0.571;0.271
21;54;0.427;0.15
22;53;0.347;0.155
23;53;0.38;0.125
24;52;0.318;0.161
25;51;0.271;0.175
26;51;0.402;0.162
27;49;0.453;0.228
28;49;0.605;0.188
29;49;0.575;0.12
30;49;0.505;0.18
31;49;0.529;0.136
32;49;0.58;0.217
33;49;0.585;0.204
34;48;0.399;0.161
35;47;0.739;0.243
36;47;0.327;0.184
37;46;0.332;0.166
38;45;0.768;0.127
39;45;0.582;0.189
40;44;0.702;0.135
41;44;0.68;0.189
42;44;0.726;0.158
43;44;0.541;0.183
44;44;0.658;0.128
45;44;0.441;0.183
46;43;0.629;0.171
47;43;0.727;0.125
48;43;0.63;0.15
49;43;0.499;0.169
50;43;0.572;0.287
51;43;0.583;0.314
52;43;0.742;0.125
53;43;0.695;0.121
54;43;0.577;0.146
55;42;0.642;0.184
56;42;0.634;0.155
57;42;0.624;0.104
58;42;0.733;0.158
59;42;0.603;0.125
60;42;0.592;0.229
61;42;0.679;0.119
62;42;0.649;0.116
63;42;0.696;0.121
64;42;0.576;0.19
65;42;0.605;0.143
66;42;0.739;0.168
67;42;0.65;0.138
68;42;0.62;0.136
69;41;0.804;0.172
70;41;0.634;0.134
71;41;0.634;0.089
72;40;0.753;0.217
73;40;0.764;0.209
74;40;0.477;0.249
75;40;0.434;0.264
76;40;0.657;0.08
77;39;0.508;0.198
78;39;0.431;0.149
79;38;0.615;0.184
80;38;0.535;0.214
81;37;0.718;0.251
82;37;0.458;0.331
83;37;0.687;0.237
84;36;0.546;0.248
85;36;0.369;0.223
86;36;0.759;0.09
87;35;0.601;0.248
88;33;0.473;0.172
89;33;0.254;0.163
90;30;0.727;0.129
91;30;0.293;0.283
92;30;0.461;0.193
93;29;0.563;0.242
94;29;0.402;0.236
95;29;0.403;0.137
96;29;0.358;0.288
97;28;0.549;0.304
98;28;0.43;0.178
99;28;0.395;0.175
100;27;0.765;0.117
101;27;0.34;0.166
102;26;0.555;0.257
103;25;0.595;0.111
104;25;0.369;0.167
105;25;0.456;0.291
106;25;0.459;0.293
107;25;0.703;0.285
108;25;0.143;0.096
109;24;0.485;0.147
110;24;0.713;0.239
111;24;0.1;0.084
112;24;0.508;0.162
113;23;0.229;0.277
114;23;0.223;0.268
115;21;0.886;0.193
116;20;0.497;0.144
117;19;0.737;0.319
118;19;0.131;0.12
119;18;0.222;0.206
120;18;0.741;0.105
121;18;0.326;0.126
122;18;0.377;0.201
123;18;0.226;0.239
124;17;0.221;0.241
125;17;0.604;0.219
126;17;0.738;0.121
127;17;0.536;0.191
128;17;0.389;0.197
129;17;0.701;0.316
130;16;0.421;0.205
131;15;0.44;0.114
132;15;0.301;0.331
133;15;0.092;0.122
134;15;0.403;0.098
135;14;0.418;0.129
136;13;0.45;0.111
137;13;0.342;0.401
138;13;0.053;0.041
139;13;0.385;0.101
140;12;0.381;0.121
141;12;0.229;0.08
142;12;0.363;0.097
143;12;0.681;0.288
144;12;0.258;0.262
145;10;0.427;0.109
146;10;0.058;0.049
147;10;0.394;0.376
148;9;0.381;0.27
149;9;0.32;0.304
150;9;0.647;0.221
151;9;0.422;0.149
152;9;0.165;0.317
153;9;0.356;0.218
154;9;0.295;0.249
155;8;0.251;0.272
156;8;0.881;0.221
157;7;0.053;0.023
158;7;0.36;0.299
159;7;0.622;0.315
160;7;0.218;0.201
161;6;0.378;0.312
162;6;0.556;0.356
163;6;0.706;0.205
164;6;0.666;0.184
165;6;0.61;0.208
166;6;0.104;0.069
167;6;0.367;0.383
168;6;-0.147;0.659
169;6;0.635;0.043
170;5;0.285;0.4
171;5;0.262;0.163
172;5;0.2;0.173
173;4;0.592;0.132
174;4;0.058;0.026
175;4;0.227;0.213
176;4;0.885;0.132
177;4;0.379;0.436
178;3;0.559;0.162
179;3;0.065;0.037
180;3;0.409;0.516
181;3;0.212;0.122
182;3;0.351;0.258
183;3;1;0
184;3;1;0
185;3;0.076;0.031
186;3;0.395;0.158
187;3;0.516;0.293
188;2;0.548;0.64
189;2;0.35;0.212
190;2;0.3;0.283
191;2;0.048;0.025
192;2;0.253;0.076
193;2;0.258;0.107
194;2;0.512;0.69
195;2;0.517;0.682
196;2;0.25;0.212
197;2;0.754;0.337
198;2;0.471;0.072
199;2;0.863;0.194
200;2;0.556;0.03
201;2;0.147;0.017
202;2;0.145;0.077
203;2;0.269;0.298
204;2;1;0
205;2;1;0
206;2;0.727;0.386
207;2;0.563;0.159
208;2;0.442;0.246
209;2;0.402;0.367
210;2;0.655;0.014
211;2;0.493;0.717
212;2;-0.058;0.076
213;2;0.738;0.37
214;1;0.091;
215;1;0.25;
216;1;0.167;
217;1;1;
218;1;0.167;
219;1;0.074;
220;1;0.2;
221;1;0.147;
222;1;1;
223;1;0.189;
224;1;0.327;
225;1;0.297;
226;1;0.569;
