{
  "name": "Web Form-Generator Devcontainer",
  "dockerComposeFile": ["compose.yml"],
  "service": "app",
  "workspaceFolder": "/workspace/app",
  "updateRemoteUserUID": false,
  "remoteUser": "node",
  "containerUser": "node"
}
