<?xml version="1.0" encoding="UTF-8" standalone="no"?>
<!-- Generator: Adobe Illustrator 23.0.3, SVG Export Plug-In . SVG Version: 6.00 Build 0)  -->

<svg
   version="1.1"
   id="Ebene_1"
   x="0px"
   y="0px"
   viewBox="0 0 3000 3000"
   style="enable-background:new 0 0 3000 3000;"
   xml:space="preserve"
   sodipodi:docname="AIMS_Logo_3_SVG_resaved.svg"
   inkscape:version="1.1 (c68e22c387, 2021-05-23)"
   xmlns:inkscape="http://www.inkscape.org/namespaces/inkscape"
   xmlns:sodipodi="http://sodipodi.sourceforge.net/DTD/sodipodi-0.dtd"
   xmlns="http://www.w3.org/2000/svg"
   xmlns:svg="http://www.w3.org/2000/svg"><defs
   id="defs49" /><sodipodi:namedview
   id="namedview47"
   pagecolor="#ffffff"
   bordercolor="#666666"
   borderopacity="1.0"
   inkscape:pageshadow="2"
   inkscape:pageopacity="0.0"
   inkscape:pagecheckerboard="0"
   showgrid="false"
   inkscape:zoom="0.26966667"
   inkscape:cx="1503.7083"
   inkscape:cy="1500"
   inkscape:window-width="1920"
   inkscape:window-height="1017"
   inkscape:window-x="-8"
   inkscape:window-y="-8"
   inkscape:window-maximized="1"
   inkscape:current-layer="Ebene_1" />
<style
   type="text/css"
   id="style30">
	.st0{display:none;fill:#0C0C0C;}
	.st1{fill:#0C0C0C;}
</style>
<rect
   x="-49"
   y="-49"
   class="st0"
   width="3097"
   height="3081"
   id="rect32" />
<g
   id="g44"
   transform="matrix(1.8692047,0,0,1.8692047,-1321.0327,-1351.8285)">
	<path
   class="st1"
   d="m 1828.03,1564.1 -133.1,83.76 c -3.62,-3.84 -7.38,-7.54 -11.28,-11.1 -37.44,-34.17 -87.28,-55.02 -142,-55.02 -1.85,0 -3.68,0.02 -5.51,0.08 -36.85,0.81 -73.97,11.34 -107.4,32.48 -89.07,56.3 -121.39,168.48 -80.19,262.09 20.91,47.81 59.09,86.33 106.66,107.75 L 1431,2090.3 c -30.46,-0.7 -61.16,10.56 -84.41,33.83 -45.11,45.13 -45.12,118.24 -0.04,163.32 45.09,45.07 118.21,45.03 163.32,-0.1 45.11,-45.13 45.12,-118.24 0.04,-163.32 -10.46,-10.46 -22.44,-18.48 -35.23,-24.08 l 23.23,-101.87 c 14.12,2.98 28.74,4.58 43.75,4.58 116.33,0 210.62,-94.21 210.62,-210.46 0,-21.85 -3.33,-42.93 -9.51,-62.75 -1.52,-4.86 -3.21,-9.65 -5.06,-14.37 l 132.59,-83.42 c -17.65,-20.47 -31.8,-43.29 -42.27,-67.56 z m -86.12,165.9 c -0.04,-0.13 -0.08,-0.28 -0.12,-0.42 0.04,0.14 0.09,0.27 0.12,0.42 l 0.43,-0.27 -0.41,0.27 z m 0.02,-0.02 0.43,-0.26 -0.02,0.01 -0.42,0.26 c -0.05,-0.16 -0.1,-0.31 -0.15,-0.47 -0.04,-0.12 -0.07,-0.24 -0.1,-0.36 0.1,0.27 0.18,0.56 0.26,0.82 z"
   id="path34" />
	<path
   class="st1"
   d="m 1353.97,1413.71 59.05,156.21 c 17.14,-10.83 41.95,-22.59 74.46,-28.35 l -59.13,-156.4 c 47.53,-29.55 83.26,-77.87 95.27,-137.07 16.76,-82.63 -17.29,-163.74 -80.66,-210.94 l 38.26,-67.83 c 29,9.37 61.63,7.33 90.56,-8.33 56.11,-30.38 77,-100.45 46.64,-156.51 -30.35,-56.07 -100.44,-76.89 -156.55,-46.52 -56.11,30.38 -76.99,100.45 -46.64,156.51 7.04,13.01 16.23,24.12 26.89,33.14 l -37.68,66.8 c -14.18,-6.43 -29.29,-11.37 -45.19,-14.6 -74.38,-15.09 -147.56,11.1 -195.83,62.83 L 989.96,927.09 c 16.06,-32.24 19.44,-70.74 6.24,-107.3 -25.61,-70.93 -103.82,-107.7 -174.69,-82.11 -70.88,25.58 -107.57,103.83 -81.97,174.76 25.6,70.93 103.82,107.7 174.69,82.11 16.45,-5.94 31.05,-14.72 43.47,-25.58 l 174.79,136.59 c -9.78,17.99 -17.09,37.72 -21.37,58.84 -9.91,48.83 -2.06,97.14 19.1,138.23 l -116.54,71.12 c -20.75,-22.32 -50.24,-36.45 -83.12,-36.88 -63.8,-0.84 -116.2,50.16 -117.03,113.91 -0.84,63.75 50.21,116.1 114.01,116.94 63.8,0.84 116.2,-50.16 117.03,-113.91 0.19,-14.8 -2.41,-28.97 -7.32,-42.04 l 117.55,-71.73 c 29.63,36.11 71.38,62.63 120.71,72.64 26.66,5.4 53.18,5.51 78.46,1.03 z"
   id="path36" />
	<polygon
   class="st1"
   points="1726.01,1616.32 1726.02,1616.32 "
   id="polygon38" />
	<path
   class="st1"
   d="m 2182.22,1281.3 c -76.85,-48.64 -173.16,-41.24 -241.13,11.38 -18.58,15.24 -54.51,50.14 -72.28,104.01 l 0.16,0.12 c -12.58,40.61 -12.26,83.46 -0.3,122.99 10.59,35 30.29,67.38 58.23,93.24 9.27,8.58 19.45,16.44 30.49,23.42 98.09,62.1 227.92,32.91 289.99,-65.17 62.08,-98.07 32.93,-227.91 -65.16,-289.99 z m -112.35,334.41 c -84.09,0 -152.36,-68.28 -152.36,-152.36 0,-84.11 68.28,-152.28 152.36,-152.28 84.11,0 152.28,68.17 152.28,152.28 0.01,84.08 -68.17,152.36 -152.28,152.36 z"
   id="path40" />
	<path
   class="st1"
   d="m 2069.24,1359.56 c -55.65,0 -100.76,45.02 -100.76,100.66 0,55.65 45.1,100.78 100.76,100.78 55.55,0 100.65,-45.12 100.65,-100.78 0.01,-55.64 -45.1,-100.66 -100.65,-100.66 z m 2.2,153.38 c -27.09,0 -48.97,-21.87 -48.97,-48.97 0,-26.99 21.87,-48.86 48.97,-48.86 26.99,0 48.86,21.87 48.86,48.86 0,27.1 -21.87,48.97 -48.86,48.97 z"
   id="path42" />
</g>
</svg>
